{"text_format":"3","workbook":"xlsx","n_sheets":4,"sheets":["Calcul","cas par cas","hypothèses","table"],"not_rendered":{"macros":1,"defined_names":56},"read":"whole","date_system":"1900"}

{"sheet":"Calcul","index":0,"n_rows":50,"n_cols":32,"rows_kept":50,"merged":[[1,12,1,20],[1,21,1,29]]}
["Année de calcul",2013,null,"temps début","10:48:37",{"$nulls":4},{"$f":"SUM(J4:J100)","v":0},{"$f":"SUM(K4:K100)","v":0},{"$f":"SUM(L4:L100)","v":0},{"$f":"SUM(M4:M100)","v":0},{"$f":"SUM(N4:N100)","v":0},{"$f":"SUM(O4:O100)","v":0},{"$f":"SUM(P4:P100)","v":0},{"$f":"SUM(Q4:Q100)","v":0},{"$f":"SUM(R4:R100)","v":0},{"$f":"SUM(S4:S100)","v":0},{"$f":"SUM(T4:T100)","v":0},{"$f":"SUM(U4:U100)","v":0},{"$f":"SUM(V4:V100)","v":0},{"$f":"SUM(W4:W100)","v":0},{"$f":"SUM(X4:X100)","v":0},{"$f":"SUM(Y4:Y100)","v":0},{"$f":"SUM(Z4:Z100)","v":0},{"$f":"SUM(AA4:AA100)","v":0},{"$f":"SUM(AB4:AB100)","v":0},{"$f":"SUM(AC4:AC100)","v":0},{"$f":"SUM(AD4:AD100)","v":0},{"$f":"SUM(AE4:AE100)","v":0},{"$f":"SUM(AF4:AF100)","v":0}]
[{"$nulls":3},"temps fin","16:42:13",{"$nulls":7},"Non revalo",{"$nulls":8},"Revalo"]
["Num_rentier","Rentier","date naissance","date d'effet","date de fin","revalo_rentier","Type_rente","Annuité","Limite","Age","duree effectuée","duree restante","Arrérages versés","Partie réelle","Partie estimée","BE PM ","BE partie réelle","BE partie estimée","Coût total ","coût partie réelle","coût partie estimée","Arrérages versés 1","Partie réelle 1","Partie estimée 1","BE PM 1","BE partie réelle 1","BE partie estimée 1","Coût total 1","coût partie réelle 1","coût partie estimée 1","P.décès theorique non revalo","P.décès theorique revalo"]
["Filia-MAIF_S_212","Filia-MAIF_S_212_T","07/01/1999","10/01/2007","30/06/2009","Oui","TEMPORAIRE",{"v":29736,"d":"29,736 "},{"$f":"IF(G4=\"VIAGERE\",117,VALUE(RIGHT(E4,4))-VALUE(RIGHT(C4,4)))","v":{"v":10,"d":"10 "}}]
["MAIF_S_3491","MAIF_S_3491_T","24/02/2007","07/01/2011","24/02/2017","Non","TEMPORAIRE",{"v":10949,"d":"10,949 "},{"v":10,"d":"10 "}]
["MATMUT_S_166","MATMUT_S_166_T","01/11/1998","01/09/2007","31/12/2008","Non","TEMPORAIRE",{"v":218614,"d":"218,614 "},{"v":10,"d":"10 "}]
["Macif_S_3343","Macif_S_3343_T","31/01/1984","01/01/1989","31/01/1996","Oui","TEMPORAIRE",{"v":23782.059999999998,"d":"23,782 "},{"v":12,"d":"12 "}]
["Filia-MAIF_S_245","Filia-MAIF_S_245_T","14/10/2004","04/01/2010","30/06/2016","Oui","TEMPORAIRE",{"v":7560,"d":"7,560 "},{"v":12,"d":"12 "}]
["MATMUT_S_77","MATMUT_S_77_T","08/10/1989","01/01/1998","31/12/2001","Non","TEMPORAIRE",{"v":56978.8,"d":"56,979 "},{"v":12,"d":"12 "}]
["Macif_S_3039","Macif_S_3039_T","14/03/1983","01/01/1993","14/03/1996","Non","Viagere",{"v":19890.03,"d":"19,890 "},{"v":117,"d":"117 "}]
["MAIF_S_3120","MAIF_S_3120_T","20/11/1994","31/12/2005","08/01/2007","Oui","TEMPORAIRE",{"v":116493,"d":"116,493 "},{"v":13,"d":"13 "}]
["MAIF_S_3347","MAIF_S_3347_T","08/11/2001","07/01/2009","31/12/2014","Oui","TEMPORAIRE",{"v":9464,"d":"9,464 "},{"v":13,"d":"13 "}]
["MATMUT_S_117","MATMUT_S_117_T","27/04/1997","01/04/2009","31/12/2010","Non","TEMPORAIRE",{"v":49230,"d":"49,230 "},{"v":13,"d":"13 "}]
["MATMUT_S_162","MATMUT_S_162_T","11/08/1994","01/01/2006","11/08/2008","Non","viagere",{"v":70008,"d":"70,008 "},{"v":117,"d":"117 "}]
["Macif_S_362","Macif_S_362_T","31/01/2000","02/02/2007","31/01/2015","Oui","TEMPORAIRE",{"v":23820,"d":"23,820 "},{"v":15,"d":"15 "}]
["Macif_S_981","Macif_S_981_T","25/10/2000","19/05/2010","25/10/2015","Non","TEMPORAIRE",{"v":26017,"d":"26,017 "},{"v":15,"d":"15 "}]
["MATMUT_S_116","MATMUT_S_116_T","02/10/1996","01/01/2009","31/12/2011","Non","TEMPORAIRE",{"v":8760,"d":"8,760 "},{"v":15,"d":"15 "}]
["MATMUT_S_153","MATMUT_S_153_T","28/03/1995","01/01/2007","31/03/2010","Non","TEMPORAIRE",{"v":17856,"d":"17,856 "},{"v":15,"d":"15 "}]
["MATMUT_S_78","MATMUT_S_78_T","11/10/1992","01/01/2006","11/10/2007","Non","TEMPORAIRE",{"v":20924.12,"d":"20,924 "},{"v":15,"d":"15 "}]
["Macif_S_1949","Macif_S_1949_T","17/07/1999","03/07/2008","17/07/2015","Oui","TEMPORAIRE",{"v":3600,"d":"3,600 "},{"v":16,"d":"16 "}]
{"$rows_left_out":31}
{"sheet":"cas par cas","index":1,"n_rows":137,"n_cols":37,"rows_kept":137}
[4,"Date Calcul","2013-12-31",{"$f":"annee_cal","v":2013},{"$f":"12+ N(\"mois_calcul\")","v":12}]
[null,"date naissance",{"$f":"INDEX(Calcul!$C$4:$C$100,'cas par cas'!$E$19,0)","v":"08/10/1989"},{"$f":"VALUE(RIGHT(C2,4))","v":1989},{"$f":"VALUE(MID(C2,4,2))+N(\"mois_naissance\")","v":10}]
[null,"date d'effet",{"$f":"INDEX(Calcul!$D$4:$D$100,num_ligne,0)","v":"01/01/1998"},{"$f":"VALUE(RIGHT(C3,4))","v":1998},{"$f":"VALUE(MID(C3,4,2))+N(\"mois_effet\")","v":1}]
[null,"date de fin",{"$f":"IF(INDEX(Calcul!$E$4:$E$100,num_ligne,0)=0,\"\",INDEX(Calcul!$E$4:$E$100,num_ligne,0))","v":"31/12/2001"},{"$f":"IF(C4=\"\",0,VALUE(RIGHT(C4,4)))","v":2001},{"$f":"IF(C4=\"\",0,VALUE(MID(C4,4,2)))+N(\"mois_fin\")","v":12}]
[null,"Limite",{"$f":"IF(Type_rente=\"viagere\",117,D4-D2)","v":12},{"$nulls":15}," A -Avec revalo"]
[null,"Type_rente",{"$f":"INDEX(Calcul!$G$4:$G$100,num_ligne,0)","v":"TEMPORAIRE"},null,"Non Rev","Résultat",{"$nulls":13},"Revalo","Résultat"]
[null,"revalo_rentier",{"$f":"INDEX(Calcul!$F$4:$F$100,num_ligne,0)","v":"Non"},null,"Arrérages versés",{"$f":"-F26","v":{"v":-430927.73707287206,"d":"-430,928"}},{"$nulls":13},"Arrérages versés",{"$f":"-U26","v":{"v":-450760.7301996057,"d":"-450,761"}}]
[null,"Annuité",{"$f":"INDEX(Calcul!$H$4:$H$100,num_ligne,0)","v":{"v":56978.8,"d":"56,979"}},null,"Arrérage Partie réelle",{"$f":"-F27","v":{"v":-430927.73707287206,"d":"-430,928"}},{"$nulls":13},"Arrérage Partie réelle",{"$f":"-U27","v":{"v":-450760.7301996057,"d":"-450,761"}}]
[null,"60%*TME",{"$f":"60%*hypothèses!C6","v":{"v":0.01188,"d":"1.19%"}},null,"Arrérage partie estimée",{"$f":"-F28","v":0},{"$nulls":13},"Arrérage partie estimée",0]
[null,"60%*TME reva",{"$f":"(1+$C$9)/(1+reval_reel)-1","v":{"v":-0.010386308068459749,"d":"-1.04%"}},null,"BE PM",{"$f":"-I26-Q26","v":{"v":-427500.4151991403,"d":"-427,500"}},{"$nulls":13},"BE PM",{"$f":"-X26-AF26","v":{"v":-446934.7812759795,"d":"-446,935"}}]
[null,"reval_reel ",{"$f":"reval_reel","v":{"v":0.0225,"d":"2.25%"}},null,"BE Partie réelle",{"$f":"-I27-Q27","v":{"v":-427500.4151991403,"d":"-427,500"}},{"$nulls":13},"BE Partie réelle",{"$f":"-X27-AF27","v":{"v":-446934.7812759795,"d":"-446,935"}}]
[null,"revalo_corp",{"$f":"revalo_corp","v":{"v":0.03,"d":"3.00%"}},null,"BE partie estimée",{"$f":"-I28-Q28","v":0},{"$nulls":13},"BE partie estimée",{"$f":"-X28-AF28","v":0}]
[null,"reval_corp _prov",{"v":0.02,"d":"2%"},null,"Coût total",{"$f":"-O26-Q26","v":{"v":-427500.4151991403,"d":"-427,500"}},{"$nulls":13},"Coût total",{"$f":"-AD26-AF26","v":{"v":-446934.78127597936,"d":"-446,935"}}]
[" A - Pas de revalo",{"$nulls":3},"Coût Partie réelle",{"$f":"-O27-Q27","v":{"v":-427500.4151991403,"d":"-427,500"}},{"$nulls":13},"Coût Partie réelle",{"$f":"-AD27-AF27","v":{"v":-446934.78127597936,"d":"-446,935"}}]
[{"$nulls":4},"Coût partie estimée",{"$f":"-O28-Q28","v":0},{"$nulls":13},"Coût partie estimée",0]
["Proba décès thérique non revalo"]
[{"$f":"IF(ISERROR(VLOOKUP($D$1-$D$2,table_nonRev,5,0)/VLOOKUP($D$3-$D$2,table_nonRev,5,0)),0,VLOOKUP($D$1-$D$2,table_nonRev,5,0)/VLOOKUP($D$3-$D$2,table_nonRev,5,0))","v":{"v":0,"d":"0.00"}},{"$nulls":3},"Num_rentier","Age","Arrérage_cal","duree effectuée","duree restante"]
[{"$nulls":4},"MATMUT_S_77_T",{"$f":"annee_effet-annee_naiss","v":9},{"$f":"Annuite_ini*(1+revalo_corp)^(Annee-annee_effet-1)","v":{"v":86185.54741457441,"d":"86,186"}},{"$f":"IF(OR($C$4=\"\",annee_fin>Annee),Annee-annee_effet+1,annee_fin-annee_effet+1)","v":4},{"$f":"IF(annee_fin=0,120,IF(ABS(annee_fin)<Annee,0,annee_fin-Annee))","v":0}]
["Proba décès thérique revalo",{"$nulls":3},{"$f":"MATCH(exemple,Calcul!$B$4:$B$100,0)","v":6}]
[{"$f":"IF(ISERROR(VLOOKUP($D$1-$D$2,table_revalo,5,0)/VLOOKUP($D$3-$D$2,table_revalo,5,0)),0,VLOOKUP($D$1-$D$2,table_revalo,5,0)/VLOOKUP($D$3-$D$2,table_revalo,5,0))","v":{"v":0,"d":"0.00"}},{"$nulls":4},"Pas revalo",null,null,"Pas revalo",{"$nulls":11},"Avec revalo",null,null,"Avec revalo"]
{"$rows_left_out":118}
{"sheet":"hypothèses","index":2,"n_rows":18,"n_cols":3,"rows_kept":18}
[]
[null,"Date de calcul :","2013-12-31"]
[]
[null,"Table de mortalité :","TD 88-90"]
[]
[null,"TME :",{"v":0.0198,"d":"1.98%"}]
[]
[null,"Taux de revalorisation réel :",{"v":0.0225,"d":"2.25%"}]
[]
[null,"Taux de revalorisation corp :",{"v":0.03,"d":"3.00%"}]
[]
[null,"Taux de frais :",{"v":0.015,"d":"1.50%"}]
[]
[null,"Taux de produit financier :",{"$f":"table!B1","v":{"v":0.01188,"d":"1.19%"}}]
[]
[null,"Taux de SCR / PM NF :",{"v":0.05,"d":"5%"}]
[]
[null,"Marge de risque :",{"v":0.06,"d":"6%"}]

{"sheet":"table","index":3,"n_rows":195,"n_cols":12,"rows_kept":195,"merged":[[2,0,2,4],[2,6,2,10]]}
["Taux technique",{"$f":"60%*hypothèses!C6","v":{"v":0.01188,"d":"1.19%"}},null,null,"Limite",null,"Taux technique",{"$f":"(1+B1)/(1+hypothèses!C8)-1","v":{"v":-0.010386308068459749,"d":"-1.04%"}},null,null,{"$f":"E1","v":"Limite"},"Viagere"]
["Table","TD 88/90",null,{"$f":"IF(Type_rente=\"VIAGERE\",117,'cas par cas'!$D$4-'cas par cas'!$D$2)","v":12},10,null,"Table","TD 88/90",null,null,{"$f":"E2","v":10}]
["RENTES VIAGERES NON REVALORISABLES",{"$nulls":5},"RENTES VIAGERES REVALORISABLES"]
["Age","Lx","Dx","NX","P€R",null,"Age","Lx","Dx","NX","P€R"]
[0,{"v":100000,"d":"100,000"},{"$f":"B5/(1+$B$1)^A5","v":{"v":100000,"d":"100,000"}},{"$f":"SUM(C5:$C$125)","v":{"v":4838151.996336227,"d":"4,838,152"}},{"$f":"MAX(0,IF(OR(C5=0,D6=0),1,(D6-VLOOKUP($E$2+1,$A$6:$D$124,4,0))/C5))","v":{"v":9.278551412003566,"d":"9.279"}},null,0,{"v":100000,"d":"100,000"},{"$f":"H5/(1+$H$1)^G5","v":{"v":100000,"d":"100,000"}},{"$f":"SUM($I5:I$125)","v":{"v":11196949.949710652,"d":"11,196,950"}},{"$f":"MAX(0,IF(OR(I5=0,J6=0),1,(J6-VLOOKUP($K$2+1,$G$6:$J$124,4,0))/I5))","v":{"v":10.484534481538832,"d":"10.485"}}]
[1,{"v":99129,"d":"99,129"},{"$f":"B6/(1+$B$1)^A6","v":{"v":97965.17373601614,"d":"97,965"}},{"$f":"SUM(C6:$C$125)","v":{"v":4738151.996336227,"d":"4,738,152"}},{"$f":"MAX(0,IF(OR(C6=0,D7=0),1,(D7-VLOOKUP($E$2+1,$A$6:$D$124,4,0))/C6))","v":{"v":8.471275411613309,"d":"8.471"}},null,1,{"v":99129,"d":"99,129"},{"v":100169.3901450765,"d":"100,169"},{"$f":"SUM($I6:I$125)","v":{"v":11096949.949710652,"d":"11,096,950"}},{"$f":"MAX(0,IF(OR(I6=0,J7=0),1,(J7-VLOOKUP($K$2+1,$G$6:$J$124,4,0))/I6))","v":{"v":9.466804745795057,"d":"9.467"}}]
[2,{"v":99057,"d":"99,057"},{"v":96744.6921113598,"d":"96,745"},{"$f":"SUM(C7:$C$125)","v":{"v":4640186.82260021,"d":"4,640,187"}},{"v":7.578144695618845,"d":"7.578"},null,2,{"v":99057,"d":"99,057"},{"v":101147.18025675236,"d":"101,147"},{"$f":"SUM($I7:I$125)","v":{"v":10996780.559565576,"d":"10,996,781"}},{"v":8.375289114354738,"d":"8.375"}]
[3,{"v":99010,"d":"99,010"},{"v":95563.49492233217,"d":"95,563"},{"$f":"SUM(C8:$C$125)","v":{"v":4543442.13048885,"d":"4,543,442"}},{"v":6.671813132711746,"d":"6.672"},null,3,{"v":99010,"d":"99,010"},{"v":102160.25641543724,"d":"102,160"},{"$f":"SUM($I8:I$125)","v":{"v":10895633.379308823,"d":"10,895,633"}},{"v":7.292235233897128,"d":"7.292"}]
[4,{"v":98997,"d":"98,997"},{"v":94429.12939083327,"d":"94,429"},{"$f":"SUM(C9:$C$125)","v":{"v":4447878.635566519,"d":"4,447,879"}},{"v":5.751960804295435,"d":"5.752"},null,4,{"v":98997,"d":"98,997"},{"v":103218.90614489382,"d":"103,219"},{"$f":"SUM($I9:I$125)","v":{"v":10793473.122893386,"d":"10,793,473"}},{"v":6.217443481631677,"d":"6.217"}]
[5,{"v":98948,"d":"98,948"},{"v":93274.29173874117,"d":"93,274"},{"$f":"SUM(C10:$C$125)","v":{"v":4353449.506175686,"d":"4,353,450"}},{"v":4.823176364192294,"d":"4.823"},null,5,{"v":98948,"d":"98,948"},{"v":104250.59524984077,"d":"104,251"},{"$f":"SUM($I10:I$125)","v":{"v":10690254.21674849,"d":"10,690,254"}},{"v":5.155914157168362,"d":"5.156"}]
[6,{"v":98921,"d":"98,921"},{"v":92154.0498151078,"d":"92,154"},{"$f":"SUM(C11:$C$125)","v":{"v":4260175.214436944,"d":"4,260,175"}},{"v":3.8818078012163375,"d":"3.882"},null,6,{"v":98921,"d":"98,921"},{"v":105315.99267192656,"d":"105,316"},{"$f":"SUM($I11:I$125)","v":{"v":10586003.621498652,"d":"10,586,004"}},{"v":4.103755909288048,"d":"4.104"}]
[7,{"v":98897,"d":"98,897"},{"v":91050.01739137988,"d":"91,050"},{"$f":"SUM(C12:$C$125)","v":{"v":4168021.164621835,"d":"4,168,021"}},{"v":2.928876893546116,"d":"2.929"},null,7,{"v":98897,"d":"98,897"},{"v":106395.49754719797,"d":"106,395"},{"$f":"SUM($I12:I$125)","v":{"v":10480687.628826724,"d":"10,480,688"}},{"v":3.0621185786384566,"d":"3.062"}]
[8,{"v":98876,"d":"98,876"},{"v":89961.93583864727,"d":"89,962"},{"$f":"SUM(C13:$C$125)","v":{"v":4076971.147230455,"d":"4,076,971"}},{"v":1.9643013971251435,"d":"1.964"},null,8,{"v":98876,"d":"98,876"},{"v":107489.32251797065,"d":"107,489"},{"$f":"SUM($I13:I$125)","v":{"v":10374292.131279526,"d":"10,374,292"}},{"v":2.0309580718428015,"d":"2.031"}]
[9,{"v":98855,"d":"98,855"},{"v":88886.85325539076,"d":"88,887"},{"$f":"SUM(C14:$C$125)","v":{"v":3987009.211391808,"d":"3,987,009"}},{"v":0.9880595361859079,"d":"0.988"},null,9,{"v":98855,"d":"98,855"},{"v":108594.38792574106,"d":"108,594"},{"$f":"SUM($I14:I$125)","v":{"v":10266802.808761556,"d":"10,266,803"}},{"v":1.0102908757500964,"d":"1.010"}]
[10,{"v":98835,"d":"98,835"},{"v":87825.50300054636,"d":"87,826"},{"$f":"SUM(C15:$C$125)","v":{"v":3898122.358136417,"d":"3,898,122"}},{"v":0,"d":"0.000"},null,10,{"v":98835,"d":"98,835"},{"v":109711.91927904218,"d":"109,712"},{"$f":"SUM($I15:I$125)","v":{"v":10158208.420835812,"d":"10,158,208"}},{"v":0,"d":"0.000"}]
[11,{"v":98814,"d":"98,814"},{"v":86775.94403203845,"d":"86,776"},{"$f":"SUM(C16:$C$125)","v":{"v":3810296.8551358706,"d":"3,810,297"}},{"v":0,"d":"0.000"},null,11,{"v":98814,"d":"98,814"},{"v":110839.82476824247,"d":"110,840"},{"$f":"SUM($I16:I$125)","v":{"v":10048496.501556769,"d":"10,048,497"}},{"v":0,"d":"0.000"}]
[12,{"v":98793,"d":"98,793"},{"v":85738.92394911265,"d":"85,739"},{"$f":"SUM(C17:$C$125)","v":{"v":3723520.911103832,"d":"3,723,521"}},{"v":0,"d":"0.000"},null,12,{"v":98793,"d":"98,793"},{"v":111979.32075670947,"d":"111,979"},{"$f":"SUM($I17:I$125)","v":{"v":9937656.676788526,"d":"9,937,657"}},{"v":0,"d":"0.000"}]
[13,{"v":98771,"d":"98,771"},{"v":84713.4353215214,"d":"84,713"},{"$f":"SUM(C18:$C$125)","v":{"v":3637781.987154719,"d":"3,637,782"}},{"v":0,"d":"0.000"},null,13,{"v":98771,"d":"98,771"},{"v":113129.38092527691,"d":"113,129"},{"$f":"SUM($I18:I$125)","v":{"v":9825677.356031816,"d":"9,825,677"}},{"v":0,"d":"0.000"}]
[14,{"v":98745,"d":"98,745"},{"v":83696.81757403094,"d":"83,697"},{"$f":"SUM(C19:$C$125)","v":{"v":3553068.551833197,"d":"3,553,069"}},{"v":0,"d":"0.000"},null,14,{"v":98745,"d":"98,745"},{"v":114286.61731005945,"d":"114,287"},{"$f":"SUM($I19:I$125)","v":{"v":9712547.97510654,"d":"9,712,548"}},{"v":0,"d":"0.000"}]
[15,{"v":98712,"d":"98,712"},{"v":82686.5306047766,"d":"82,687"},{"$f":"SUM(C20:$C$125)","v":{"v":3469371.7342591663,"d":"3,469,372"}},{"v":0,"d":"0.000"},null,15,{"v":98712,"d":"98,712"},{"v":115447.49665871396,"d":"115,447"},{"$f":"SUM($I20:I$125)","v":{"v":9598261.357796477,"d":"9,598,261"}},{"v":0,"d":"0.000"}]
{"$rows_left_out":175}