{"text_format":"3","workbook":"xlsx","n_sheets":7,"sheets":["Commandes","Feuille","FeuilleVB","Feuille remplie","Sheet2","xl_DCF_History","Classified as UnClassified"],"not_rendered":{"macros":1,"external_links":1,"defined_names":12},"read":"whole","date_system":"1900"}

{"sheet":"Commandes","index":0,"n_rows":91,"n_cols":16,"rows_kept":91}
["Article","Description article","Frn. Commercial","Desc. Frn. Comercial","Fournisseur Logistique","Commande d´Achat","Entrepot","Type de Commande","Date de livraison","Kit","TVA","PCB","Unit","Quantite Commandee","Colis par palette","Nbre palette \nen réception"]
[48804204,"NOIX FRAICHE                  ",52588,"CAPEL 4 SAISONS SA-LFC01-R99",222621,530545337,"0A57","FLT","2014-09-30",0,5.5,10,"CJ",300,50,{"$f":"ROUNDUP(N2/O2,0)","v":6}]
[48679903,"COURGETTE VERTE VRAC          ",69592,"JARDIN DU VAL DE LOI LFC 01",223738,530545764,"0A57","FLT","2014-09-30",0,5.5,10,"CJ",280,50,6]
[48587001,"POIRE CONFERENCE VRAC MDD     ",52441,"ORIUS SARL OP-LFC 01-",222496,530545077,"0A57","FLT","2014-09-30",0,5.5,7,"CJ",270,90,3]
[60627708,"TOMATE RONDE 1KG PP           ",52529,"SOCOMO-PERPIGNAN-R99",222573,530545838,"0A57","FLT","2014-09-30",0,5.5,6,"CJ",260,130,2]
[43574100,"TOM CERISE ALLONGEE 250GR IMP ",62260,"DISMA INTERNATIONAL R99 LFC01",223171,530544946,"0A57","FLT","2014-09-30",0,5.5,12,"CJ",260,148,2]
[58303606,"SALADE SUCRINE X3 PIECES BQT  ",52529,"SOCOMO-PERPIGNAN-R99",222573,530545838,"0A57","FLT","2014-09-30",0,5.5,12,"CJ",250,60,5]
[92054903,"TOMATE GRAPPE France VRAC     ",52547,"JACOB JOSEPH LFC 01",222589,530545787,"0A57","FLT","2014-09-30",0,5.5,10,"CJ",224,75,3]
[79984802,"SALADE ICEBERG PIECE 450G     ",52529,"SOCOMO-PERPIGNAN-R99",222573,530545838,"0A57","FLT","2014-09-30",0,5.5,10,"CJ",210,65,4]
[58741513,"ENDIVE 1KG SACHET             ",59246,"FRAILEG LFC 01",222952,530545004,"0A57","FLT","2014-09-30",0,5.5,10,"CJ",210,65,4]
[58741513,"ENDIVE 1KG SACHET             ",62273,"ENDIGRA SARL R99 LFC01",223184,530545021,"0A57","FLT","2014-09-30",0,5.5,10,"CJ",210,65,4]
[58741513,"ENDIVE 1KG SACHET             ",52554,"PRYMEX SAS - LFC1",222596,530544970,"0A57","FLT","2014-09-30",0,5.5,10,"CJ",199,65,4]
[48795402,"TOMATE RONDE MOYENNE VRAC     ",52547,"JACOB JOSEPH LFC 01",222589,530545787,"0A57","FLT","2014-09-30",0,5.5,6,"CJ",194,100,2]
[48804334,"POM GOLDEN                    ",52569,"VERGERS BEAUREGARD LFC 01",222609,530545039,"0A57","FLT","2014-09-30",0,5.5,7,"CJ",189,100,2]
[57753377,"AVOCAT PIECE                  ",66310,"ELQUI IMPORT LFC01",223518,530545272,"0A57","FLT","2014-09-30",0,5.5,18,"CJ",175,252,1]
[57847705,"POM ROYAL GALA 3KG            ",52638,"VERGERS VAUX DU LOIR LFC 01",222638,530545070,"0A57","FLT","2014-09-30",0,5.5,6,"CJ",160,50,4]
[57847705,"POM ROYAL GALA 3KG            ",52376,"BLUE WHALE-LFC01",222431,530545157,"0A57","FLT","2014-09-30",0,5.5,6,"CJ",160,50,4]
[82068402,"CHAMP BLANC P/COUPE 250GR -1¿ ",63763,"LEGULICE LFC 01",223395,530545036,"0A57","FLT","2014-09-30",0,5.5,12,"CJ",154,100,2]
[49633103,"POIREAU BOTTE 1KG             ",52556,"LION D'OR 59 LFC 01",222598,530545376,"0A57","FLT","2014-09-30",0,5.5,10,"CJ",150,55,3]
[49633103,"POIREAU BOTTE 1KG             ",62292,"FRUIDORR91 LFC15 FLANDRES FRCO",223201,530544955,"0A57","FLT","2014-09-30",0,5.5,10,"CJ",150,55,3]
[{"$nulls":14},{"$error":"#N/A"},{"$f":"ROUNDUP(N21/O21,0)","v":{"$error":"#N/A"}}]
[{"$nulls":14},{"$error":"#N/A"},{"$error":"#N/A"}]
[{"$nulls":14},{"$error":"#N/A"},{"$error":"#N/A"}]
[{"$nulls":14},{"$error":"#N/A"},{"$error":"#N/A"}]
[{"$nulls":14},{"$error":"#N/A"},{"$error":"#N/A"}]
[{"$nulls":14},{"$error":"#N/A"},{"$error":"#N/A"}]
[{"$nulls":14},{"$error":"#N/A"},{"$error":"#N/A"}]
[{"$nulls":14},{"$error":"#N/A"},{"$error":"#N/A"}]
[{"$nulls":14},{"$error":"#N/A"},{"$error":"#N/A"}]
[{"$nulls":14},{"$error":"#N/A"},{"$error":"#N/A"}]
[{"$nulls":14},{"$error":"#N/A"},{"$error":"#N/A"}]
[{"$nulls":14},{"$error":"#N/A"},{"$error":"#N/A"}]
[{"$nulls":14},{"$error":"#N/A"},{"$error":"#N/A"}]
[{"$nulls":14},{"$error":"#N/A"},{"$error":"#N/A"}]
[{"$nulls":14},{"$error":"#N/A"},{"$error":"#N/A"}]
[{"$nulls":14},{"$error":"#N/A"},{"$error":"#N/A"}]
[{"$nulls":14},{"$error":"#N/A"},{"$error":"#N/A"}]
[{"$nulls":14},{"$error":"#N/A"},{"$error":"#N/A"}]
[{"$nulls":14},{"$error":"#N/A"},{"$error":"#N/A"}]
[{"$nulls":14},{"$error":"#N/A"},{"$error":"#N/A"}]
[{"$nulls":14},{"$error":"#N/A"},{"$error":"#N/A"}]
[{"$nulls":14},{"$error":"#N/A"},{"$error":"#N/A"}]
[{"$nulls":14},{"$error":"#N/A"},{"$error":"#N/A"}]
[{"$nulls":14},{"$error":"#N/A"},{"$error":"#N/A"}]
[{"$nulls":14},{"$error":"#N/A"},{"$error":"#N/A"}]
[{"$nulls":14},{"$error":"#N/A"},{"$error":"#N/A"}]
[{"$nulls":14},{"$error":"#N/A"},{"$error":"#N/A"}]
[{"$nulls":14},{"$error":"#N/A"},{"$error":"#N/A"}]
[{"$nulls":14},{"$error":"#N/A"},{"$error":"#N/A"}]
[{"$nulls":14},{"$error":"#N/A"},{"$error":"#N/A"}]
[{"$nulls":14},{"$error":"#N/A"},{"$error":"#N/A"}]
[{"$nulls":14},{"$error":"#N/A"},{"$error":"#N/A"}]
[{"$nulls":14},{"$error":"#N/A"},{"$error":"#N/A"}]
[{"$nulls":14},{"$error":"#N/A"},{"$error":"#N/A"}]
[{"$nulls":14},{"$error":"#N/A"},{"$error":"#N/A"}]
[{"$nulls":14},{"$error":"#N/A"},{"$error":"#N/A"}]
[{"$nulls":14},{"$error":"#N/A"},{"$error":"#N/A"}]
[{"$nulls":14},{"$error":"#N/A"},{"$error":"#N/A"}]
[{"$nulls":14},{"$error":"#N/A"},{"$error":"#N/A"}]
[{"$nulls":14},{"$error":"#N/A"},{"$error":"#N/A"}]
[{"$nulls":14},{"$error":"#N/A"},{"$error":"#N/A"}]
[{"$nulls":14},{"$error":"#N/A"},{"$error":"#N/A"}]
[{"$nulls":14},{"$error":"#N/A"},{"$error":"#N/A"}]
[{"$nulls":14},{"$error":"#N/A"},{"$error":"#N/A"}]
[{"$nulls":14},{"$error":"#N/A"},{"$error":"#N/A"}]
[{"$nulls":14},{"$error":"#N/A"},{"$error":"#N/A"}]
[{"$nulls":14},{"$error":"#N/A"},{"$error":"#N/A"}]
[{"$nulls":14},{"$error":"#N/A"},{"$error":"#N/A"}]
[{"$nulls":14},{"$error":"#N/A"},{"$error":"#N/A"}]
[{"$nulls":14},{"$error":"#N/A"},{"$error":"#N/A"}]
[{"$nulls":14},{"$error":"#N/A"},{"$error":"#N/A"}]
[{"$nulls":14},{"$error":"#N/A"},{"$error":"#N/A"}]
[{"$nulls":14},{"$error":"#N/A"},{"$error":"#N/A"}]
[{"$nulls":14},{"$error":"#N/A"},{"$error":"#N/A"}]
[{"$nulls":14},{"$error":"#N/A"},{"$error":"#N/A"}]
[{"$nulls":14},{"$error":"#N/A"},{"$error":"#N/A"}]
[{"$nulls":14},{"$error":"#N/A"},{"$error":"#N/A"}]
[{"$nulls":14},{"$error":"#N/A"},{"$error":"#N/A"}]
[{"$nulls":14},{"$error":"#N/A"},{"$error":"#N/A"}]
[{"$nulls":14},{"$error":"#N/A"},{"$error":"#N/A"}]
[{"$nulls":14},{"$error":"#N/A"},{"$error":"#N/A"}]
[{"$nulls":14},{"$error":"#N/A"},{"$error":"#N/A"}]
[{"$nulls":14},{"$error":"#N/A"},{"$error":"#N/A"}]
[{"$nulls":14},{"$error":"#N/A"},{"$error":"#N/A"}]
[{"$nulls":14},{"$error":"#N/A"},{"$f":"ROUNDUP(N85/O85,0)","v":{"$error":"#N/A"}}]
[{"$nulls":14},{"$error":"#N/A"},{"$error":"#N/A"}]
[{"$nulls":14},{"$error":"#N/A"},{"$error":"#N/A"}]
[{"$nulls":14},{"$error":"#N/A"},{"$error":"#N/A"}]
[{"$nulls":14},{"$error":"#N/A"},{"$error":"#N/A"}]
[{"$nulls":14},{"$error":"#N/A"},{"$error":"#N/A"}]
[{"$nulls":14},{"$error":"#N/A"},{"$error":"#N/A"}]

{"sheet":"Feuille","index":1,"n_rows":3,"n_cols":8,"rows_kept":3,"merged":[[0,0,0,7]]}
["FEUILLE DE PESEE"]
[]
["Article","Description article","Description fournisseur","Qté","brut","pal","colis","net"]

{"sheet":"FeuilleVB","index":2,"n_rows":27,"n_cols":9,"rows_kept":27,"merged":[[0,0,0,7]]}
["FEUILLE DE PESEE"]
[]
["Article","Description article","Description fournisseur","Qté","brut","pal","colis","net","Palet#"]
[48804204,{"$f":"VLOOKUP($A4,Command_data, 2, FALSE)","v":"NOIX FRAICHE                  "},{"$f":"VLOOKUP($A4,Command_data, 4, FALSE)","v":"CAPEL 4 SAISONS SA-LFC01-R99"},{"$f":"VLOOKUP($A4,Command_data, 14, FALSE)","v":300},{"$nulls":4},{"$f":"VLOOKUP($A4,Command_data, 16, FALSE)","v":6}]
[48679903,{"$f":"VLOOKUP($A5,Command_data, 2, FALSE)","v":"COURGETTE VERTE VRAC          "},{"$f":"VLOOKUP($A5,Command_data, 4, FALSE)","v":"JARDIN DU VAL DE LOI LFC 01"},{"$f":"VLOOKUP($A5,Command_data, 14, FALSE)","v":280},{"$nulls":4},{"$f":"VLOOKUP($A5,Command_data, 16, FALSE)","v":6}]
[57847705,{"$f":"VLOOKUP($A6,Command_data, 2, FALSE)","v":"POM ROYAL GALA 3KG            "},{"$f":"VLOOKUP($A6,Command_data, 4, FALSE)","v":"VERGERS VAUX DU LOIR LFC 01"},{"$f":"VLOOKUP($A6,Command_data, 14, FALSE)","v":160},{"$nulls":4},{"$f":"VLOOKUP($A6,Command_data, 16, FALSE)","v":4}]
{"$rows_empty":17}
["Article","Description article","Description fournisseur","Qté","brut","pal","colis","net","Palet#"]
[48804204,{"$f":"VLOOKUP($A25,Command_data, 2, FALSE)","v":"NOIX FRAICHE                  "},{"$f":"VLOOKUP($A25,Command_data, 4, FALSE)","v":"CAPEL 4 SAISONS SA-LFC01-R99"},{"$f":"VLOOKUP($A25,Command_data, 14, FALSE)","v":300},{"$nulls":4},{"$f":"VLOOKUP($A25,Command_data, 16, FALSE)","v":6}]
[48679903,{"$f":"VLOOKUP($A26,Command_data, 2, FALSE)","v":"COURGETTE VERTE VRAC          "},{"$f":"VLOOKUP($A26,Command_data, 4, FALSE)","v":"JARDIN DU VAL DE LOI LFC 01"},{"$f":"VLOOKUP($A26,Command_data, 14, FALSE)","v":280},{"$nulls":4},{"$f":"VLOOKUP($A26,Command_data, 16, FALSE)","v":6}]
[57847705,{"$f":"VLOOKUP($A27,Command_data, 2, FALSE)","v":"POM ROYAL GALA 3KG            "},{"$f":"VLOOKUP($A27,Command_data, 4, FALSE)","v":"VERGERS VAUX DU LOIR LFC 01"},{"$f":"VLOOKUP($A27,Command_data, 14, FALSE)","v":160},{"$nulls":4},{"$f":"VLOOKUP($A27,Command_data, 16, FALSE)","v":4}]

{"sheet":"Feuille remplie","index":3,"n_rows":16,"n_cols":9,"rows_kept":16,"merged":[[0,0,0,7],[3,0,8,0],[3,1,8,1],[3,2,8,2],[3,3,8,3],[9,0,14,0],[9,1,14,1],[9,2,14,2],[9,3,14,3],[15,0,18,0],[15,1,18,1],[15,2,18,2],[15,3,18,3]]}
["FEUILLE DE PESEE"]
[]
["Article","Description article","Description fournisseur","Qté","brut","pal","colis","net"]
[48804204,"NOIX FRAICHE                  ","CAPEL 4 SAISONS SA-LFC01-R99",300,{"$nulls":4},6]
[]
[]
[]
[]
[]
[48679903,"COURGETTE VERTE VRAC          ","JARDIN DU VAL DE LOI LFC 01",280,{"$nulls":4},6]
[]
[]
[]
[]
[]
[79984802,"SALADE ICEBERG PIECE 450G     ","SOCOMO-PERPIGNAN-R99",210,{"$nulls":4},4]

{"sheet":"Sheet2","index":4,"n_rows":0,"n_cols":0,"rows_kept":0}

{"sheet":"xl_DCF_History","index":5,"n_rows":2,"n_cols":7,"rows_kept":2,"hidden":true}
["CLINAME","DATETIME","DONEBY","IPADDRESS","APPVER","RANDOM","CHECKSUM"]
["ၢၻၐၹၮႀႀၶၳၶၲၱ","ှှြ၃ြဿွှ၁ိိှ၃၇ဿ၃ၝၚိဵၔၚၡးှ၇ွံ","ၠၡၩ၏ၿၲၺၼၻၱႃ","ၔၛ၏၁ွ၁၃ဿ၀","၁ျွျဿျွ",13,"၁ဿ၆၁"]

{"sheet":"Classified as UnClassified","index":6,"n_rows":0,"n_cols":0,"rows_kept":0,"hidden":true}