{"text_format":"3","workbook":"xlsx","n_sheets":4,"sheets":["Feuil1","Macro1","Feuil2","Feuil3"],"not_rendered":{"macros":1,"defined_names":1},"read":"whole","date_system":"1900"}

{"sheet":"Feuil1","index":0,"n_rows":24,"n_cols":4,"rows_kept":24}
["Nom et prenom","Adresse","Obs","Num retraite"]
["Nom  Prenom1","28 BP 2888 Abidian 28  - tel:45879659 - 99989796","Il s'agit d'une adresse postale et 2 numéro de tel"]
["Nom  Prenom2",98999999,"numero de tel uniquement"]
["Nom  Prenom3","ATT 489522244455","Attestation d'identité"]
["Nom  Prenom4",null,"aucun contact"]
["Nom  Prenom5","ATT 489522244455 - 48454849","Attestation d'identité + Num de tel"]
["Nom  Prenom6","ERkqdq584644464egeglegejgeljgege4","saisies à la volée"]
["Nom  Prenom7",8.55144656631224E+16,"succession de chiffres mais pas num de téléphone"]
["Nom  Prenom8","BP 458 Bouaké 89555"]
["Nom  Prenom9","TEL: 99 87 89 55 - 78421462"]
["Nom  Prenom10","Cel: 41898756"]
["Nom  Prenom11","Cel: 41.89.87.56"]
["Nom  Prenom12","Neant"]
["Nom  Prenom13","*Val 894565677465"]
["Nom  Prenom14","Neant"]
["Nom  Prenom15","Neant"]
["Nom  Prenom16","Neant"]
["Nom  Prenom17","Neant"]
["Nom  Prenom18","Neant"]
["Nom  Prenom19","Neant"]
["Nom  Prenom20","Neant"]
["Nom  Prenom21","Neant"]
["Nom  Prenom22","Neant"]
["Nom  Prenom23","Neant"]

{"sheet":"Macro1","index":1,"n_rows":0,"n_cols":0,"rows_kept":0}

{"sheet":"Feuil2","index":2,"n_rows":6642,"n_cols":5,"rows_kept":6642}
["DATOPER","LIBAV1","LIBAV9","Telephone","Statut"]
["2014-01-02","NOM PRENOM 1","tel 99999999",{"$f":"gettel(C2)","v":"99999999"},{"$f":"IF(LEN(D2)=0,\"VIDE\",IF(LEN(D2)=8,\"Ok\",\"?\"))","v":"Ok"}]
["2014-01-02","NOM PRENOM 2","TEL 99999999",{"$f":"gettel(C3)","v":"99999999"},{"$f":"IF(LEN(D3)=0,\"VIDE\",IF(LEN(D3)=8,\"Ok\",\"?\"))","v":"Ok"}]
["2014-01-02","NOM PRENOM 3","TEL 99999999","99999999","Ok"]
["2014-01-02","NOM PRENOM 4","TEL 99999999","99999999","Ok"]
["2014-01-02","NOM PRENOM 5","TEL 99999999","99999999","Ok"]
["2014-01-02","NOM PRENOM 6","CEL 99999999","99999999","Ok"]
["2014-01-02","NOM PRENOM 7",null,"","VIDE"]
["2014-01-02","NOM PRENOM 8","tel 99999999","99999999","Ok"]
["2014-01-02","NOM PRENOM 9","TEL 99.99.99.99","99999999","Ok"]
["2014-01-02","NOM PRENOM 10","TEL 99999999","99999999","Ok"]
["2014-01-02","NOM PRENOM 11","TEL 99999999","99999999","Ok"]
["2014-01-02","NOM PRENOM 12","tel 99999999","99999999","Ok"]
["2014-01-02","NOM PRENOM 13","tel 99999999","99999999","Ok"]
["2014-01-02","NOM PRENOM 14","tel 99999999","99999999","Ok"]
["2014-01-02","NOM PRENOM 15","TEL:99-99-99-99","99999999","Ok"]
["2014-01-02","NOM PRENOM 16","TEL 99999999","99999999","Ok"]
["2014-01-02","NOM PRENOM 17","tel 99999999","99999999","Ok"]
["2014-01-02","NOM PRENOM 18","tel 99999999","99999999","Ok"]
["2014-01-02","NOM PRENOM 19","tel 99999999","99999999","Ok"]
["2014-01-02","NOM PRENOM 20","CEL 99999999","99999999","Ok"]
["2014-01-02","NOM PRENOM 21","tel 99999999","99999999","Ok"]
["2014-01-02","NOM PRENOM 22","tel 99999999","99999999","Ok"]
["2014-01-02","NOM PRENOM 23","tel 99999999","99999999","Ok"]
["2014-01-02","NOM PRENOM 24","tel 99999999","99999999","Ok"]
["2014-01-02","NOM PRENOM 25","tel 99999999","99999999","Ok"]
["2014-01-02","NOM PRENOM 26","CEL 99999999","99999999","Ok"]
["2014-01-02","NOM PRENOM 27","TEL 99999999","99999999","Ok"]
["2014-01-02","NOM PRENOM 28","TEL 99999999","99999999","Ok"]
["2014-01-02","NOM PRENOM 29","tel 99999999","99999999","Ok"]
["2014-01-02","NOM PRENOM 30","tel 99999999","99999999","Ok"]
["2014-01-02","NOM PRENOM 31","tel 99999999","99999999","Ok"]
["2014-01-02","NOM PRENOM 32","tel 99999999","99999999","Ok"]
["2014-01-02","NOM PRENOM 33",null,"","VIDE"]
["2014-01-02","NOM PRENOM 34","cel 99999999","99999999","Ok"]
["2014-01-02","NOM PRENOM 35","cel 99999999","99999999","Ok"]
["2014-01-02","NOM PRENOM 36","CEL 99999999","99999999","Ok"]
["2014-01-02","NOM PRENOM 37","ATTEST N 999/99/99/PU99 DU 99/99/99 AU 99/99/9999","","VIDE"]
["2014-01-02","NOM PRENOM 38","TEL 99999999","99999999","Ok"]
["2014-01-02","NOM PRENOM 39",null,"","VIDE"]
["2014-01-02","NOM PRENOM 40","9999 9999 99 DU 99.99.99 AU 99.99.99","","VIDE"]
["2014-01-02","NOM PRENOM 41","TEL 99.99.99.99","99999999","Ok"]
["2014-01-02","NOM PRENOM 42",null,"","VIDE"]
["2014-01-02","NOM PRENOM 43","TEL 99.99.99.99","99999999","Ok"]
["2014-01-02","NOM PRENOM 44","CNI C9999.9999.99 DU 99/99/9999","","VIDE"]
["2014-01-02","NOM PRENOM 45",null,"","VIDE"]
["2014-01-02","NOM PRENOM 46","TEL 99.99.99.99","99999999","Ok"]
["2014-01-02","NOM PRENOM 47","CEL 99999999","99999999","Ok"]
["2014-01-02","NOM PRENOM 48","CNI C9999.9999.99 DU 99.99.99","","VIDE"]
["2014-01-02","NOM PRENOM 49","TEL 99.99.99.99","99999999","Ok"]
["2014-01-02","NOM PRENOM 50","TEL:99-99-99-99","99999999","Ok"]
["2014-01-02","NOM PRENOM 51",null,"","VIDE"]
["2014-01-02","NOM PRENOM 52","CNI C 9999999999 DU 99-99-99","","VIDE"]
["2014-01-02","NOM PRENOM 53",null,"","VIDE"]
["2014-01-02","NOM PRENOM 54","CNI C9999999999 DU 99/99/9999 AU 99/99/9999","","VIDE"]
["2014-01-02","NOM PRENOM 55","TEL 99.99.99.99","99999999","Ok"]
["2014-01-02","NOM PRENOM 56","CEL 99999999/99999999",{"$f":"gettel(C57)","v":"99999999/99999999"},"?"]
["2014-01-02","NOM PRENOM 57",null,"","VIDE"]
["2014-01-02","NOM PRENOM 58","TEL:99-99-99-99","99999999","Ok"]
["2014-01-02","NOM PRENOM 59","TEL 99999999","99999999","Ok"]
["2014-01-02","NOM PRENOM 60","CEL 99999999","99999999","Ok"]
["2014-01-02","NOM PRENOM 61","TEL 99999999","99999999","Ok"]
["2014-01-02","NOM PRENOM 62","POUR CONSTRUCTION DE MAISON","","VIDE"]
["2014-01-02","NOM PRENOM 63",null,"","VIDE"]
["2014-01-02","NOM PRENOM 64","CEL 99999999","99999999","Ok"]
["2014-01-02","NOM PRENOM 65","TEL 99.99.99.99","99999999","Ok"]
["2014-01-02","NOM PRENOM 66",null,{"$f":"gettel(C67)","v":""},{"$f":"IF(LEN(D67)=0,\"VIDE\",IF(LEN(D67)=8,\"Ok\",\"?\"))","v":"VIDE"}]
["2014-01-02","NOM PRENOM 67","CNI C 9999 9999 99 DU 99/99/99 - TEL 99999999","99999999","Ok"]
["2014-01-02","NOM PRENOM 68","TEL 99999999","99999999","Ok"]
["2014-01-02","NOM PRENOM 69","TEL 99.99.99.99","99999999","Ok"]
["2014-01-02","NOM PRENOM 70",null,"","VIDE"]
["2014-01-02","NOM PRENOM 71",null,"","VIDE"]
["2014-01-02","NOM PRENOM 72",null,"","VIDE"]
["2014-01-02","NOM PRENOM 73","VAL99/99/9999 CEL99999999","99999999","Ok"]
["2014-01-02","NOM PRENOM 74","TEL 99.99.99.99","99999999","Ok"]
["2014-01-02","NOM PRENOM 75","/SP-TIM DU 99-99-9999","","VIDE"]
["2014-01-02","NOM PRENOM 76",null,"","VIDE"]
["2014-01-02","NOM PRENOM 77","passport n 999999999  val 99/99/9999","","VIDE"]
["2014-01-02","NOM PRENOM 78","TEL:99-99-99-99","99999999","Ok"]
["2014-01-02","NOM PRENOM 79","TEL 99.99.99.99","99999999","Ok"]
["2014-01-02","NOM PRENOM 80","TEL 99.99.99.99","99999999","Ok"]
["2014-01-02","NOM PRENOM 81",null,"","VIDE"]
["2014-01-02","NOM PRENOM 82","TEL 99.99.99.99","99999999","Ok"]
["2014-01-02","NOM PRENOM 83","CNI C9999999999 DU 99/99/9999 A SOUBRE","","VIDE"]
["2014-01-02","NOM PRENOM 84","CEL 99999999","99999999","Ok"]
["2014-01-02","NOM PRENOM 85","TEL 99.99.99.99","99999999","Ok"]
["2014-01-02","NOM PRENOM 86",null,"","VIDE"]
["2014-01-02","NOM PRENOM 87",null,"","VIDE"]
["2014-01-02","NOM PRENOM 88","CNI N° C9999999999 DU 99/99/9999","","VIDE"]
["2014-01-02","NOM PRENOM 89","cel 99999999","99999999","Ok"]
["2014-01-02","NOM PRENOM 90","CNI N9 C 9999.9999.99 DU 99.99.9999 BINGERVILLE","","VIDE"]
["2014-01-02","NOM PRENOM 91","AU 99/99/99","","VIDE"]
["2014-01-02","NOM PRENOM 92","CNI N 9C 9999.9999.99 DU 99.99.9999","","VIDE"]
["2014-01-02","NOM PRENOM 93","TEL 99.99.99.99","99999999","Ok"]
["2014-01-02","NOM PRENOM 94","CEL 99999999","99999999","Ok"]
["2014-01-02","NOM PRENOM 95","TEL 99999999","99999999","Ok"]
["2014-01-02","NOM PRENOM 96",null,"","VIDE"]
["2014-01-02","NOM PRENOM 97","TEL 99999999","99999999","Ok"]
["2014-01-02","NOM PRENOM 98",null,"","VIDE"]
["2014-01-02","NOM PRENOM 99","TEL 99.99.99.99","99999999","Ok"]
["2014-01-02","NOM PRENOM 100",null,"","VIDE"]
["2014-01-02","NOM PRENOM 101","TEL 99.99.99.99","99999999","Ok"]
["2014-01-02","NOM PRENOM 102","ATT N9 999.9999.99.99.PU.99 DU 99.99.9999","","VIDE"]
["2014-01-02","NOM PRENOM 103","TEL 99.99.99.99","99999999","Ok"]
["2014-01-02","NOM PRENOM 104","TEL 99.99.99.99","99999999","Ok"]
["2014-01-02","NOM PRENOM 105",null,"","VIDE"]
["2014-01-02","NOM PRENOM 106","TEL 99999999","99999999","Ok"]
["2014-01-02","NOM PRENOM 107",null,"","VIDE"]
["2014-01-02","NOM PRENOM 108","CEL 99999999","99999999","Ok"]
["2014-01-02","NOM PRENOM 109","CNI N° C9999999999 DU 99/99/9999","","VIDE"]
["2014-01-02","NOM PRENOM 110",null,"","VIDE"]
["2014-01-02","NOM PRENOM 111","CEL:99999999","99999999","Ok"]
["2014-01-02","NOM PRENOM 112","TEL 99.99.99.99","99999999","Ok"]
["2014-01-02","NOM PRENOM 113",null,"","VIDE"]
["2014-01-02","NOM PRENOM 114","CNI N° C9999999999 DU 99/99/9999","","VIDE"]
["2014-01-02","NOM PRENOM 115","TEL 99999999","99999999","Ok"]
["2014-01-02","NOM PRENOM 116",null,"","VIDE"]
["2014-01-02","NOM PRENOM 117",null,"","VIDE"]
["2014-01-02","NOM PRENOM 118","CEL 99.99.99.99","99999999","Ok"]
["2014-01-02","NOM PRENOM 119",null,"","VIDE"]
["2014-01-02","NOM PRENOM 120","TEL 99.99.99.99","99999999","Ok"]
["2014-01-02","NOM PRENOM 121",null,"","VIDE"]
["2014-01-02","NOM PRENOM 122","CNI C 9999999999D DU 99/99/9999","","VIDE"]
["2014-01-02","NOM PRENOM 123","CNI N° C9999999999 DU 99/99/9999","","VIDE"]
["2014-01-02","NOM PRENOM 124","TEL 99999999","99999999","Ok"]
["2014-01-02","NOM PRENOM 125",null,"","VIDE"]
["2014-01-02","NOM PRENOM 126","val 99/99/9999","","VIDE"]
["2014-01-02","NOM PRENOM 127","DU 99-99-9999 AU 99-99-9999","","VIDE"]
["2014-01-02","NOM PRENOM 128","CNI C9999.9999.99 DU 99/99/9999","","VIDE"]
["2014-01-02","NOM PRENOM 129","TEL 99999999","99999999","Ok"]
["2014-01-02","NOM PRENOM 130","VAL99.99.9999 CEL99999999",{"$f":"gettel(C131)","v":"99999999"},{"$f":"IF(LEN(D131)=0,\"VIDE\",IF(LEN(D131)=8,\"Ok\",\"?\"))","v":"Ok"}]
["2014-01-02","NOM PRENOM 131","TEL 99.99.99.99","99999999","Ok"]
["2014-01-02","NOM PRENOM 132","CNI N° C999999999 DU 99/99/9999","","VIDE"]
["2014-01-02","NOM PRENOM 133","TEL 99.99.99.99","99999999","Ok"]
["2014-01-02","NOM PRENOM 134","TEL 99999999","99999999","Ok"]
["2014-01-02","NOM PRENOM 135","TEL 99.99.99.99","99999999","Ok"]
["2014-01-02","NOM PRENOM 136","TEL 99999999","99999999","Ok"]
["2014-01-02","NOM PRENOM 137","CEL 99999999","99999999","Ok"]
["2014-01-02","NOM PRENOM 138","TEL 99.99.99.99","99999999","Ok"]
["2014-01-02","NOM PRENOM 139",null,"","VIDE"]
["2014-01-02","NOM PRENOM 140","CEL 99999999","99999999","Ok"]
["2014-01-02","NOM PRENOM 141","DU 99-99-9999 AU 99-99-9999","","VIDE"]
["2014-01-02","NOM PRENOM 142","CNI C9999.9999.99 DU 99/99/9999","","VIDE"]
["2014-01-02","NOM PRENOM 143",null,"","VIDE"]
["2014-01-02","NOM PRENOM 144","TEL 99.99.99.99","99999999","Ok"]
["2014-01-02","NOM PRENOM 145","CEL 99999999","99999999","Ok"]
["2014-01-02","NOM PRENOM 146","TEL 99999999","99999999","Ok"]
["2014-01-02","NOM PRENOM 147",null,"","VIDE"]
["2014-01-02","NOM PRENOM 148","ATT 9999-999999999999I/99-99/MEMI/ONI/DECI DU 99/99/99 - TEL 99999999","99999999","Ok"]
["2014-01-02","NOM PRENOM 149","TEL 99.99.99.99","99999999","Ok"]
["2014-01-02","NOM PRENOM 150","ATT 9999/9999/99-99/MEMIS/SP-TIM DU 99-99-9999","","VIDE"]
["2014-01-02","NOM PRENOM 151","DU 99.99.99","","VIDE"]
["2014-01-02","NOM PRENOM 152","CNI N 9C 9999.9999.99 DU 99.99.9999","","VIDE"]
["2014-01-02","NOM PRENOM 153",null,"","VIDE"]
["2014-01-02","NOM PRENOM 154","TEL 99999999","99999999","Ok"]
["2014-01-02","NOM PRENOM 155",null,"","VIDE"]
["2014-01-02","NOM PRENOM 156","SOUKOUNA ABDOULAYE CEL 99999999","99999999","Ok"]
["2014-01-02","NOM PRENOM 157","CNI N 9C 9999.9999.99 DU 99.99.9999","","VIDE"]
["2014-01-02","NOM PRENOM 158","CEL 99999999","99999999","Ok"]
["2014-01-02","NOM PRENOM 159",null,"","VIDE"]
["2014-01-02","NOM PRENOM 160",99999999,"99999999","Ok"]
["2014-01-02","NOM PRENOM 161","CNI C 9999999999 DU 99/99/99","","VIDE"]
["2014-01-02","NOM PRENOM 162","CELL 99999999","99999999","Ok"]
["2014-01-02","NOM PRENOM 163","TEL 99.99.99.99","99999999","Ok"]
["2014-01-02","NOM PRENOM 164","CNI N9 C 9999.9999.99 DU 99.99.9999","","VIDE"]
["2014-01-02","NOM PRENOM 165","TEL 99999999","99999999","Ok"]
["2014-01-02","NOM PRENOM 166","TEL 99999999","99999999","Ok"]
["2014-01-02","NOM PRENOM 167",null,"","VIDE"]
["2014-01-02","NOM PRENOM 168",null,"","VIDE"]
["2014-01-02","NOM PRENOM 169","TEL 99.99.99.99","99999999","Ok"]
["2014-01-02","NOM PRENOM 170","TEL 99999999","99999999","Ok"]
["2014-01-02","NOM PRENOM 171","CEL 99999999","99999999","Ok"]
["2014-01-02","NOM PRENOM 172","TEL 99.99.99.99","99999999","Ok"]
["2014-01-02","NOM PRENOM 173","du 99/99/9999 au 99/99/9999","","VIDE"]
["2014-01-02","NOM PRENOM 174",99999999,"99999999","Ok"]
["2014-01-02","NOM PRENOM 175","TEL 99999999 / 99999999",{"$f":"gettel(C176)","v":"99999999/99999999"},"?"]
["2014-01-02","NOM PRENOM 176",null,"","VIDE"]
["2014-01-02","NOM PRENOM 177",99999999,"99999999","Ok"]
["2014-01-02","NOM PRENOM 178",null,"","VIDE"]
["2014-01-02","NOM PRENOM 179","PC USA N° B99999999 DU 99.99.9999","","VIDE"]
["2014-01-02","NOM PRENOM 180","VAL99/99/9999 CEL99999999","99999999","Ok"]
["2014-01-02","NOM PRENOM 181","CEL 99.99.99.99","99999999","Ok"]
["2014-01-02","NOM PRENOM 182","CNI N° C9999 9999 99 DU 99/99/9999 AU 99/99/9999","","VIDE"]
["2014-01-02","NOM PRENOM 183","VAL99/99/9999 CEL99999999","99999999","Ok"]
["2014-01-02","NOM PRENOM 184","CNI C 9999 9999 99 DU 99/99/99 - TEL 99999999","99999999","Ok"]
["2014-01-02","NOM PRENOM 185","CNI C9999.9999.99 DU 99.99.99","","VIDE"]
["2014-01-02","NOM PRENOM 186",null,"","VIDE"]
["2014-01-02","NOM PRENOM 187","CNI C 9999999999 DU 99/99/99","","VIDE"]
["2014-01-02","NOM PRENOM 188",null,"","VIDE"]
["2014-01-02","NOM PRENOM 189","TEL 99.99.99.99","99999999","Ok"]
["2014-01-02","NOM PRENOM 190","CNI C9999999999 DU 99/99/9999 AU 99/99/9999","","VIDE"]
["2014-01-02","NOM PRENOM 191","TEL 99.99.99.99","99999999","Ok"]
["2014-01-02","NOM PRENOM 192","TEL 99.99.99.99","99999999","Ok"]
["2014-01-02","NOM PRENOM 193",99999999,"99999999","Ok"]
["2014-01-02","NOM PRENOM 194",null,{"$f":"gettel(C195)","v":""},{"$f":"IF(LEN(D195)=0,\"VIDE\",IF(LEN(D195)=8,\"Ok\",\"?\"))","v":"VIDE"}]
["2014-01-02","NOM PRENOM 195","DU 99-99-9999 AU 99-99-9999","","VIDE"]
["2014-01-02","NOM PRENOM 196","TEL 99999999","99999999","Ok"]
["2014-01-02","NOM PRENOM 197","CEL 99999999","99999999","Ok"]
["2014-01-02","NOM PRENOM 198",null,"","VIDE"]
["2014-01-02","NOM PRENOM 199",null,"","VIDE"]
["2014-01-02","NOM PRENOM 200","CNI N 9C 9999.9999.99 DU 99.99.9999","","VIDE"]
["2014-01-02","NOM PRENOM 201","TEL 99.99.99.99","99999999","Ok"]
["2014-01-02","NOM PRENOM 202",null,"","VIDE"]
["2014-01-02","NOM PRENOM 203","CNI N°C9999999999 VAL 99.99.9999","","VIDE"]
["2014-01-02","NOM PRENOM 204","CEL 99999999","99999999","Ok"]
["2014-01-02","NOM PRENOM 205","AU 99/99/99","","VIDE"]
["2014-01-02","NOM PRENOM 206","CNI N° C9999999999 DU 99/99/9999","","VIDE"]
["2014-01-02","NOM PRENOM 207","CEL 99999999","99999999","Ok"]
["2014-01-02","NOM PRENOM 208","CNI N° 999999999999 VAL AU 99.99.9999 ** CEL 99.99.99.99 **","99999999","Ok"]
["2014-01-02","NOM PRENOM 209","CEL 99999999","99999999","Ok"]
["2014-01-02","NOM PRENOM 210","TEL 99999999","99999999","Ok"]
["2014-01-02","NOM PRENOM 211","ATT N°999/9999 DU 99/99/99 AUI 99/99/9999","","VIDE"]
["2014-01-02","NOM PRENOM 212","CNI N9 999999999999 DU 99.99.9999","","VIDE"]
["2014-01-02","NOM PRENOM 213","CNI C9999.9999.99 DU 99/99/9999","","VIDE"]
["2014-01-02","NOM PRENOM 214",null,"","VIDE"]
["2014-01-02","NOM PRENOM 215","CNI C9999.9999.99 DU 99/99/9999","","VIDE"]
["2014-01-02","NOM PRENOM 216","CNI N9 C 9999.9999.99 DU 99.99.9999","","VIDE"]
["2014-01-02","NOM PRENOM 217","TEL 99999999","99999999","Ok"]
["2014-01-02","NOM PRENOM 218","TEL 99.99.99.99","99999999","Ok"]
["2014-01-02","NOM PRENOM 219","TEL 99999999","99999999","Ok"]
["2014-01-02","NOM PRENOM 220","+ PC 99-99-99999999 DU 99/99/9999","","VIDE"]
["2014-01-02","NOM PRENOM 221","TEL 99999999","99999999","Ok"]
["2014-01-02","NOM PRENOM 222","TEL 99.99.99.99","99999999","Ok"]
["2014-01-02","NOM PRENOM 223","CEL 99999999","99999999","Ok"]
["2014-01-02","NOM PRENOM 224","TEL 99.99.99.99","99999999","Ok"]
["2014-01-02","NOM PRENOM 225","CNI C9999999999 DU 99/99/9999 AU 99/99/9999","","VIDE"]
["2014-01-02","NOM PRENOM 226","CNI C9999.9999.99 DU 99/99/9999","","VIDE"]
["2014-01-02","NOM PRENOM 227","TEL 99.99.99.99","99999999","Ok"]
["2014-01-02","NOM PRENOM 228",null,"","VIDE"]
["2014-01-02","NOM PRENOM 229","CEL 99.99.99.99","99999999","Ok"]
["2014-01-02","NOM PRENOM 230",null,"","VIDE"]
["2014-01-02","NOM PRENOM 231",null,"","VIDE"]
["2014-01-02","NOM PRENOM 232","CNI C9999.9999.99 DU 99/99/9999","","VIDE"]
["2014-01-02","NOM PRENOM 233","CNI N° C9999 9999 99 DU 99/99/9999 AU 99/99/9999","","VIDE"]
["2014-01-02","NOM PRENOM 234","CEL 99999999","99999999","Ok"]
["2014-01-02","NOM PRENOM 235",null,"","VIDE"]
["2014-01-02","NOM PRENOM 236","TEL 99999999","99999999","Ok"]
["2014-01-02","NOM PRENOM 237","CNI N9 C 9999.9999.99 DU 99.99.9999","","VIDE"]
["2014-01-02","NOM PRENOM 238","TEL 99.99.99.99","99999999","Ok"]
["2014-01-02","NOM PRENOM 239","TEL 99999999","99999999","Ok"]
["2014-01-02","NOM PRENOM 240",null,"","VIDE"]
["2014-01-02","NOM PRENOM 241",null,"","VIDE"]
["2014-01-02","NOM PRENOM 242",null,"","VIDE"]
["2014-01-02","NOM PRENOM 243","MALI","","VIDE"]
["2014-01-02","NOM PRENOM 244","TEL 99999999","99999999","Ok"]
["2014-01-02","NOM PRENOM 245","TEL 99999999","99999999","Ok"]
["2014-01-02","NOM PRENOM 246",null,"","VIDE"]
["2014-01-02","NOM PRENOM 247",null,"","VIDE"]
["2014-01-02","NOM PRENOM 248",null,"","VIDE"]
["2014-01-02","NOM PRENOM 249",null,"","VIDE"]
["2014-01-02","NOM PRENOM 250",null,"","VIDE"]
["2014-01-02","NOM PRENOM 251",null,"","VIDE"]
["2014-01-02","NOM PRENOM 252","CNI C 9999 9999 99 DU 99/99/99 - TEL 99999999","99999999","Ok"]
["2014-01-02","NOM PRENOM 253","BAKAYOKO ANLIOU","","VIDE"]
["2014-01-02","NOM PRENOM 254","TEL 99999999","99999999","Ok"]
["2014-01-02","NOM PRENOM 255","TEL 99999999","99999999","Ok"]
["2014-01-02","NOM PRENOM 256","TEL 99999999","99999999","Ok"]
["2014-01-02","NOM PRENOM 257","TEL 99999999","99999999","Ok"]
["2014-01-02","NOM PRENOM 258",null,{"$f":"gettel(C259)","v":""},{"$f":"IF(LEN(D259)=0,\"VIDE\",IF(LEN(D259)=8,\"Ok\",\"?\"))","v":"VIDE"}]
["2014-01-02","NOM PRENOM 259",null,"","VIDE"]
["2014-01-02","NOM PRENOM 260",null,"","VIDE"]
["2014-01-02","NOM PRENOM 261",99999999,"99999999","Ok"]
["2014-01-02","NOM PRENOM 262","TEL 99.99.99.99","99999999","Ok"]
["2014-01-02","NOM PRENOM 263",null,"","VIDE"]
["2014-01-02","NOM PRENOM 264","cisse alassane","","VIDE"]
["2014-01-02","NOM PRENOM 265","sangare zoumana","","VIDE"]
["2014-01-02","NOM PRENOM 266","TEL:99-99-99-99","99999999","Ok"]
["2014-01-02","NOM PRENOM 267","TEL 99999999","99999999","Ok"]
["2014-01-02","NOM PRENOM 268",null,"","VIDE"]
["2014-01-02","NOM PRENOM 269",null,"","VIDE"]
["2014-01-02","NOM PRENOM 270","TEL 99999999","99999999","Ok"]
["2014-01-02","NOM PRENOM 271",null,"","VIDE"]
["2014-01-02","NOM PRENOM 272",null,"","VIDE"]
["2014-01-02","NOM PRENOM 273",null,"","VIDE"]
["2014-01-02","NOM PRENOM 274","TEL:99-99-99-99","99999999","Ok"]
["2014-01-02","NOM PRENOM 275",null,"","VIDE"]
["2014-01-02","NOM PRENOM 276",null,"","VIDE"]
["2014-01-02","NOM PRENOM 277",null,"","VIDE"]
["2014-01-03","NOM PRENOM 278","CEL 99999999","99999999","Ok"]
["2014-01-03","NOM PRENOM 279","TEL 99.99.99.99","99999999","Ok"]
["2014-01-03","NOM PRENOM 280","CNI N9 999999999999 DU 99.99.9999","","VIDE"]
["2014-01-03","NOM PRENOM 281","CEL 99999999","99999999","Ok"]
["2014-01-03","NOM PRENOM 282","CNI C 9999999999 DU 99/99/99","","VIDE"]
["2014-01-03","NOM PRENOM 283","TEL 99.99.99.99","99999999","Ok"]
["2014-01-03","NOM PRENOM 284","TEL 99999999","99999999","Ok"]
["2014-01-03","NOM PRENOM 285","PASSEPORT MALI B9999999 DU 99/99/99","","VIDE"]
["2014-01-03","NOM PRENOM 286","TEL 99999999","99999999","Ok"]
["2014-01-03","NOM PRENOM 287",null,"","VIDE"]
["2014-01-03","NOM PRENOM 288","CEL 99999999","99999999","Ok"]
["2014-01-03","NOM PRENOM 289","TEL 99.99.99.99","99999999","Ok"]
["2014-01-03","NOM PRENOM 290","CNI N° C9999999999 DU 99/99/9999","","VIDE"]
["2014-01-03","NOM PRENOM 291","TEL 99999999","99999999","Ok"]
["2014-01-03","NOM PRENOM 292",null,"","VIDE"]
["2014-01-03","NOM PRENOM 293","CNI C9999.9999.99 DU 99/99/9999","","VIDE"]
["2014-01-03","NOM PRENOM 294","TEL 99.99.99.99","99999999","Ok"]
["2014-01-03","NOM PRENOM 295",null,"","VIDE"]
["2014-01-03","NOM PRENOM 296",99999999,"99999999","Ok"]
["2014-01-03","NOM PRENOM 297","CNI C 9999 9999 99 DU 99/99/99 - TEL 99999999","99999999","Ok"]
["2014-01-03","NOM PRENOM 298","CNI C9999999999 DU 99/99/9999 AU 99/99/9999","","VIDE"]
["2014-01-03","NOM PRENOM 299",null,"","VIDE"]
["2014-01-03","NOM PRENOM 300","TEL 99.99.99.99","99999999","Ok"]
["2014-01-03","NOM PRENOM 301",null,"","VIDE"]
["2014-01-03","NOM PRENOM 302","CEL 99999999","99999999","Ok"]
["2014-01-03","NOM PRENOM 303","CNI C 9999999999 DU 99/99/99","","VIDE"]
["2014-01-03","NOM PRENOM 304","TEL 99999999","99999999","Ok"]
["2014-01-03","NOM PRENOM 305",null,"","VIDE"]
["2014-01-03","NOM PRENOM 306","CNI C9999.9999.99 DU 99/99/9999","","VIDE"]
["2014-01-03","NOM PRENOM 307","TEL 99999999","99999999","Ok"]
["2014-01-03","NOM PRENOM 308","CNI C9999999999 DU 99/99/9999 AU 99/99/9999","","VIDE"]
["2014-01-03","NOM PRENOM 309","CNI C9999999999 DU 99/99/99 AU 99/99/99","","VIDE"]
["2014-01-03","NOM PRENOM 310","CNI N 9C 9999.9999.99 DU 99.99.9999","","VIDE"]
["2014-01-03","NOM PRENOM 311","PASSPORT N° 99AA99999 DU 99/99/9999","","VIDE"]
["2014-01-03","NOM PRENOM 312","ATTEST N 999/9999/99/99/PU-9 DU 99/99/99 AU 99/99/9999","","VIDE"]
["2014-01-03","NOM PRENOM 313","CNI N° C9999 9999 99 DU 99/99/9999 AU 99/99/9999","","VIDE"]
["2014-01-03","NOM PRENOM 314","TITR SEJOU FR N°99999999999CIV DU 99.99.99","","VIDE"]
["2014-01-03","NOM PRENOM 315","CNI N° C9999 9999 99 DU 99/99/9999 AU 99/99/9999","","VIDE"]
["2014-01-03","NOM PRENOM 316","CNI C9999.9999.99 DU 99/99/9999","","VIDE"]
["2014-01-03","NOM PRENOM 317","DU 99.99.99","","VIDE"]
["2014-01-03","NOM PRENOM 318","CEL 99999999","99999999","Ok"]
["2014-01-03","NOM PRENOM 319","TEL 99999999","99999999","Ok"]
["2014-01-03","NOM PRENOM 320","TEL 99.99.99.99","99999999","Ok"]
["2014-01-03","NOM PRENOM 321","PC 99-99-99999999 DU 99-99-9999","","VIDE"]
["2014-01-03","NOM PRENOM 322","TEL 99.99.99.99",{"$f":"gettel(C323)","v":"99999999"},{"$f":"IF(LEN(D323)=0,\"VIDE\",IF(LEN(D323)=8,\"Ok\",\"?\"))","v":"Ok"}]
["2014-01-03","NOM PRENOM 323",null,"","VIDE"]
["2014-01-03","NOM PRENOM 324","CNI C9999.9999.99 DU 99/99/9999","","VIDE"]
["2014-01-03","NOM PRENOM 325",null,"","VIDE"]
["2014-01-03","NOM PRENOM 326","TEL 99.99.99.99","99999999","Ok"]
["2014-01-03","NOM PRENOM 327","CIC N 9999999/ABFA/99 DU 99/99/99 AU 99/99/99","","VIDE"]
["2014-01-03","NOM PRENOM 328",null,"","VIDE"]
["2014-01-03","NOM PRENOM 329","TEL 99999999","99999999","Ok"]
["2014-01-03","NOM PRENOM 330","CNI N 9C 9999.9999.99 DU 99.99.9999","","VIDE"]
["2014-01-03","NOM PRENOM 331","CEL 99999999","99999999","Ok"]
["2014-01-03","NOM PRENOM 332","val 99/99/9999 cel 99999999","99999999","Ok"]
["2014-01-03","NOM PRENOM 333","CNI C9999999999 DU 99/99/9999 AU 99/99/9999","","VIDE"]
["2014-01-03","NOM PRENOM 334","CNI C9999999999 DU 99/99/9999 AU 99/99/9999","","VIDE"]
["2014-01-03","NOM PRENOM 335","CEL 99999999","99999999","Ok"]
["2014-01-03","NOM PRENOM 336",null,"","VIDE"]
["2014-01-03","NOM PRENOM 337","CEL 99.99.99.99","99999999","Ok"]
["2014-01-03","NOM PRENOM 338","TEL 99999999","99999999","Ok"]
["2014-01-03","NOM PRENOM 339","CNI C9999999999 DU 99/99/9999 AU 99/99/9999","","VIDE"]
["2014-01-03","NOM PRENOM 340",null,"","VIDE"]
["2014-01-03","NOM PRENOM 341","TEL 99.99.99.99","99999999","Ok"]
["2014-01-03","NOM PRENOM 342","CNI N9 C 9999.9999.99 DU 99.99.9999","","VIDE"]
["2014-01-03","NOM PRENOM 343","CNI C9999999999 DU 99-99-99 AU 99-99-99","","VIDE"]
["2014-01-03","NOM PRENOM 344","TEL 99.99.99.99","99999999","Ok"]
["2014-01-03","NOM PRENOM 345","CNI FRANCAISE 9999ABJ99999 DU 99/99/99 - TEL 99999999","99999999","Ok"]
["2014-01-03","NOM PRENOM 346","CNI N 9C 9999.9999.99 DU 99.99.9999","","VIDE"]
["2014-01-03","NOM PRENOM 347","CEL 99.99.99.99","99999999","Ok"]
["2014-01-03","NOM PRENOM 348",null,"","VIDE"]
["2014-01-03","NOM PRENOM 349","CNI N 9C 9999.9999.99 DU 99.99.9999 YOCOBOUE","","VIDE"]
["2014-01-03","NOM PRENOM 350",null,"","VIDE"]
["2014-01-03","NOM PRENOM 351","TEL 99999999","99999999","Ok"]
["2014-01-03","NOM PRENOM 352","CEL 99999999","99999999","Ok"]
["2014-01-03","NOM PRENOM 353","TEL 99999999","99999999","Ok"]
["2014-01-03","NOM PRENOM 354","CEL 99999999","99999999","Ok"]
["2014-01-03","NOM PRENOM 355","TEL 99999999","99999999","Ok"]
["2014-01-03","NOM PRENOM 356",null,"","VIDE"]
["2014-01-03","NOM PRENOM 357",null,"","VIDE"]
["2014-01-03","NOM PRENOM 358","TEL:99-99-99-99","99999999","Ok"]
["2014-01-03","NOM PRENOM 359",null,"","VIDE"]
["2014-01-03","NOM PRENOM 360","CNI N° C9999999999 DU 99/99/9999","","VIDE"]
["2014-01-03","NOM PRENOM 361","CNI C9999999999 DU 99.99.9999","","VIDE"]
["2014-01-03","NOM PRENOM 362",null,"","VIDE"]
["2014-01-03","NOM PRENOM 363",null,"","VIDE"]
["2014-01-03","NOM PRENOM 364","CEL:99999999","99999999","Ok"]
["2014-01-03","NOM PRENOM 365","TEL 99.99.99.99","99999999","Ok"]
["2014-01-03","NOM PRENOM 366","DU 99.99.99","","VIDE"]
["2014-01-03","NOM PRENOM 367",null,"","VIDE"]
["2014-01-03","NOM PRENOM 368","TEL 99.99.99.99","99999999","Ok"]
["2014-01-03","NOM PRENOM 369","TEL 99999999","99999999","Ok"]
["2014-01-03","NOM PRENOM 370","9999 9999 99 DU 99.99.99 AU 99.99.99","","VIDE"]
["2014-01-03","NOM PRENOM 371","TEL 99.99.99.99","99999999","Ok"]
["2014-01-03","NOM PRENOM 372","CNI C9999.9999.99 DU 99/99/9999","","VIDE"]
["2014-01-03","NOM PRENOM 373","TEL 99999999","99999999","Ok"]
["2014-01-03","NOM PRENOM 374","CEL 99999999","99999999","Ok"]
["2014-01-03","NOM PRENOM 375","CNI C9999999999 DU 99/99/9999 AU 99/99/9999","","VIDE"]
["2014-01-03","NOM PRENOM 376","TEL 99.99.99.99","99999999","Ok"]
["2014-01-03","NOM PRENOM 377","CNI C9999.9999.99 DU 99/99/9999","","VIDE"]
["2014-01-03","NOM PRENOM 378","ATTEST N 999/9999/99/9999/CPSPAA DU 99/99/99 AU 99/99/99","","VIDE"]
["2014-01-03","NOM PRENOM 379","TEL 99999999","99999999","Ok"]
["2014-01-03","NOM PRENOM 380","val 99/99/9999","","VIDE"]
["2014-01-03","NOM PRENOM 381","CNI C9999999999 DU 99/99/9999 AU 99/99/9999","","VIDE"]
["2014-01-03","NOM PRENOM 382","CNI C9999999999 DU 99/99/9999","","VIDE"]
["2014-01-03","NOM PRENOM 383","CNI C9999999999 DU 99/99/9999","","VIDE"]
["2014-01-03","NOM PRENOM 384","CNI C9999999999 DU 99/99/9999 AU 99/99/9999","","VIDE"]
["2014-01-03","NOM PRENOM 385",null,"","VIDE"]
["2014-01-03","NOM PRENOM 386","TEL 99999999",{"$f":"gettel(C387)","v":"99999999"},{"$f":"IF(LEN(D387)=0,\"VIDE\",IF(LEN(D387)=8,\"Ok\",\"?\"))","v":"Ok"}]
["2014-01-03","NOM PRENOM 387","TEL 99999999","99999999","Ok"]
["2014-01-03","NOM PRENOM 388","TEL 99999999","99999999","Ok"]
["2014-01-03","NOM PRENOM 389","TEL 99999999","99999999","Ok"]
["2014-01-03","NOM PRENOM 390","DU 99.99.9999","","VIDE"]
["2014-01-03","NOM PRENOM 391",null,"","VIDE"]
["2014-01-03","NOM PRENOM 392","DU 99/99/9999 AU 99/99/9999","","VIDE"]
["2014-01-03","NOM PRENOM 393","TEL 99999999","99999999","Ok"]
["2014-01-03","NOM PRENOM 394","val 99/99/9999  cel 99999999","99999999","Ok"]
["2014-01-03","NOM PRENOM 395","TEL 99999999","99999999","Ok"]
["2014-01-03","NOM PRENOM 396","TEL 99.99.99.99","99999999","Ok"]
["2014-01-03","NOM PRENOM 397","TEL 99999999","99999999","Ok"]
["2014-01-03","NOM PRENOM 398","TEL 99.99.99.99","99999999","Ok"]
["2014-01-03","NOM PRENOM 399","PERS BIAO MTLE 9999","","VIDE"]
["2014-01-03","NOM PRENOM 400",null,"","VIDE"]
["2014-01-03","NOM PRENOM 401","CELL 99999999","99999999","Ok"]
["2014-01-03","NOM PRENOM 402","TEL 99999999","99999999","Ok"]
["2014-01-03","NOM PRENOM 403","TEL 99999999","99999999","Ok"]
["2014-01-03","NOM PRENOM 404","TEL 99999999","99999999","Ok"]
["2014-01-03","NOM PRENOM 405",null,"","VIDE"]
["2014-01-03","NOM PRENOM 406",null,"","VIDE"]
["2014-01-03","NOM PRENOM 407","TEL 99999999","99999999","Ok"]
["2014-01-03","NOM PRENOM 408",null,"","VIDE"]
["2014-01-03","NOM PRENOM 409","CEL:99999999","99999999","Ok"]
["2014-01-03","NOM PRENOM 410","CNI C9999999999 DU 99/99/9999 AU 99/99/9999","","VIDE"]
["2014-01-03","NOM PRENOM 411","CEL 99999999","99999999","Ok"]
["2014-01-03","NOM PRENOM 412",null,"","VIDE"]
["2014-01-03","NOM PRENOM 413","DU 99/99/9999 AU 99/99/9999","","VIDE"]
["2014-01-03","NOM PRENOM 414","TEL 99999999","99999999","Ok"]
["2014-01-03","NOM PRENOM 415","CNI C 9999 9999 99 DU 99/99/99 - TEL 99999999","99999999","Ok"]
["2014-01-03","NOM PRENOM 416","TEL 99.99.99.99","99999999","Ok"]
["2014-01-03","NOM PRENOM 417",null,"","VIDE"]
["2014-01-03","NOM PRENOM 418","TEL 99.99.99.99","99999999","Ok"]
["2014-01-03","NOM PRENOM 419","CNI N 9C 9999.9999.99 DU 99.99.9999","","VIDE"]
["2014-01-03","NOM PRENOM 420","TEL 99999999","99999999","Ok"]
["2014-01-03","NOM PRENOM 421","CEL 99.99.99.99","99999999","Ok"]
["2014-01-03","NOM PRENOM 422","DU 99/99/9999 AU 99/99/9999","","VIDE"]
["2014-01-03","NOM PRENOM 423","CNI N9 C 9999.9999.99 DU 99.99.9999 ADZOPE","","VIDE"]
["2014-01-03","NOM PRENOM 424","CEL 99.99.99.99","99999999","Ok"]
["2014-01-03","NOM PRENOM 425","CNI C 9999999999 DU 99/99/99","","VIDE"]
["2014-01-03","NOM PRENOM 426",99999999,"99999999","Ok"]
["2014-01-03","NOM PRENOM 427",null,"","VIDE"]
["2014-01-03","NOM PRENOM 428","TEL 99.99.99.99","99999999","Ok"]
["2014-01-03","NOM PRENOM 429","TEL 99999999","99999999","Ok"]
["2014-01-03","NOM PRENOM 430",null,"","VIDE"]
["2014-01-03","NOM PRENOM 431",99999999,"99999999","Ok"]
["2014-01-03","NOM PRENOM 432","CNI C9999999999 DU 99-99-99 AU 99-99-99","","VIDE"]
["2014-01-03","NOM PRENOM 433","TEL 99.99.99.99","99999999","Ok"]
["2014-01-03","NOM PRENOM 434","CNI C 9999999999 DU 99/99/99","","VIDE"]
["2014-01-03","NOM PRENOM 435","TEL 99999999","99999999","Ok"]
["2014-01-03","NOM PRENOM 436","CNI C 9999999999 DU 99/99/99","","VIDE"]
["2014-01-03","NOM PRENOM 437","CNI N9 C 9999.9999.99 DU 99.99.9999","","VIDE"]
["2014-01-03","NOM PRENOM 438",null,"","VIDE"]
["2014-01-03","NOM PRENOM 439","cel 99999999","99999999","Ok"]
["2014-01-03","NOM PRENOM 440","TEL 99999999","99999999","Ok"]
["2014-01-03","NOM PRENOM 441","CNI C9999.9999.99 DU 99.99.99","","VIDE"]
["2014-01-03","NOM PRENOM 442",null,"","VIDE"]
["2014-01-03","NOM PRENOM 443","TEL 99.99.99.99","99999999","Ok"]
["2014-01-03","NOM PRENOM 444","TEL 99999999","99999999","Ok"]
["2014-01-03","NOM PRENOM 445","TEL 99999999","99999999","Ok"]
["2014-01-03","NOM PRENOM 446","pc n 99-99-99999999 etablie le 99/99/9999","","VIDE"]
["2014-01-03","NOM PRENOM 447","TEL 99.99.99.99","99999999","Ok"]
["2014-01-03","NOM PRENOM 448","CNI N9 C 9999.9999.99 DU 99.99.9999","","VIDE"]
["2014-01-03","NOM PRENOM 449","CNI N 9C 9999.9999.99 DU 99.99.9999","","VIDE"]
["2014-01-03","NOM PRENOM 450","CNI C9999.9999.99 DU 99/99/9999",{"$f":"gettel(C451)","v":""},{"$f":"IF(LEN(D451)=0,\"VIDE\",IF(LEN(D451)=8,\"Ok\",\"?\"))","v":"VIDE"}]
["2014-01-03","NOM PRENOM 451",null,"","VIDE"]
["2014-01-03","NOM PRENOM 452","TEL 99999999","99999999","Ok"]
["2014-01-03","NOM PRENOM 453","CNI SIERRA LEONE SL99999999 DU 99.99.9999","","VIDE"]
["2014-01-03","NOM PRENOM 454","tel 99999999","99999999","Ok"]
["2014-01-03","NOM PRENOM 455",null,"","VIDE"]
["2014-01-03","NOM PRENOM 456","9999 99 DU 99.99.99 AU 99.99.99","","VIDE"]
["2014-01-03","NOM PRENOM 457","CEL 99999999","99999999","Ok"]
["2014-01-03","NOM PRENOM 458","TEL 99999999","99999999","Ok"]
["2014-01-03","NOM PRENOM 459","TEL 99.99.99.99","99999999","Ok"]
["2014-01-03","NOM PRENOM 460",null,"","VIDE"]
["2014-01-03","NOM PRENOM 461","TEL 99.99.99.99","99999999","Ok"]
["2014-01-03","NOM PRENOM 462","CEL 99999999","99999999","Ok"]
["2014-01-03","NOM PRENOM 463","DU 99/99/9999 AU 99/99/9999","","VIDE"]
["2014-01-03","NOM PRENOM 464",99999999,"99999999","Ok"]
["2014-01-03","NOM PRENOM 465","CNI N° C9999999999 DU 99/99/9999","","VIDE"]
["2014-01-03","NOM PRENOM 466","9999 ET PERMIS DE CONDUIRE N°99-99-99999999","","VIDE"]
["2014-01-03","NOM PRENOM 467","DU 99-99-9999 AU 99-99-9999","","VIDE"]
["2014-01-03","NOM PRENOM 468","CEL 99999999","99999999","Ok"]
["2014-01-03","NOM PRENOM 469","DU 99/99/9999 AU 99/99/9999","","VIDE"]
["2014-01-03","NOM PRENOM 470",null,"","VIDE"]
["2014-01-03","NOM PRENOM 471","9999 9999 99 DU 99.99.99 AU 99.99.99","","VIDE"]
["2014-01-03","NOM PRENOM 472","tel 99999999","99999999","Ok"]
["2014-01-03","NOM PRENOM 473",null,"","VIDE"]
["2014-01-03","NOM PRENOM 474","CEL 99.99.99.99","99999999","Ok"]
["2014-01-03","NOM PRENOM 475",null,"","VIDE"]
["2014-01-03","NOM PRENOM 476","CEL 99999999","99999999","Ok"]
["2014-01-03","NOM PRENOM 477","TEL 99.99.99.99","99999999","Ok"]
["2014-01-03","NOM PRENOM 478",null,"","VIDE"]
["2014-01-03","NOM PRENOM 479",null,"","VIDE"]
["2014-01-03","NOM PRENOM 480","TEL 99.99.99.99","99999999","Ok"]
["2014-01-03","NOM PRENOM 481","ET PASSEPORT N°99AC99999 EXPIRE LE 99.99.9999","","VIDE"]
["2014-01-03","NOM PRENOM 482","TEL 99999999","99999999","Ok"]
["2014-01-03","NOM PRENOM 483","TEL 99.99.99.99","99999999","Ok"]
["2014-01-03","NOM PRENOM 484","DU 99/99/9999 AU 99/99/9999","","VIDE"]
["2014-01-03","NOM PRENOM 485","CNI N9 C 9999.9999.99 DU 99.99.9999 ABOISSO","","VIDE"]
["2014-01-03","NOM PRENOM 486",null,"","VIDE"]
["2014-01-03","NOM PRENOM 487","CNI 999999999999 DU 99/99/9999 AU 99/99/999","","VIDE"]
["2014-01-03","NOM PRENOM 488","TEL 99.99.99.99","99999999","Ok"]
["2014-01-03","NOM PRENOM 489","TEL 99999999","99999999","Ok"]
["2014-01-03","NOM PRENOM 490","9999 9999 99 DU 99.99.99 AU 99.99.99","","VIDE"]
["2014-01-03","NOM PRENOM 491","TEL 99999999","99999999","Ok"]
["2014-01-03","NOM PRENOM 492",null,"","VIDE"]
["2014-01-03","NOM PRENOM 493",null,"","VIDE"]
["2014-01-03","NOM PRENOM 494","TEL 99.99.99.99","99999999","Ok"]
["2014-01-03","NOM PRENOM 495","TEL 99.99.99.99","99999999","Ok"]
["2014-01-03","NOM PRENOM 496","CNI N 9C 9999.9999.99 DU 99.99.9999","","VIDE"]
["2014-01-03","NOM PRENOM 497",null,"","VIDE"]
["2014-01-03","NOM PRENOM 498","PC 99-99-99999999 DU 99/99/9999","","VIDE"]
["2014-01-03","NOM PRENOM 499","CEL 99999999","99999999","Ok"]
["2014-01-03","NOM PRENOM 500","TEL 99.99.99.99","99999999","Ok"]
["2014-01-03","NOM PRENOM 501","TEL 99.99.99.99","99999999","Ok"]
["2014-01-03","NOM PRENOM 502","TEL 99999999","99999999","Ok"]
["2014-01-03","NOM PRENOM 503","PASSPORT N° 99AB99999 DU 99/99/9999","","VIDE"]
["2014-01-03","NOM PRENOM 504","TEL 99.99.99.99","99999999","Ok"]
["2014-01-03","NOM PRENOM 505","CNI C9999999999 DU 99/99/9999 AU 99/99/9999","","VIDE"]
["2014-01-03","NOM PRENOM 506",99999999,"99999999","Ok"]
["2014-01-03","NOM PRENOM 507","TEL 99.99.99.99","99999999","Ok"]
["2014-01-03","NOM PRENOM 508","VAL99/99/9999 CEL99999999","99999999","Ok"]
["2014-01-03","NOM PRENOM 509","TEL 99999999","99999999","Ok"]
["2014-01-03","NOM PRENOM 510","PC 99-99-99999999 DU 99/99/9999","","VIDE"]
["2014-01-03","NOM PRENOM 511","TEL 99999999","99999999","Ok"]
["2014-01-03","NOM PRENOM 512",99999999,"99999999","Ok"]
["2014-01-03","NOM PRENOM 513",null,"","VIDE"]
["2014-01-03","NOM PRENOM 514","TEL 99.99.99.99",{"$f":"gettel(C515)","v":"99999999"},{"$f":"IF(LEN(D515)=0,\"VIDE\",IF(LEN(D515)=8,\"Ok\",\"?\"))","v":"Ok"}]
["2014-01-03","NOM PRENOM 515",null,"","VIDE"]
["2014-01-03","NOM PRENOM 516",null,"","VIDE"]
["2014-01-03","NOM PRENOM 517",null,"","VIDE"]
["2014-01-03","NOM PRENOM 518","CNI N 9C 9999.9999.99 DU 99.99.9999","","VIDE"]
["2014-01-03","NOM PRENOM 519","PC 99-99-99999999 DU 99/99/9999 + AI 999/9999/99/999/PU9YAKRO","","VIDE"]
["2014-01-03","NOM PRENOM 520","TEL 99999999","99999999","Ok"]
["2014-01-03","NOM PRENOM 521","TEL 99999999","99999999","Ok"]
["2014-01-03","NOM PRENOM 522","CEL 99999999","99999999","Ok"]
["2014-01-03","NOM PRENOM 523","CEL 99999999","99999999","Ok"]
["2014-01-03","NOM PRENOM 524",null,"","VIDE"]
["2014-01-03","NOM PRENOM 525","TEL 99999999","99999999","Ok"]
["2014-01-03","NOM PRENOM 526",null,"","VIDE"]
["2014-01-03","NOM PRENOM 527",null,"","VIDE"]
["2014-01-03","NOM PRENOM 528","krouma moussa","","VIDE"]
["2014-01-03","NOM PRENOM 529",null,"","VIDE"]
["2014-01-03","NOM PRENOM 530","bamba abdoulaye","","VIDE"]
["2014-01-03","NOM PRENOM 531","traore idrissa","","VIDE"]
["2014-01-03","NOM PRENOM 532",null,"","VIDE"]
["2014-01-03","NOM PRENOM 533","TEL 99999999","99999999","Ok"]
["2014-01-03","NOM PRENOM 534",null,"","VIDE"]
["2014-01-03","NOM PRENOM 535",null,"","VIDE"]
["2014-01-03","NOM PRENOM 536","TEL 99.99.99.99","99999999","Ok"]
["2014-01-03","NOM PRENOM 537","TEL 99999999","99999999","Ok"]
["2014-01-03","NOM PRENOM 538","TEL 99999999","99999999","Ok"]
["2014-01-03","NOM PRENOM 539","TEL 99999999","99999999","Ok"]
["2014-01-03","NOM PRENOM 540","TEL 99999999","99999999","Ok"]
["2014-01-03","NOM PRENOM 541",null,"","VIDE"]
["2014-01-03","NOM PRENOM 542","TEL 99999999","99999999","Ok"]
["2014-01-03","NOM PRENOM 543",null,"","VIDE"]
["2014-01-03","NOM PRENOM 544","tel 99999999","99999999","Ok"]
["2014-01-03","NOM PRENOM 545","TEL:99-99-99-99","99999999","Ok"]
["2014-01-03","NOM PRENOM 546",null,"","VIDE"]
["2014-01-03","NOM PRENOM 547",null,"","VIDE"]
["2014-01-03","NOM PRENOM 548",99999999,"99999999","Ok"]
["2014-01-03","NOM PRENOM 549",null,"","VIDE"]
["2014-01-03","NOM PRENOM 550",null,"","VIDE"]
["2014-01-03","NOM PRENOM 551","CNI C9999999999 DU 99/99/9999","","VIDE"]
["2014-01-03","NOM PRENOM 552","CNI C 9999999999 DU 99/99/99","","VIDE"]
["2014-01-03","NOM PRENOM 553","RABDO BOUREIMA","","VIDE"]
["2014-01-03","NOM PRENOM 554","issoufou oumarou","","VIDE"]
["2014-01-03","NOM PRENOM 555",null,"","VIDE"]
["2014-01-03","NOM PRENOM 556","TEL 99999999","99999999","Ok"]
["2014-01-03","NOM PRENOM 557",null,"","VIDE"]
["2014-01-03","NOM PRENOM 558","TEL 99999999","99999999","Ok"]
["2014-01-03","NOM PRENOM 559",null,"","VIDE"]
["2014-01-03","NOM PRENOM 560","ATT N9 9999.999/99.99.9999/PU.9 BKE","","VIDE"]
["2014-01-03","NOM PRENOM 561",null,"","VIDE"]
["2014-01-03","NOM PRENOM 562",null,"","VIDE"]
["2014-01-03","NOM PRENOM 563","TEL 99999999","99999999","Ok"]
["2014-01-03","NOM PRENOM 564",null,"","VIDE"]
["2014-01-03","NOM PRENOM 565",null,"","VIDE"]
["2014-01-03","NOM PRENOM 566","CISSE HAMADOU","","VIDE"]
["2014-01-03","NOM PRENOM 567",null,"","VIDE"]
["2014-01-03","NOM PRENOM 568",99999999,"99999999","Ok"]
["2014-01-03","NOM PRENOM 569",null,"","VIDE"]
["2014-01-03","NOM PRENOM 570",null,"","VIDE"]
["2014-01-03","NOM PRENOM 571",null,"","VIDE"]
["2014-01-03","NOM PRENOM 572",null,"","VIDE"]
["2014-01-03","NOM PRENOM 573","TEL 99.99.99.99","99999999","Ok"]
["2014-01-03","NOM PRENOM 574","TEL 99999999","99999999","Ok"]
["2014-01-03","NOM PRENOM 575",null,"","VIDE"]
["2014-01-03","NOM PRENOM 576",null,"","VIDE"]
["2014-01-06","NOM PRENOM 577","CEL 99.99.99.99","99999999","Ok"]
["2014-01-06","NOM PRENOM 578","CELL 99999999",{"$f":"gettel(C579)","v":"99999999"},{"$f":"IF(LEN(D579)=0,\"VIDE\",IF(LEN(D579)=8,\"Ok\",\"?\"))","v":"Ok"}]
["2014-01-06","NOM PRENOM 579",null,"","VIDE"]
["2014-01-06","NOM PRENOM 580","TEL 99.99.99.99","99999999","Ok"]
["2014-01-06","NOM PRENOM 581","CEL 99999999","99999999","Ok"]
["2014-01-06","NOM PRENOM 582",null,"","VIDE"]
["2014-01-06","NOM PRENOM 583","CEL 99.99.99.99","99999999","Ok"]
["2014-01-06","NOM PRENOM 584","CNI N9 C 9999.9999.99 DU 99.99.9999","","VIDE"]
["2014-01-06","NOM PRENOM 585","cni  du benin n 999999999 val 99/99/9999","","VIDE"]
["2014-01-06","NOM PRENOM 586","AI N° 999999999999H DU 99.99.9999","","VIDE"]
["2014-01-06","NOM PRENOM 587",null,"","VIDE"]
["2014-01-06","NOM PRENOM 588","TEL 99.99.99.99","99999999","Ok"]
["2014-01-06","NOM PRENOM 589","DU 99-99-9999 AU 99-99-9999","","VIDE"]
["2014-01-06","NOM PRENOM 590","PC N9 99.99.99999999 DU 99.99.9999","","VIDE"]
["2014-01-06","NOM PRENOM 591","TEL 99999999","99999999","Ok"]
["2014-01-06","NOM PRENOM 592","TEL 99.99.99.99","99999999","Ok"]
["2014-01-06","NOM PRENOM 593","CEL 99999999","99999999","Ok"]
["2014-01-06","NOM PRENOM 594",null,"","VIDE"]
["2014-01-06","NOM PRENOM 595","CEL 99.99.99.99","99999999","Ok"]
["2014-01-06","NOM PRENOM 596",null,"","VIDE"]
["2014-01-06","NOM PRENOM 597","CEL:99999999","99999999","Ok"]
["2014-01-06","NOM PRENOM 598","CNI C9999.9999.99 DU 99/99/9999","","VIDE"]
["2014-01-06","NOM PRENOM 599",null,"","VIDE"]
["2014-01-06","NOM PRENOM 600",null,"","VIDE"]
["2014-01-06","NOM PRENOM 601","TEL 99.99.99.99","99999999","Ok"]
["2014-01-06","NOM PRENOM 602","GBOTOGNON CNI C9999.9999.99 DU 99.99.99","","VIDE"]
["2014-01-06","NOM PRENOM 603","CEL 99999999","99999999","Ok"]
["2014-01-06","NOM PRENOM 604","CNI 999999999999 DU 99-99-99","","VIDE"]
["2014-01-06","NOM PRENOM 605",null,"","VIDE"]
["2014-01-06","NOM PRENOM 606",null,"","VIDE"]
["2014-01-06","NOM PRENOM 607","CNI C9999.9999.99 DU 99/99/9999","","VIDE"]
["2014-01-06","NOM PRENOM 608","TEL 99999999","99999999","Ok"]
["2014-01-06","NOM PRENOM 609","CNI N 9C 9999.9999.99 DU 99.99.9999","","VIDE"]
["2014-01-06","NOM PRENOM 610",null,"","VIDE"]
["2014-01-06","NOM PRENOM 611","TEL 99.99.99.99","99999999","Ok"]
["2014-01-06","NOM PRENOM 612","cel 99999999","99999999","Ok"]
["2014-01-06","NOM PRENOM 613","TEL 99999999","99999999","Ok"]
["2014-01-06","NOM PRENOM 614","tel 99.99.99.99","99999999","Ok"]
["2014-01-06","NOM PRENOM 615",null,"","VIDE"]
["2014-01-06","NOM PRENOM 616","TEL 99.99.99.99","99999999","Ok"]
["2014-01-06","NOM PRENOM 617","CNI C9999.9999.99 DU 99.99.99","","VIDE"]
["2014-01-06","NOM PRENOM 618","CNI C 9999999999 DU 99/99/99","","VIDE"]
["2014-01-06","NOM PRENOM 619",null,"","VIDE"]
["2014-01-06","NOM PRENOM 620","TEL 99999999","99999999","Ok"]
["2014-01-06","NOM PRENOM 621","cel 99999999","99999999","Ok"]
["2014-01-06","NOM PRENOM 622",null,"","VIDE"]
["2014-01-06","NOM PRENOM 623","CELL 99999999","99999999","Ok"]
["2014-01-06","NOM PRENOM 624","CNI N9 C 9999.9999.99 DU 99.99.9999","","VIDE"]
["2014-01-06","NOM PRENOM 625","TEL 99.99.99.99","99999999","Ok"]
["2014-01-06","NOM PRENOM 626","TEL 99.99.99.99","99999999","Ok"]
["2014-01-06","NOM PRENOM 627","CNI N9 C 9999.9999.99 DU 99.99.9999","","VIDE"]
["2014-01-06","NOM PRENOM 628",null,"","VIDE"]
["2014-01-06","NOM PRENOM 629","TEL 99.99.99.99","99999999","Ok"]
["2014-01-06","NOM PRENOM 630",null,"","VIDE"]
["2014-01-06","NOM PRENOM 631","TEL 99.99.99.99","99999999","Ok"]
["2014-01-06","NOM PRENOM 632","du 99/99/9999 au 99/99/9999","","VIDE"]
["2014-01-06","NOM PRENOM 633","CNI N9 C 9999.9999.99 DU 99.99.9999","","VIDE"]
["2014-01-06","NOM PRENOM 634","DU 99.99.99","","VIDE"]
["2014-01-06","NOM PRENOM 635","CEL 99999999","99999999","Ok"]
["2014-01-06","NOM PRENOM 636","EPSE BAYAI CNI C9999.9999.99 DU 99.99.99","","VIDE"]
["2014-01-06","NOM PRENOM 637","CEL 99999999","99999999","Ok"]
["2014-01-06","NOM PRENOM 638",null,"","VIDE"]
["2014-01-06","NOM PRENOM 639",null,"","VIDE"]
["2014-01-06","NOM PRENOM 640","TITRE DE SEJOUR N° 9999999/99-9999/MI/ONI/DIE/99 VAL 99/99/9999","","VIDE"]
["2014-01-06","NOM PRENOM 641","CNI C9999.9999.99 DU 99/99/9999","","VIDE"]
["2014-01-06","NOM PRENOM 642","TEL 99.99.99.99",{"$f":"gettel(C643)","v":"99999999"},{"$f":"IF(LEN(D643)=0,\"VIDE\",IF(LEN(D643)=8,\"Ok\",\"?\"))","v":"Ok"}]
["2014-01-06","NOM PRENOM 643","TEL 99999999","99999999","Ok"]
["2014-01-06","NOM PRENOM 644","VAL99/99/9999 CEL99999999","99999999","Ok"]
["2014-01-06","NOM PRENOM 645","tel","","VIDE"]
["2014-01-06","NOM PRENOM 646","CNI C9999.9999.99 DU 99/99/9999","","VIDE"]
["2014-01-06","NOM PRENOM 647","TEL 99.99.99.99","99999999","Ok"]
["2014-01-06","NOM PRENOM 648",null,"","VIDE"]
["2014-01-06","NOM PRENOM 649","CEL 99999999","99999999","Ok"]
["2014-01-06","NOM PRENOM 650","TEL 99.99.99.99","99999999","Ok"]
["2014-01-06","NOM PRENOM 651","TEL 99.99.99.99","99999999","Ok"]
["2014-01-06","NOM PRENOM 652",null,"","VIDE"]
["2014-01-06","NOM PRENOM 653","CNI C 9999999999 DU 99-99-99","","VIDE"]
["2014-01-06","NOM PRENOM 654","CNI C9999999999 DU 99/99/9999 AU 99/99/9999","","VIDE"]
["2014-01-06","NOM PRENOM 655","tel 99.99.99.99","99999999","Ok"]
["2014-01-06","NOM PRENOM 656",null,"","VIDE"]
["2014-01-06","NOM PRENOM 657","PASS N°99AA99999 DU 99.99.9999","","VIDE"]
["2014-01-06","NOM PRENOM 658",null,"","VIDE"]
["2014-01-06","NOM PRENOM 659","TEL 99.99.99.99","99999999","Ok"]
["2014-01-06","NOM PRENOM 660","TEL 99999999","99999999","Ok"]
["2014-01-06","NOM PRENOM 661","CNI N C 9999 9999 99 DU 99.99.99 AU 99.99.99","","VIDE"]
["2014-01-06","NOM PRENOM 662","TEL 99.99.99.99","99999999","Ok"]
["2014-01-06","NOM PRENOM 663","TEL 99.99.99.99","99999999","Ok"]
["2014-01-06","NOM PRENOM 664",null,"","VIDE"]
["2014-01-06","NOM PRENOM 665","TEL 99999999","99999999","Ok"]
["2014-01-06","NOM PRENOM 666","CNI C 9999999999 DU 99/99/9999 AU 99/99/9999","","VIDE"]
["2014-01-06","NOM PRENOM 667",99999999,"99999999","Ok"]
["2014-01-06","NOM PRENOM 668",null,"","VIDE"]
["2014-01-06","NOM PRENOM 669","TEL 99.99.99.99","99999999","Ok"]
["2014-01-06","NOM PRENOM 670",null,"","VIDE"]
["2014-01-06","NOM PRENOM 671","CEL 99.99.99.99","99999999","Ok"]
["2014-01-06","NOM PRENOM 672",null,"","VIDE"]
["2014-01-06","NOM PRENOM 673","TEL 99.99.99.99","99999999","Ok"]
["2014-01-06","NOM PRENOM 674","TEL 99.99.99.99","99999999","Ok"]
["2014-01-06","NOM PRENOM 675","TEL 99.99.99.99","99999999","Ok"]
["2014-01-06","NOM PRENOM 676","VAL99/99/9999 CEL99999999","99999999","Ok"]
["2014-01-06","NOM PRENOM 677","9999 9999 99 DU 99.99.99 AU 99.99.99","","VIDE"]
["2014-01-06","NOM PRENOM 678",null,"","VIDE"]
["2014-01-06","NOM PRENOM 679","TEL 99999999","99999999","Ok"]
["2014-01-06","NOM PRENOM 680","CEL:99999999","99999999","Ok"]
["2014-01-06","NOM PRENOM 681",null,"","VIDE"]
["2014-01-06","NOM PRENOM 682","tel 99.99.99.99","99999999","Ok"]
["2014-01-06","NOM PRENOM 683",null,"","VIDE"]
["2014-01-06","NOM PRENOM 684","CEL 99999999","99999999","Ok"]
["2014-01-06","NOM PRENOM 685","du 99/99/9999 au 99/99/9999","","VIDE"]
["2014-01-06","NOM PRENOM 686","TEL 99 99 99 99","99999999","Ok"]
["2014-01-06","NOM PRENOM 687",null,"","VIDE"]
["2014-01-06","NOM PRENOM 688","TEL 99999999","99999999","Ok"]
["2014-01-06","NOM PRENOM 689","PC 99-99-99999999 DU 99/99/9999 + AI 9999-999/99-99/SP-BAZ","","VIDE"]
["2014-01-06","NOM PRENOM 690","CEL 99999999","99999999","Ok"]
["2014-01-06","NOM PRENOM 691","TEL 99999999","99999999","Ok"]
["2014-01-06","NOM PRENOM 692","TEL 99999999","99999999","Ok"]
["2014-01-06","NOM PRENOM 693","CNI C9999.9999.99 DU 99/99/9999","","VIDE"]
["2014-01-06","NOM PRENOM 694","CNI N° C9999999999 DU 99/99/9999","","VIDE"]
["2014-01-06","NOM PRENOM 695","CNI C9999.9999.99 DU 99/99/9999","","VIDE"]
["2014-01-06","NOM PRENOM 696","TEL 99999999","99999999","Ok"]
["2014-01-06","NOM PRENOM 697","CNI C9999.9999.99 DU 99/99/9999","","VIDE"]
["2014-01-06","NOM PRENOM 698","CNI C9999999999 DU 99/99/9999 AU 99/99/9999","","VIDE"]
["2014-01-06","NOM PRENOM 699","CNI C9999.9999.99 DU 99.99.99","","VIDE"]
["2014-01-06","NOM PRENOM 700",99999999,"99999999","Ok"]
["2014-01-06","NOM PRENOM 701","CEL 99999999","99999999","Ok"]
["2014-01-06","NOM PRENOM 702","+ CARTE NINA 999CI999999999P DU 99/99/9999","","VIDE"]
["2014-01-06","NOM PRENOM 703",null,"","VIDE"]
["2014-01-06","NOM PRENOM 704","CEL 99999999","99999999","Ok"]
["2014-01-06","NOM PRENOM 705","TEL 99.99.99.99","99999999","Ok"]
["2014-01-06","NOM PRENOM 706","CEL99999999",{"$f":"gettel(C707)","v":"99999999"},{"$f":"IF(LEN(D707)=0,\"VIDE\",IF(LEN(D707)=8,\"Ok\",\"?\"))","v":"Ok"}]
["2014-01-06","NOM PRENOM 707","PASS N 999999999 DU 99/99/99 AU 99/99/99","","VIDE"]
["2014-01-06","NOM PRENOM 708","DU 99/99/9999","","VIDE"]
["2014-01-06","NOM PRENOM 709",99999999,"99999999","Ok"]
["2014-01-06","NOM PRENOM 710","TEL 99999999","99999999","Ok"]
["2014-01-06","NOM PRENOM 711","TEL 99.99.99.99","99999999","Ok"]
["2014-01-06","NOM PRENOM 712","CNI C9999999999 DU 99/99/9999 AU 99/99/9999","","VIDE"]
["2014-01-06","NOM PRENOM 713","CNI C9999.9999.99 DU 99/99/9999","","VIDE"]
["2014-01-06","NOM PRENOM 714","CEL 99.99.99.99","99999999","Ok"]
["2014-01-06","NOM PRENOM 715","TEL 99.99.99.99","99999999","Ok"]
["2014-01-06","NOM PRENOM 716","CNI C9999999999 DU 99/99/9999 AU 99/99/9999","","VIDE"]
["2014-01-06","NOM PRENOM 717","TEL 99999999","99999999","Ok"]
["2014-01-06","NOM PRENOM 718","TEL 99.99.99.99","99999999","Ok"]
["2014-01-06","NOM PRENOM 719","CNI C9999.9999.99 DU 99/99/9999","","VIDE"]
["2014-01-06","NOM PRENOM 720","TEL 99.99.99.99","99999999","Ok"]
["2014-01-06","NOM PRENOM 721","TEL 99999999","99999999","Ok"]
["2014-01-06","NOM PRENOM 722","CELL 99999999","99999999","Ok"]
["2014-01-06","NOM PRENOM 723","CEL 99999999","99999999","Ok"]
["2014-01-06","NOM PRENOM 724","CEL 99999999","99999999","Ok"]
["2014-01-06","NOM PRENOM 725","CEL 99999999","99999999","Ok"]
["2014-01-06","NOM PRENOM 726","CEL 99999999","99999999","Ok"]
["2014-01-06","NOM PRENOM 727","MLE 9999","","VIDE"]
["2014-01-06","NOM PRENOM 728","CEL 99.99.99.99","99999999","Ok"]
["2014-01-06","NOM PRENOM 729",null,"","VIDE"]
["2014-01-06","NOM PRENOM 730","CEL 99.99.99.99","99999999","Ok"]
["2014-01-06","NOM PRENOM 731","99 DU 99.99.99 AU 99.99.99","","VIDE"]
["2014-01-06","NOM PRENOM 732","TEL 99.99.99.99","99999999","Ok"]
["2014-01-06","NOM PRENOM 733","TEL 99999999","99999999","Ok"]
["2014-01-06","NOM PRENOM 734","CNI N 9C 9999.9999.99 DU 99.99.9999 SEGUELA","","VIDE"]
["2014-01-06","NOM PRENOM 735",null,"","VIDE"]
["2014-01-06","NOM PRENOM 736",null,"","VIDE"]
["2014-01-06","NOM PRENOM 737","C9999.9999.99 DU 99.99.99","","VIDE"]
["2014-01-06","NOM PRENOM 738","TEL 99999999","99999999","Ok"]
["2014-01-06","NOM PRENOM 739","CNI N° C9999999999 DU 99/99/9999","","VIDE"]
["2014-01-06","NOM PRENOM 740","CEL:99999999","99999999","Ok"]
["2014-01-06","NOM PRENOM 741","9999 9999 99 DU 99.99.99 AU 99.99.99","","VIDE"]
["2014-01-06","NOM PRENOM 742","TEL 99.99.99.99","99999999","Ok"]
["2014-01-06","NOM PRENOM 743",null,"","VIDE"]
["2014-01-06","NOM PRENOM 744","TEL 99.99.99.99","99999999","Ok"]
["2014-01-06","NOM PRENOM 745","CEL 99999999","99999999","Ok"]
["2014-01-06","NOM PRENOM 746",null,"","VIDE"]
["2014-01-06","NOM PRENOM 747","TEL 99999999","99999999","Ok"]
["2014-01-06","NOM PRENOM 748","cel 99999999","99999999","Ok"]
["2014-01-06","NOM PRENOM 749",null,"","VIDE"]
["2014-01-06","NOM PRENOM 750","mirielle cel 99999999","99999999","Ok"]
["2014-01-06","NOM PRENOM 751",null,"","VIDE"]
["2014-01-06","NOM PRENOM 752","TEL 99999999","99999999","Ok"]
["2014-01-06","NOM PRENOM 753",99999999,"99999999","Ok"]
["2014-01-06","NOM PRENOM 754","TEL 99.99.99.99","99999999","Ok"]
["2014-01-06","NOM PRENOM 755","CEL 99999999","99999999","Ok"]
["2014-01-06","NOM PRENOM 756",null,"","VIDE"]
["2014-01-06","NOM PRENOM 757","CNI C9999.9999.99 DU 99/99/9999","","VIDE"]
["2014-01-06","NOM PRENOM 758","CNI C9999.9999.99 DU 99/99/9999","","VIDE"]
["2014-01-06","NOM PRENOM 759","TEL:99999999","99999999","Ok"]
["2014-01-06","NOM PRENOM 760","TEL 99999999","99999999","Ok"]
["2014-01-06","NOM PRENOM 761",null,"","VIDE"]
["2014-01-06","NOM PRENOM 762","CNI C9999.9999.99 DU 99/99/9999","","VIDE"]
["2014-01-06","NOM PRENOM 763","TEL:99-99-99-99","99999999","Ok"]
["2014-01-06","NOM PRENOM 764","TEL 99.99.99.99","99999999","Ok"]
["2014-01-06","NOM PRENOM 765","TEL 99.99.99.99","99999999","Ok"]
["2014-01-06","NOM PRENOM 766","TEL:99-99-99-99","99999999","Ok"]
["2014-01-06","NOM PRENOM 767",null,"","VIDE"]
["2014-01-06","NOM PRENOM 768","TEL 99.99.99.99","99999999","Ok"]
["2014-01-06","NOM PRENOM 769","VAL99/99/9999 CEL99999999","99999999","Ok"]
["2014-01-06","NOM PRENOM 770","CEL 99999999",{"$f":"gettel(C771)","v":"99999999"},{"$f":"IF(LEN(D771)=0,\"VIDE\",IF(LEN(D771)=8,\"Ok\",\"?\"))","v":"Ok"}]
["2014-01-06","NOM PRENOM 771","TEL 99.99.99.99","99999999","Ok"]
["2014-01-06","NOM PRENOM 772",null,"","VIDE"]
["2014-01-06","NOM PRENOM 773","TEL 99999999","99999999","Ok"]
["2014-01-06","NOM PRENOM 774","CNI C9999999999 DU 99/99/9999 AU 99/99/9999","","VIDE"]
["2014-01-06","NOM PRENOM 775","TEL 99999999","99999999","Ok"]
["2014-01-06","NOM PRENOM 776","CEL:99999999","99999999","Ok"]
["2014-01-06","NOM PRENOM 777","C9999.9999.99 DU 99.99.99","","VIDE"]
["2014-01-06","NOM PRENOM 778",99999999,"99999999","Ok"]
["2014-01-06","NOM PRENOM 779",null,"","VIDE"]
["2014-01-06","NOM PRENOM 780","TEL 99999999","99999999","Ok"]
["2014-01-06","NOM PRENOM 781",99999999,"99999999","Ok"]
["2014-01-06","NOM PRENOM 782",null,"","VIDE"]
["2014-01-06","NOM PRENOM 783","CIC CAM 999/99 DU 99/99/9999 + PC 99-99-99999999 DU 99/99/9999","","VIDE"]
["2014-01-06","NOM PRENOM 784","+ CNI C 9999999999 DU 99/99/99 AU 99/99/99","","VIDE"]
["2014-01-06","NOM PRENOM 785","+ CNI C9999999999 DU 99/99/99 AU 99/99/99","","VIDE"]
["2014-01-06","NOM PRENOM 786",null,"","VIDE"]
["2014-01-06","NOM PRENOM 787",null,"","VIDE"]
["2014-01-06","NOM PRENOM 788","TEL 99.99.99.99","99999999","Ok"]
["2014-01-06","NOM PRENOM 789","CNI C9999.9999.99 DU 99.99.99","","VIDE"]
["2014-01-06","NOM PRENOM 790","CNI C9999.9999.99 DU 99/99/9999","","VIDE"]
["2014-01-06","NOM PRENOM 791","C9999999999 DU 99/99/99 AU 99/99/9999","","VIDE"]
["2014-01-06","NOM PRENOM 792","CNI C9999.9999.99 DU 99.99.99","","VIDE"]
["2014-01-06","NOM PRENOM 793","TEL 99.99.99.99","99999999","Ok"]
["2014-01-06","NOM PRENOM 794","CNI C9999.9999.99 DU 99/99/9999","","VIDE"]
["2014-01-06","NOM PRENOM 795",null,"","VIDE"]
["2014-01-06","NOM PRENOM 796","CEL 99999999","99999999","Ok"]
["2014-01-06","NOM PRENOM 797","cel 99999999","99999999","Ok"]
["2014-01-06","NOM PRENOM 798","CNI C9999999999 DU 99-99-9999 AU 99-99-9999","","VIDE"]
["2014-01-06","NOM PRENOM 799",99999999,"99999999","Ok"]
["2014-01-06","NOM PRENOM 800","CNI C9999.9999.99 DU 99/99/9999","","VIDE"]
["2014-01-06","NOM PRENOM 801","CNI C9999.9999.99 DU 99/99/9999","","VIDE"]
["2014-01-06","NOM PRENOM 802","DU 99/99/9999","","VIDE"]
["2014-01-06","NOM PRENOM 803",null,"","VIDE"]
["2014-01-06","NOM PRENOM 804","cel 99999999","99999999","Ok"]
["2014-01-06","NOM PRENOM 805","99.99.99","","VIDE"]
["2014-01-06","NOM PRENOM 806","CELL 99999999","99999999","Ok"]
["2014-01-06","NOM PRENOM 807","CNI C9999.9999.99 DU 99/99/9999","","VIDE"]
["2014-01-06","NOM PRENOM 808","TEL 99.99.99.99","99999999","Ok"]
["2014-01-06","NOM PRENOM 809","DU 99/99/9999","","VIDE"]
["2014-01-06","NOM PRENOM 810",null,"","VIDE"]
["2014-01-06","NOM PRENOM 811","TEL 99999999","99999999","Ok"]
["2014-01-06","NOM PRENOM 812","CEL 99.99.99.99","99999999","Ok"]
["2014-01-06","NOM PRENOM 813","DU 99.99.99","","VIDE"]
["2014-01-06","NOM PRENOM 814","CEL 99999999","99999999","Ok"]
["2014-01-06","NOM PRENOM 815",null,"","VIDE"]
["2014-01-06","NOM PRENOM 816",null,"","VIDE"]
["2014-01-06","NOM PRENOM 817",null,"","VIDE"]
["2014-01-06","NOM PRENOM 818","cel 99999999","99999999","Ok"]
["2014-01-06","NOM PRENOM 819","CNI 999999999999 DU 99.99.9999","","VIDE"]
["2014-01-06","NOM PRENOM 820",null,"","VIDE"]
["2014-01-06","NOM PRENOM 821","VAL99.99.9999+PASSPORT N°C9VH9WZ99 CEL99999999","99999999","Ok"]
["2014-01-06","NOM PRENOM 822","TEL 99.99.99.99","99999999","Ok"]
["2014-01-06","NOM PRENOM 823",null,"","VIDE"]
["2014-01-06","NOM PRENOM 824","TEL 99999999","99999999","Ok"]
["2014-01-06","NOM PRENOM 825","tel 99.99.99.99","99999999","Ok"]
["2014-01-06","NOM PRENOM 826","ATT N°999-9999/99-99/MEMI/PU-99 AU 99/99/9999","","VIDE"]
["2014-01-06","NOM PRENOM 827","CNI C 9999 9999 99 DU 99/99/99 - TEL 99999999","99999999","Ok"]
["2014-01-06","NOM PRENOM 828","TEL 9999999",{"$f":"gettel(C829)","v":"9999999"},"?"]
["2014-01-06","NOM PRENOM 829","AU 99/99/99","","VIDE"]
["2014-01-06","NOM PRENOM 830",null,"","VIDE"]
["2014-01-06","NOM PRENOM 831","CEL 99999999","99999999","Ok"]
["2014-01-06","NOM PRENOM 832","ATT 999-9999/99-99/PU9 DU 99/99/99 - TEL 99999999","99999999","Ok"]
["2014-01-06","NOM PRENOM 833","CEL 99999999","99999999","Ok"]
["2014-01-06","NOM PRENOM 834","TEL 99999999",{"$f":"gettel(C835)","v":"99999999"},{"$f":"IF(LEN(D835)=0,\"VIDE\",IF(LEN(D835)=8,\"Ok\",\"?\"))","v":"Ok"}]
["2014-01-06","NOM PRENOM 835",null,"","VIDE"]
["2014-01-06","NOM PRENOM 836","CEL 99999999","99999999","Ok"]
["2014-01-06","NOM PRENOM 837",null,"","VIDE"]
["2014-01-06","NOM PRENOM 838","TEL 99999999","99999999","Ok"]
["2014-01-06","NOM PRENOM 839","CEL 99999999","99999999","Ok"]
["2014-01-06","NOM PRENOM 840",null,"","VIDE"]
["2014-01-06","NOM PRENOM 841",null,"","VIDE"]
["2014-01-06","NOM PRENOM 842",null,"","VIDE"]
["2014-01-06","NOM PRENOM 843","VAL99/99/9999 CEL99999999","99999999","Ok"]
["2014-01-06","NOM PRENOM 844","TEL 99999999","99999999","Ok"]
["2014-01-06","NOM PRENOM 845","CNI C 9999999999 DU 99/99/9999 AU 99/99/9999","","VIDE"]
["2014-01-06","NOM PRENOM 846","CNI C9999.9999.99 DU 99/99/9999","","VIDE"]
["2014-01-06","NOM PRENOM 847",null,"","VIDE"]
["2014-01-06","NOM PRENOM 848",null,"","VIDE"]
["2014-01-06","NOM PRENOM 849","nako oumar","","VIDE"]
["2014-01-06","NOM PRENOM 850","CEL 99999999","99999999","Ok"]
["2014-01-06","NOM PRENOM 851","zongo karim","","VIDE"]
["2014-01-06","NOM PRENOM 852","CNI C9999999999 DU 99/99/9999","","VIDE"]
["2014-01-06","NOM PRENOM 853","bazie boureima","","VIDE"]
["2014-01-06","NOM PRENOM 854","TEL 99.99.99.99","99999999","Ok"]
["2014-01-06","NOM PRENOM 855",99999999,"99999999","Ok"]
["2014-01-06","NOM PRENOM 856","CEL 99999999","99999999","Ok"]
["2014-01-06","NOM PRENOM 857",null,"","VIDE"]
["2014-01-06","NOM PRENOM 858",null,"","VIDE"]
["2014-01-06","NOM PRENOM 859","CEL 99999999","99999999","Ok"]
["2014-01-06","NOM PRENOM 860","TEL:99-99-99-99","99999999","Ok"]
["2014-01-06","NOM PRENOM 861",null,"","VIDE"]
["2014-01-06","NOM PRENOM 862",null,"","VIDE"]
["2014-01-06","NOM PRENOM 863","TEL 99999999","99999999","Ok"]
["2014-01-06","NOM PRENOM 864","TEL 99999999","99999999","Ok"]
["2014-01-06","NOM PRENOM 865",null,"","VIDE"]
["2014-01-06","NOM PRENOM 866",null,"","VIDE"]
["2014-01-06","NOM PRENOM 867","TEL 99.99.99.99","99999999","Ok"]
["2014-01-06","NOM PRENOM 868",null,"","VIDE"]
["2014-01-06","NOM PRENOM 869",99999999,"99999999","Ok"]
["2014-01-06","NOM PRENOM 870",null,"","VIDE"]
["2014-01-06","NOM PRENOM 871",null,"","VIDE"]
["2014-01-06","NOM PRENOM 872",99999999,"99999999","Ok"]
["2014-01-06","NOM PRENOM 873",null,"","VIDE"]
["2014-01-06","NOM PRENOM 874",null,"","VIDE"]
["2014-01-06","NOM PRENOM 875",null,"","VIDE"]
["2014-01-06","NOM PRENOM 876",null,"","VIDE"]
["2014-01-06","NOM PRENOM 877","TEL 99999999","99999999","Ok"]
["2014-01-06","NOM PRENOM 878",99999999,"99999999","Ok"]
["2014-01-06","NOM PRENOM 879","TEL 99.99.99.99","99999999","Ok"]
["2014-01-06","NOM PRENOM 880","val 99/99/9999 cel 99999999","99999999","Ok"]
["2014-01-06","NOM PRENOM 881",null,"","VIDE"]
["2014-01-06","NOM PRENOM 882",null,"","VIDE"]
["2014-01-06","NOM PRENOM 883",null,"","VIDE"]
["2014-01-06","NOM PRENOM 884","TEL 99999999","99999999","Ok"]
["2014-01-06","NOM PRENOM 885",null,"","VIDE"]
["2014-01-06","NOM PRENOM 886","TEL 99999999","99999999","Ok"]
["2014-01-06","NOM PRENOM 887","TEL 99999999","99999999","Ok"]
["2014-01-06","NOM PRENOM 888",null,"","VIDE"]
["2014-01-06","NOM PRENOM 889","TEL 99999999","99999999","Ok"]
["2014-01-06","NOM PRENOM 890","CEL 99999999","99999999","Ok"]
["2014-01-06","NOM PRENOM 891","BADIEL JACQUES","","VIDE"]
["2014-01-06","NOM PRENOM 892",null,"","VIDE"]
["2014-01-06","NOM PRENOM 893",null,"","VIDE"]
["2014-01-06","NOM PRENOM 894",null,"","VIDE"]
["2014-01-06","NOM PRENOM 895","TEL 99999999","99999999","Ok"]
["2014-01-06","NOM PRENOM 896",null,"","VIDE"]
["2014-01-06","NOM PRENOM 897","USA","","VIDE"]
["2014-01-06","NOM PRENOM 898","oula jean eude",{"$f":"gettel(C899)","v":""},{"$f":"IF(LEN(D899)=0,\"VIDE\",IF(LEN(D899)=8,\"Ok\",\"?\"))","v":"VIDE"}]
["2014-01-06","NOM PRENOM 899","ouedraogo harouna","","VIDE"]
["2014-01-06","NOM PRENOM 900",null,"","VIDE"]
["2014-01-06","NOM PRENOM 901",99999999,"99999999","Ok"]
["2014-01-06","NOM PRENOM 902",null,"","VIDE"]
["2014-01-06","NOM PRENOM 903","diagayete amadoun","","VIDE"]
["2014-01-06","NOM PRENOM 904",null,"","VIDE"]
["2014-01-07","NOM PRENOM 905","99/99/9999 TEL 99999999","99999999","Ok"]
["2014-01-07","NOM PRENOM 906",null,"","VIDE"]
["2014-01-07","NOM PRENOM 907","CIC DU MALI 999999/CGMACI DU 99/99/99","","VIDE"]
["2014-01-07","NOM PRENOM 908","TEL 99.99.99.99","99999999","Ok"]
["2014-01-07","NOM PRENOM 909","CNI C9999.9999.99 DU 99/99/9999","","VIDE"]
["2014-01-07","NOM PRENOM 910","CNI C9999.9999.99 DU 99/99/9999","","VIDE"]
["2014-01-07","NOM PRENOM 911",99999999,"99999999","Ok"]
["2014-01-07","NOM PRENOM 912","CNI C9999999999 DU 99.99.9999","","VIDE"]
["2014-01-07","NOM PRENOM 913",null,"","VIDE"]
["2014-01-07","NOM PRENOM 914","C9999.9999.99 DU 99.99.99","","VIDE"]
["2014-01-07","NOM PRENOM 915","CNI C 9999999999 DU 99/99/99","","VIDE"]
["2014-01-07","NOM PRENOM 916","CEL 99.99.99.99","99999999","Ok"]
["2014-01-07","NOM PRENOM 917","C9999.9999.99 DU 99.99999","","VIDE"]
["2014-01-07","NOM PRENOM 918","99 PC 99-99-99999999 DU 99/99/9999","","VIDE"]
["2014-01-07","NOM PRENOM 919","DU 99.99.99","","VIDE"]
["2014-01-07","NOM PRENOM 920","VAL 99/99/9999 CEL 99999999","99999999","Ok"]
["2014-01-07","NOM PRENOM 921","CNI N 9C 9999.9999.99 DU 99.99.9999 ANYAMA","","VIDE"]
["2014-01-07","NOM PRENOM 922","99/99/99 PC 99-99-99999999 DU 99/99/9999","","VIDE"]
["2014-01-07","NOM PRENOM 923","PASS N 99AC99999 DU 99/99/99 AU 99/99/99","","VIDE"]
["2014-01-07","NOM PRENOM 924","CEL 99999999","99999999","Ok"]
["2014-01-07","NOM PRENOM 925","+ PASSEPORT CENTRAFRIQUE N O99999999 DU 99/9/99 AU 99/9/99","","VIDE"]
["2014-01-07","NOM PRENOM 926","TEL 99.99.99.99","99999999","Ok"]
["2014-01-07","NOM PRENOM 927","TEL 99.99.99.99","99999999","Ok"]
["2014-01-07","NOM PRENOM 928",null,"","VIDE"]
["2014-01-07","NOM PRENOM 929","CEL 99999999","99999999","Ok"]
["2014-01-07","NOM PRENOM 930",null,"","VIDE"]
["2014-01-07","NOM PRENOM 931","CNI C9999999999 DU 99/99/9999 AU 99/99/9999","","VIDE"]
["2014-01-07","NOM PRENOM 932","TEL 99.99.99.99","99999999","Ok"]
["2014-01-07","NOM PRENOM 933","TEL 99999999*",{"$f":"gettel(C934)","v":"99999999"},"Ok"]
["2014-01-07","NOM PRENOM 934","CNI C9999999999 DU 99/99/9999 A SOUBRE","","VIDE"]
["2014-01-07","NOM PRENOM 935","CNI N 9C 9999.9999.99 DU 99.99.9999","","VIDE"]
["2014-01-07","NOM PRENOM 936","TEL 99999999","99999999","Ok"]
["2014-01-07","NOM PRENOM 937","CEL 99.99.99.99","99999999","Ok"]
["2014-01-07","NOM PRENOM 938","CNI C9999999999 DU 99/99/9999 AU 99/99/9999","","VIDE"]
["2014-01-07","NOM PRENOM 939","VAL99/99/9999 CEL99999999","99999999","Ok"]
["2014-01-07","NOM PRENOM 940","VAL 99/99/9999                  CEL 99999999","99999999","Ok"]
["2014-01-07","NOM PRENOM 941","DU 99.99.99","","VIDE"]
["2014-01-07","NOM PRENOM 942","TEL 99999999","99999999","Ok"]
["2014-01-07","NOM PRENOM 943",null,"","VIDE"]
["2014-01-07","NOM PRENOM 944",null,"","VIDE"]
["2014-01-07","NOM PRENOM 945","CEL 99999999","99999999","Ok"]
["2014-01-07","NOM PRENOM 946","TEL 99999999","99999999","Ok"]
["2014-01-07","NOM PRENOM 947","TEL 99.99.99.99","99999999","Ok"]
["2014-01-07","NOM PRENOM 948",99999999,"99999999","Ok"]
["2014-01-07","NOM PRENOM 949","CNI C9999999999 DU 99/99/9999 A SOUBRE","","VIDE"]
["2014-01-07","NOM PRENOM 950","CNI N9 C 999999.9999.99 DU 99.99.9999","","VIDE"]
["2014-01-07","NOM PRENOM 951","TEL 99999999","99999999","Ok"]
["2014-01-07","NOM PRENOM 952","CNI C9999999999 DU 99/99/9999 AU 99/99/9999","","VIDE"]
["2014-01-07","NOM PRENOM 953","TEL 99.99.99.99","99999999","Ok"]
["2014-01-07","NOM PRENOM 954","CNI C9999999999 DU 99/99/9999 AU 99/99/9999","","VIDE"]
["2014-01-07","NOM PRENOM 955","TEL 99999999","99999999","Ok"]
["2014-01-07","NOM PRENOM 956",99999999,"99999999","Ok"]
["2014-01-07","NOM PRENOM 957","CNI C9999999999 DU 99/99/9999 A SOUBRE","","VIDE"]
["2014-01-07","NOM PRENOM 958","tel 99.99.99.99","99999999","Ok"]
["2014-01-07","NOM PRENOM 959",null,"","VIDE"]
["2014-01-07","NOM PRENOM 960","TEL 99999999","99999999","Ok"]
["2014-01-07","NOM PRENOM 961","CIC CAMAROUN N9 999/9999 DU 99.99.99","","VIDE"]
["2014-01-07","NOM PRENOM 962","TEL 99999999",{"$f":"gettel(C963)","v":"99999999"},{"$f":"IF(LEN(D963)=0,\"VIDE\",IF(LEN(D963)=8,\"Ok\",\"?\"))","v":"Ok"}]
["2014-01-07","NOM PRENOM 963",null,"","VIDE"]
["2014-01-07","NOM PRENOM 964","TEL 99999999","99999999","Ok"]
["2014-01-07","NOM PRENOM 965","TEL 99.99.99.99","99999999","Ok"]
["2014-01-07","NOM PRENOM 966",null,"","VIDE"]
["2014-01-07","NOM PRENOM 967","TEL 99999999","99999999","Ok"]
["2014-01-07","NOM PRENOM 968","TEL 99999999","99999999","Ok"]
["2014-01-07","NOM PRENOM 969",null,"","VIDE"]
["2014-01-07","NOM PRENOM 970","N 9999 VAL 99/99/9999  CNI N PN9999KW9W9CQ","","VIDE"]
["2014-01-07","NOM PRENOM 971","CNI N9 C 9999.9999.99 DU 99.99.9999","","VIDE"]
["2014-01-07","NOM PRENOM 972","CEL 99999999","99999999","Ok"]
["2014-01-07","NOM PRENOM 973","ZEGUEI CNI C9999.9999.99 DU 99.99.99","","VIDE"]
["2014-01-07","NOM PRENOM 974",99999999,"99999999","Ok"]
["2014-01-07","NOM PRENOM 975","99999999999999H DU 99.99.99","","VIDE"]
["2014-01-07","NOM PRENOM 976","TEL 99999999","99999999","Ok"]
["2014-01-07","NOM PRENOM 977","CNI C9999999999 DU 99/99/9999","","VIDE"]
["2014-01-07","NOM PRENOM 978","du 99/99/9999 au 99/99/9999","","VIDE"]
["2014-01-07","NOM PRENOM 979","DU 99/99/99 AU 99/99/99","","VIDE"]
["2014-01-07","NOM PRENOM 980","CNI C9999999999 DU 99/99/99 AU 99/9/99","","VIDE"]
["2014-01-07","NOM PRENOM 981","TEL 99999999","99999999","Ok"]
["2014-01-07","NOM PRENOM 982",null,"","VIDE"]
["2014-01-07","NOM PRENOM 983","TEL 99999999","99999999","Ok"]
["2014-01-07","NOM PRENOM 984","PASS BFA A99999999 DU 99/99/9999","","VIDE"]
["2014-01-07","NOM PRENOM 985","TEL 99.99.99.99","99999999","Ok"]
["2014-01-07","NOM PRENOM 986",null,"","VIDE"]
["2014-01-07","NOM PRENOM 987","TEL 99999999","99999999","Ok"]
["2014-01-07","NOM PRENOM 988",null,"","VIDE"]
["2014-01-07","NOM PRENOM 989","cel 99999999","99999999","Ok"]
["2014-01-07","NOM PRENOM 990","TEL 99999999","99999999","Ok"]
["2014-01-07","NOM PRENOM 991","TEL 99999999","99999999","Ok"]
["2014-01-07","NOM PRENOM 992","CELL 99999999","99999999","Ok"]
["2014-01-07","NOM PRENOM 993","CEL 99.99.99.99","99999999","Ok"]
["2014-01-07","NOM PRENOM 994","N°99AB99999 DU 99.99.9999","","VIDE"]
["2014-01-07","NOM PRENOM 995","TEL 99999999","99999999","Ok"]
["2014-01-07","NOM PRENOM 996","TEL 99999999","99999999","Ok"]
["2014-01-07","NOM PRENOM 997","TEL 99999999","99999999","Ok"]
["2014-01-07","NOM PRENOM 998","ET ATD NO 999.999/99-99/MI/PU9 DU 99/99/99 AU 99/99/99","","VIDE"]
["2014-01-07","NOM PRENOM 999",null,"","VIDE"]
["2014-01-07","NOM PRENOM 1000","TEL 99999999","99999999","Ok"]
["2014-01-07","NOM PRENOM 1001","CNI 999999999999 DU 99/99/9999 AU 99/99/9999","","VIDE"]
["2014-01-07","NOM PRENOM 1002","CEL 99999999","99999999","Ok"]
["2014-01-07","NOM PRENOM 1003","CNI C9999999999 DU 99/99/9999 AU 99/99/9999","","VIDE"]
["2014-01-07","NOM PRENOM 1004","CNI N9 C 9999.9999.99 DU 99.99.9999","","VIDE"]
["2014-01-07","NOM PRENOM 1005","CNI C9999999999 DU 99/99/9999 AU 99/99/9999","","VIDE"]
["2014-01-07","NOM PRENOM 1006","CEL 99.99.99.99","99999999","Ok"]
["2014-01-07","NOM PRENOM 1007","CEL 99999999","99999999","Ok"]
["2014-01-07","NOM PRENOM 1008",null,"","VIDE"]
["2014-01-07","NOM PRENOM 1009","CELL 99999999","99999999","Ok"]
["2014-01-07","NOM PRENOM 1010","CNI N9 999999999999 AU 99.99.9999","","VIDE"]
["2014-01-07","NOM PRENOM 1011","CNI C9999999999 DU 99/99/99 AU 99/99/99","","VIDE"]
["2014-01-07","NOM PRENOM 1012","CNI C9999.9999.99 DU 99/99/9999","","VIDE"]
["2014-01-07","NOM PRENOM 1013","TEL:99-99-99-99","99999999","Ok"]
["2014-01-07","NOM PRENOM 1014","TEL : 99999999","99999999","Ok"]
["2014-01-07","NOM PRENOM 1015","TEL 99.99.99.99","99999999","Ok"]
["2014-01-07","NOM PRENOM 1016","9","","VIDE"]
["2014-01-07","NOM PRENOM 1017","CNI C9999999999 DU 99/99/9999 AU 99/99/9999","","VIDE"]
["2014-01-07","NOM PRENOM 1018","TE L99999999","","VIDE"]
["2014-01-07","NOM PRENOM 1019",null,"","VIDE"]
["2014-01-07","NOM PRENOM 1020","99/99/99","","VIDE"]
["2014-01-07","NOM PRENOM 1021","CNI N° C9999 9999 99 DU 99/99/9999 AU 99/99/9999","","VIDE"]
["2014-01-07","NOM PRENOM 1022","TEL 99.99.99.99","99999999","Ok"]
["2014-01-07","NOM PRENOM 1023","PASS N 99AD99999 DU 99/99/9999","","VIDE"]
["2014-01-07","NOM PRENOM 1024","CNI N°C 9999 9999 99 VAL99/99/9999 CEL99999999","99999999","Ok"]
["2014-01-07","NOM PRENOM 1025","TEL:99-99-99-99","99999999","Ok"]
["2014-01-07","NOM PRENOM 1026",null,{"$f":"gettel(C1027)","v":""},{"$f":"IF(LEN(D1027)=0,\"VIDE\",IF(LEN(D1027)=8,\"Ok\",\"?\"))","v":"VIDE"}]
["2014-01-07","NOM PRENOM 1027",null,"","VIDE"]
["2014-01-07","NOM PRENOM 1028","CEL 99999999","99999999","Ok"]
["2014-01-07","NOM PRENOM 1029","TEL 99.99.9999","99999999","Ok"]
["2014-01-07","NOM PRENOM 1030",null,"","VIDE"]
["2014-01-07","NOM PRENOM 1031","TEL 99.99.99.99","99999999","Ok"]
["2014-01-07","NOM PRENOM 1032","DU 99-99-9999 AU 99-99-9999","","VIDE"]
["2014-01-07","NOM PRENOM 1033",null,"","VIDE"]
["2014-01-07","NOM PRENOM 1034","TEL 99999999","99999999","Ok"]
["2014-01-07","NOM PRENOM 1035","TEL 99.99.99.99","99999999","Ok"]
["2014-01-07","NOM PRENOM 1036","CEL 99999999","99999999","Ok"]
["2014-01-07","NOM PRENOM 1037",null,"","VIDE"]
["2014-01-07","NOM PRENOM 1038","TEL 99999999","99999999","Ok"]
["2014-01-07","NOM PRENOM 1039","CNI C9999.9999.99 DU 99/99/9999","","VIDE"]
["2014-01-07","NOM PRENOM 1040",null,"","VIDE"]
["2014-01-07","NOM PRENOM 1041","TEL 99999999","99999999","Ok"]
["2014-01-07","NOM PRENOM 1042","TEL 99999999","99999999","Ok"]
["2014-01-07","NOM PRENOM 1043","CNI C9999.9999.99 DU 99/99/9999","","VIDE"]
["2014-01-07","NOM PRENOM 1044","TEL 99.99.99.99","99999999","Ok"]
["2014-01-07","NOM PRENOM 1045",null,"","VIDE"]
["2014-01-07","NOM PRENOM 1046","CNI N° C9999 9999 99 DU 99/999/9999 AU 99/99/9999","","VIDE"]
["2014-01-07","NOM PRENOM 1047","TEL 99.99.99.99","99999999","Ok"]
["2014-01-07","NOM PRENOM 1048","TEL 99999999","99999999","Ok"]
["2014-01-07","NOM PRENOM 1049",null,"","VIDE"]
["2014-01-07","NOM PRENOM 1050","TEL 99.99.99.99","99999999","Ok"]
["2014-01-07","NOM PRENOM 1051","SAWADOGO  CIC BF N 9999999/ABFA/9999","","VIDE"]
["2014-01-07","NOM PRENOM 1052","TEL 99999999","99999999","Ok"]
["2014-01-07","NOM PRENOM 1053",null,"","VIDE"]
["2014-01-07","NOM PRENOM 1054",99999999,"99999999","Ok"]
["2014-01-07","NOM PRENOM 1055","TEL 99999999","99999999","Ok"]
["2014-01-07","NOM PRENOM 1056","TEL : 99999999","99999999","Ok"]
["2014-01-07","NOM PRENOM 1057","9999.9999.99 DU 99.99.99","","VIDE"]
["2014-01-07","NOM PRENOM 1058","CNI C9999999999 DU 99/99/9999 A SOUBRE","","VIDE"]
["2014-01-07","NOM PRENOM 1059","999999999999 DU 99.99.99 AU 99.99.99","","VIDE"]
["2014-01-07","NOM PRENOM 1060","DU 99.99.99","","VIDE"]
["2014-01-07","NOM PRENOM 1061","CEL:99999999","99999999","Ok"]
["2014-01-07","NOM PRENOM 1062","CEL 99999999","99999999","Ok"]
["2014-01-07","NOM PRENOM 1063","PASSEPORT MALI B9999999 DU 99/99/99","","VIDE"]
["2014-01-07","NOM PRENOM 1064","TEL 99999999","99999999","Ok"]
["2014-01-07","NOM PRENOM 1065","cel 99999999","99999999","Ok"]
["2014-01-07","NOM PRENOM 1066",null,"","VIDE"]
["2014-01-07","NOM PRENOM 1067",null,"","VIDE"]
["2014-01-07","NOM PRENOM 1068","+ CARTE NINA 99999999999999X DU 99/99/9999","","VIDE"]
["2014-01-07","NOM PRENOM 1069","CNI C9999999999 DU 99-99-99 DU 99-99-99","","VIDE"]
["2014-01-07","NOM PRENOM 1070","CNI C9999999999 DU 99.99.9999","","VIDE"]
["2014-01-07","NOM PRENOM 1071","CNI C9999999999 DU 99/99/9999 A SOUBRE","","VIDE"]
["2014-01-07","NOM PRENOM 1072","VAL99/99/9999 CEL99999999","99999999","Ok"]
["2014-01-07","NOM PRENOM 1073","TEL 99999999","99999999","Ok"]
["2014-01-07","NOM PRENOM 1074",null,"","VIDE"]
["2014-01-07","NOM PRENOM 1075",null,"","VIDE"]
["2014-01-07","NOM PRENOM 1076","CEL 99999999","99999999","Ok"]
["2014-01-07","NOM PRENOM 1077","VAL99/99/9999 CEL99999999","99999999","Ok"]
["2014-01-07","NOM PRENOM 1078","CNI C 9999999999 DU 99-99-99","","VIDE"]
["2014-01-07","NOM PRENOM 1079","TEL 99.99.99.99","99999999","Ok"]
["2014-01-07","NOM PRENOM 1080",null,"","VIDE"]
["2014-01-07","NOM PRENOM 1081","TEL 99999999","99999999","Ok"]
["2014-01-07","NOM PRENOM 1082","cel 99999999","99999999","Ok"]
["2014-01-07","NOM PRENOM 1083","CNI C9999999999 DU 99/99/9999 A SOUBRE","","VIDE"]
["2014-01-07","NOM PRENOM 1084","TEL 99999999","99999999","Ok"]
["2014-01-07","NOM PRENOM 1085",null,"","VIDE"]
["2014-01-07","NOM PRENOM 1086","CIC BENIN 9999/99 DU 99/99/99 - TEL 99999999","99999999","Ok"]
["2014-01-07","NOM PRENOM 1087","TEL 99999999","99999999","Ok"]
["2014-01-07","NOM PRENOM 1088","TEL 99999999","99999999","Ok"]
["2014-01-07","NOM PRENOM 1089","CEL 99999999","99999999","Ok"]
["2014-01-07","NOM PRENOM 1090","cel 99999999",{"$f":"gettel(C1091)","v":"99999999"},{"$f":"IF(LEN(D1091)=0,\"VIDE\",IF(LEN(D1091)=8,\"Ok\",\"?\"))","v":"Ok"}]
["2014-01-07","NOM PRENOM 1091","TEL 99999999","99999999","Ok"]
["2014-01-07","NOM PRENOM 1092","AI N° 999-9999/99-99/PU-99 DU 99.99.9999","","VIDE"]
["2014-01-07","NOM PRENOM 1093","CEL 99999999","99999999","Ok"]
["2014-01-07","NOM PRENOM 1094","cel 99999999","99999999","Ok"]
["2014-01-07","NOM PRENOM 1095","CNI N9 C 9999.9999.99 DU 99.99.9999","","VIDE"]
["2014-01-07","NOM PRENOM 1096","TEL:99999999","99999999","Ok"]
["2014-01-07","NOM PRENOM 1097","CNI C9999.9999.99 DU 99/99/9999","","VIDE"]
["2014-01-07","NOM PRENOM 1098","CNI N9 C 9999.9999.99 DU 99.99.9999","","VIDE"]
["2014-01-07","NOM PRENOM 1099","TEL:99-99-99-99","99999999","Ok"]
["2014-01-07","NOM PRENOM 1100","CNI C9999.9999.99 DU 99.99.99","","VIDE"]
["2014-01-07","NOM PRENOM 1101","TEL 99.99.99.99","99999999","Ok"]
["2014-01-07","NOM PRENOM 1102",null,"","VIDE"]
["2014-01-07","NOM PRENOM 1103","CELL 99999999","99999999","Ok"]
["2014-01-07","NOM PRENOM 1104","TEL 99.99.99.99","99999999","Ok"]
["2014-01-07","NOM PRENOM 1105","TEL 99.99.99.99","99999999","Ok"]
["2014-01-07","NOM PRENOM 1106",null,"","VIDE"]
["2014-01-07","NOM PRENOM 1107","TEL 99.99.99.99","99999999","Ok"]
["2014-01-07","NOM PRENOM 1108","CNI 999999999999 DU 99-99-99","","VIDE"]
["2014-01-07","NOM PRENOM 1109",null,"","VIDE"]
["2014-01-07","NOM PRENOM 1110","VAL99/99/9999 CEL99999999","99999999","Ok"]
["2014-01-07","NOM PRENOM 1111","TEL 99.99.99.99","99999999","Ok"]
["2014-01-07","NOM PRENOM 1112","CNI C9999999999 DU 99-99-99 AU 99-99-99","","VIDE"]
["2014-01-07","NOM PRENOM 1113","TEL 99.99.99.99","99999999","Ok"]
["2014-01-07","NOM PRENOM 1114","tel 99999999","99999999","Ok"]
["2014-01-07","NOM PRENOM 1115","CEL 99999999","99999999","Ok"]
["2014-01-07","NOM PRENOM 1116","TEL 99.99.99.99","99999999","Ok"]
["2014-01-07","NOM PRENOM 1117","CNI C9999999999 DU 99-99-99 AU 99-99-99","","VIDE"]
["2014-01-07","NOM PRENOM 1118","CEL 99999999","99999999","Ok"]
["2014-01-07","NOM PRENOM 1119","COO99999999","","VIDE"]
["2014-01-07","NOM PRENOM 1120","TEL 99999999","99999999","Ok"]
["2014-01-07","NOM PRENOM 1121","CNI C9999999999 DU 99-99-99 AU 99-99-99","","VIDE"]
["2014-01-07","NOM PRENOM 1122","TEL 99999999","99999999","Ok"]
["2014-01-07","NOM PRENOM 1123","tel 99999999","99999999","Ok"]
["2014-01-07","NOM PRENOM 1124","TEL 99999999","99999999","Ok"]
["2014-01-07","NOM PRENOM 1125",null,"","VIDE"]
["2014-01-07","NOM PRENOM 1126","CNI N9 C 9999.9999.99 DU 99.99.9999","","VIDE"]
["2014-01-07","NOM PRENOM 1127","TEL:99-99-99-99","99999999","Ok"]
["2014-01-07","NOM PRENOM 1128","TEL 99999999","99999999","Ok"]
["2014-01-07","NOM PRENOM 1129",null,"","VIDE"]
["2014-01-07","NOM PRENOM 1130",null,"","VIDE"]
["2014-01-07","NOM PRENOM 1131",99999999,"99999999","Ok"]
["2014-01-07","NOM PRENOM 1132","CEL 99999999","99999999","Ok"]
["2014-01-07","NOM PRENOM 1133","TEL 99999999","99999999","Ok"]
["2014-01-07","NOM PRENOM 1134",null,"","VIDE"]
["2014-01-07","NOM PRENOM 1135","CNI N°C 9999 9999 99 VAL99/99/9999 CEL99999999","99999999","Ok"]
["2014-01-07","NOM PRENOM 1136","999/9999","","VIDE"]
["2014-01-07","NOM PRENOM 1137","TEL 99999999","99999999","Ok"]
["2014-01-07","NOM PRENOM 1138","CNI C9999999999 DU 99.99.9999","","VIDE"]
["2014-01-07","NOM PRENOM 1139","CNI N9 C 9999.9999.99 DU 99.99.9999","","VIDE"]
["2014-01-07","NOM PRENOM 1140","TEL 99.99.99.99","99999999","Ok"]
["2014-01-07","NOM PRENOM 1141","ATT N°999/9999 DU 9/99/9999","","VIDE"]
["2014-01-07","NOM PRENOM 1142","CNI N° C9999 9999 99 DU 99/99/9999 AU 99/99/9999","","VIDE"]
["2014-01-07","NOM PRENOM 1143","CEL 99999999","99999999","Ok"]
["2014-01-07","NOM PRENOM 1144","CEL:99999999","99999999","Ok"]
["2014-01-07","NOM PRENOM 1145","CNI C 9999999999 DU 99/99/99","","VIDE"]
["2014-01-07","NOM PRENOM 1146","TEL 99.99.99.99","99999999","Ok"]
["2014-01-07","NOM PRENOM 1147",99999999,"99999999","Ok"]
["2014-01-07","NOM PRENOM 1148","TEL 99999999","99999999","Ok"]
["2014-01-07","NOM PRENOM 1149",null,"","VIDE"]
["2014-01-07","NOM PRENOM 1150","TEL 99.99.99.99","99999999","Ok"]
["2014-01-07","NOM PRENOM 1151","CNI N 9C 9999.9999.99 DU 99.99.9999","","VIDE"]
["2014-01-07","NOM PRENOM 1152",null,"","VIDE"]
["2014-01-07","NOM PRENOM 1153","CNI C9999.9999.99 DU 99/99/9999","","VIDE"]
["2014-01-07","NOM PRENOM 1154","TEL 99.99.99.99",{"$f":"gettel(C1155)","v":"99999999"},{"$f":"IF(LEN(D1155)=0,\"VIDE\",IF(LEN(D1155)=8,\"Ok\",\"?\"))","v":"Ok"}]
["2014-01-07","NOM PRENOM 1155","CEL:99999999","99999999","Ok"]
["2014-01-07","NOM PRENOM 1156","CNI C9999.9999.99 DU 99.99.99","","VIDE"]
["2014-01-07","NOM PRENOM 1157","TEL 99.99.99.99","99999999","Ok"]
["2014-01-07","NOM PRENOM 1158","TEL 99999999","99999999","Ok"]
["2014-01-07","NOM PRENOM 1159","TEL:99-99-99-99","99999999","Ok"]
["2014-01-07","NOM PRENOM 1160",null,"","VIDE"]
["2014-01-07","NOM PRENOM 1161","sangare seydou","","VIDE"]
["2014-01-07","NOM PRENOM 1162",null,"","VIDE"]
["2014-01-07","NOM PRENOM 1163","TEL 99999999","99999999","Ok"]
["2014-01-07","NOM PRENOM 1164","TEL 99999999","99999999","Ok"]
["2014-01-07","NOM PRENOM 1165","TEL 99999999","99999999","Ok"]
["2014-01-07","NOM PRENOM 1166",99999999,"99999999","Ok"]
["2014-01-07","NOM PRENOM 1167","PC N9 99.99.99999999 DU 99.99.9999","","VIDE"]
["2014-01-07","NOM PRENOM 1168",null,"","VIDE"]
["2014-01-07","NOM PRENOM 1169","DU 99.99.99","","VIDE"]
["2014-01-07","NOM PRENOM 1170","TEL 99999999","99999999","Ok"]
["2014-01-07","NOM PRENOM 1171",null,"","VIDE"]
["2014-01-07","NOM PRENOM 1172","CEL99999999","99999999","Ok"]
["2014-01-07","NOM PRENOM 1173",null,"","VIDE"]
["2014-01-07","NOM PRENOM 1174",null,"","VIDE"]
["2014-01-07","NOM PRENOM 1175",null,"","VIDE"]
["2014-01-07","NOM PRENOM 1176","TEL 99999999","99999999","Ok"]
["2014-01-07","NOM PRENOM 1177","TEL 99999999","99999999","Ok"]
["2014-01-07","NOM PRENOM 1178","TEL 99999999","99999999","Ok"]
["2014-01-07","NOM PRENOM 1179",null,"","VIDE"]
["2014-01-07","NOM PRENOM 1180","TEL 99999999","99999999","Ok"]
["2014-01-07","NOM PRENOM 1181","TEL 99999999","99999999","Ok"]
["2014-01-07","NOM PRENOM 1182","TEL 99.99.99.99","99999999","Ok"]
["2014-01-07","NOM PRENOM 1183",null,"","VIDE"]
["2014-01-07","NOM PRENOM 1184",99999999,"99999999","Ok"]
["2014-01-07","NOM PRENOM 1185","TEL 99.99.99.99","99999999","Ok"]
["2014-01-07","NOM PRENOM 1186","TEL 99999999","99999999","Ok"]
["2014-01-07","NOM PRENOM 1187",null,"","VIDE"]
["2014-01-07","NOM PRENOM 1188",null,"","VIDE"]
["2014-01-07","NOM PRENOM 1189",null,"","VIDE"]
["2014-01-07","NOM PRENOM 1190","TEL 99999999","99999999","Ok"]
["2014-01-07","NOM PRENOM 1191","TEL 99999999","99999999","Ok"]
["2014-01-07","NOM PRENOM 1192","TEL 99999999","99999999","Ok"]
["2014-01-07","NOM PRENOM 1193","TEL 99999999","99999999","Ok"]
["2014-01-07","NOM PRENOM 1194","TEL 99999999","99999999","Ok"]
["2014-01-07","NOM PRENOM 1195",99999999,"99999999","Ok"]
["2014-01-07","NOM PRENOM 1196","TEL 99999999","99999999","Ok"]
["2014-01-07","NOM PRENOM 1197","TEL 99.99.99.99","99999999","Ok"]
["2014-01-07","NOM PRENOM 1198",null,"","VIDE"]
["2014-01-07","NOM PRENOM 1199",null,"","VIDE"]
["2014-01-07","NOM PRENOM 1200",null,"","VIDE"]
["2014-01-07","NOM PRENOM 1201","TEL 99999999","99999999","Ok"]
["2014-01-07","NOM PRENOM 1202","TEL 99999999","99999999","Ok"]
["2014-01-07","NOM PRENOM 1203",null,"","VIDE"]
["2014-01-07","NOM PRENOM 1204",null,"","VIDE"]
["2014-01-07","NOM PRENOM 1205",null,"","VIDE"]
["2014-01-07","NOM PRENOM 1206","TEL 99999999","99999999","Ok"]
["2014-01-07","NOM PRENOM 1207",null,"","VIDE"]
["2014-01-07","NOM PRENOM 1208",null,"","VIDE"]
["2014-01-07","NOM PRENOM 1209","TEL 99999999","99999999","Ok"]
["2014-01-07","NOM PRENOM 1210","TEL 99999999","99999999","Ok"]
["2014-01-07","NOM PRENOM 1211",null,"","VIDE"]
["2014-01-07","NOM PRENOM 1212","TEL 99999999","99999999","Ok"]
["2014-01-07","NOM PRENOM 1213","CEL 99999999","99999999","Ok"]
["2014-01-07","NOM PRENOM 1214",null,"","VIDE"]
["2014-01-07","NOM PRENOM 1215",null,"","VIDE"]
["2014-01-07","NOM PRENOM 1216","TEL 99999999","99999999","Ok"]
["2014-01-07","NOM PRENOM 1217",null,"","VIDE"]
["2014-01-07","NOM PRENOM 1218",null,{"$f":"gettel(C1219)","v":""},{"$f":"IF(LEN(D1219)=0,\"VIDE\",IF(LEN(D1219)=8,\"Ok\",\"?\"))","v":"VIDE"}]
["2014-01-07","NOM PRENOM 1219",null,"","VIDE"]
["2014-01-07","NOM PRENOM 1220",null,"","VIDE"]
["2014-01-07","NOM PRENOM 1221",null,"","VIDE"]
["2014-01-07","NOM PRENOM 1222",null,"","VIDE"]
["2014-01-08","NOM PRENOM 1223","CNI C9999999999 DU 99/99/9999","","VIDE"]
["2014-01-08","NOM PRENOM 1224",null,"","VIDE"]
["2014-01-08","NOM PRENOM 1225","TEL 99999999","99999999","Ok"]
["2014-01-08","NOM PRENOM 1226","DU 99.99.99","","VIDE"]
["2014-01-08","NOM PRENOM 1227","tel 99999999","99999999","Ok"]
["2014-01-08","NOM PRENOM 1228","CNI N° C9999999999 DU 99/99/9999","","VIDE"]
["2014-01-08","NOM PRENOM 1229",99999999,"99999999","Ok"]
["2014-01-08","NOM PRENOM 1230","CEL 99999999","99999999","Ok"]
["2014-01-08","NOM PRENOM 1231","9999.9999.99 DU 99.99.99","","VIDE"]
["2014-01-08","NOM PRENOM 1232","TEL 99999999","99999999","Ok"]
["2014-01-08","NOM PRENOM 1233",99999999,"99999999","Ok"]
["2014-01-08","NOM PRENOM 1234",null,"","VIDE"]
["2014-01-08","NOM PRENOM 1235","TEL 99999999","99999999","Ok"]
["2014-01-08","NOM PRENOM 1236",null,"","VIDE"]
["2014-01-08","NOM PRENOM 1237","CIC MLI N 999999/CGMA/CI DU 99/99/9999 A ABJ","","VIDE"]
["2014-01-08","NOM PRENOM 1238","TEL 99.99.99.99","99999999","Ok"]
["2014-01-08","NOM PRENOM 1239","TEL 99999999","99999999","Ok"]
["2014-01-08","NOM PRENOM 1240","VAL99/99/9999 CEL99999999","99999999","Ok"]
["2014-01-08","NOM PRENOM 1241","TEL 99.99.99.99","99999999","Ok"]
["2014-01-08","NOM PRENOM 1242","TEL 99999999","99999999","Ok"]
["2014-01-08","NOM PRENOM 1243","cel 99999999","99999999","Ok"]
["2014-01-08","NOM PRENOM 1244","TEL 99.99.99.99","99999999","Ok"]
["2014-01-08","NOM PRENOM 1245","TEL 99999999","99999999","Ok"]
["2014-01-08","NOM PRENOM 1246",null,"","VIDE"]
["2014-01-08","NOM PRENOM 1247","TEL 99999999","99999999","Ok"]
["2014-01-08","NOM PRENOM 1248","TEL 99.99.99.99","99999999","Ok"]
["2014-01-08","NOM PRENOM 1249","CNI C9999999999 DU 99/99/9999 AU 99/99/9999","","VIDE"]
["2014-01-08","NOM PRENOM 1250","CEL:99999999","99999999","Ok"]
["2014-01-08","NOM PRENOM 1251","9999.9999.99 DU 99.99.99","","VIDE"]
["2014-01-08","NOM PRENOM 1252","TEL 99999999","99999999","Ok"]
["2014-01-08","NOM PRENOM 1253","CNI C 9999999999 DU 99/99/99","","VIDE"]
["2014-01-08","NOM PRENOM 1254","TEL 99.99.99.99","99999999","Ok"]
["2014-01-08","NOM PRENOM 1255","tel 99999999","99999999","Ok"]
["2014-01-08","NOM PRENOM 1256",99999999,"99999999","Ok"]
["2014-01-08","NOM PRENOM 1257","CNI C9999.9999.99 DU 99/99/9999","","VIDE"]
["2014-01-08","NOM PRENOM 1258","ATT 9999-9999/99-99/PU-BONG DU 99/99/99 - TEL 99999999","99999999","Ok"]
["2014-01-08","NOM PRENOM 1259",null,"","VIDE"]
["2014-01-08","NOM PRENOM 1260","PROROGE AU 99/99/99","","VIDE"]
["2014-01-08","NOM PRENOM 1261","TEL 99.99.99.99","99999999","Ok"]
["2014-01-08","NOM PRENOM 1262","du 99/99/9999 au 99/99/9999","","VIDE"]
["2014-01-08","NOM PRENOM 1263","TEL 99999999","99999999","Ok"]
["2014-01-08","NOM PRENOM 1264","CEL 99.99.99.99","99999999","Ok"]
["2014-01-08","NOM PRENOM 1265","CNI C 9999999999 DU 99/99/99 CEL 99999999","99999999","Ok"]
["2014-01-08","NOM PRENOM 1266",null,"","VIDE"]
["2014-01-08","NOM PRENOM 1267","CNI N9 C 9999.9999.99 DU 99.99.9999","","VIDE"]
["2014-01-08","NOM PRENOM 1268","TEL 99999999","99999999","Ok"]
["2014-01-08","NOM PRENOM 1269","PASP 99AB99999 DU 99/99/9999 AU 99/99/99","","VIDE"]
["2014-01-08","NOM PRENOM 1270","TEL 99.99.99.99","99999999","Ok"]
["2014-01-08","NOM PRENOM 1271",null,"","VIDE"]
["2014-01-08","NOM PRENOM 1272","CNI N9 C 9999.9999.99 DU 99.99.9999","","VIDE"]
["2014-01-08","NOM PRENOM 1273","TEL 99.99.99.99","99999999","Ok"]
["2014-01-08","NOM PRENOM 1274","TEL 99999999","99999999","Ok"]
["2014-01-08","NOM PRENOM 1275","cel 99999999","99999999","Ok"]
["2014-01-08","NOM PRENOM 1276","CNI C9999999999 DU 99/99/9999 AU 99/99/9999","","VIDE"]
["2014-01-08","NOM PRENOM 1277","AU 99/9/99 + AI 999.9999.99.999/CPSPAA DU 99/9/99 AU 99/9/99","","VIDE"]
["2014-01-08","NOM PRENOM 1278","CELL 99999999","99999999","Ok"]
["2014-01-08","NOM PRENOM 1279","CNI N° C9999 9999 99 DU 99/99/9999 AU 99/99/9999","","VIDE"]
["2014-01-08","NOM PRENOM 1280","RT IVOIRIEN 99AB99999 DU 99/99/99 AU 99/99/99","","VIDE"]
["2014-01-08","NOM PRENOM 1281","TEL 99.99.99.99","99999999","Ok"]
["2014-01-08","NOM PRENOM 1282","CEL:99999999",{"$f":"gettel(C1283)","v":"99999999"},{"$f":"IF(LEN(D1283)=0,\"VIDE\",IF(LEN(D1283)=8,\"Ok\",\"?\"))","v":"Ok"}]
["2014-01-08","NOM PRENOM 1283","CNI N° C9999999999 DU 99/99/9999","","VIDE"]
["2014-01-08","NOM PRENOM 1284","CNI N° C9999 9999 99 DU 99/99/9999 AU 99/99/9999","","VIDE"]
["2014-01-08","NOM PRENOM 1285","TEL 99999999","99999999","Ok"]
["2014-01-08","NOM PRENOM 1286",null,"","VIDE"]
["2014-01-08","NOM PRENOM 1287","CNI C9999.9999.99 DU 99/99/9999","","VIDE"]
["2014-01-08","NOM PRENOM 1288",null,"","VIDE"]
["2014-01-08","NOM PRENOM 1289","CEL 99999999","99999999","Ok"]
["2014-01-08","NOM PRENOM 1290","TEL 99999999","99999999","Ok"]
["2014-01-08","NOM PRENOM 1291","9999.9999.99 DU 99.99.99","","VIDE"]
["2014-01-08","NOM PRENOM 1292","CEL 99999999","99999999","Ok"]
["2014-01-08","NOM PRENOM 1293","C9999.9999.99 DU 99.99.99","","VIDE"]
["2014-01-08","NOM PRENOM 1294","TEL 99999999","99999999","Ok"]
["2014-01-08","NOM PRENOM 1295","C9999.9999.99 DU 99.99.99","","VIDE"]
["2014-01-08","NOM PRENOM 1296","VAL99.99.9999 CEL99999999","99999999","Ok"]
["2014-01-08","NOM PRENOM 1297","9999 99 DU 99.99.99 AU 99.99.99","","VIDE"]
["2014-01-08","NOM PRENOM 1298","TEL 99999999","99999999","Ok"]
["2014-01-08","NOM PRENOM 1299","TEL 99999999","99999999","Ok"]
["2014-01-08","NOM PRENOM 1300","TEL 99999999","99999999","Ok"]
["2014-01-08","NOM PRENOM 1301","TEL 99999999","99999999","Ok"]
["2014-01-08","NOM PRENOM 1302","TEL 99999999","99999999","Ok"]
["2014-01-08","NOM PRENOM 1303",null,"","VIDE"]
["2014-01-08","NOM PRENOM 1304","CEL 99999999","99999999","Ok"]
["2014-01-08","NOM PRENOM 1305",null,"","VIDE"]
["2014-01-08","NOM PRENOM 1306","CNI C 9999999999 DU 99/99/99","","VIDE"]
["2014-01-08","NOM PRENOM 1307",null,"","VIDE"]
["2014-01-08","NOM PRENOM 1308","CEL 99999999","99999999","Ok"]
["2014-01-08","NOM PRENOM 1309","TEL 99.99.99.99","99999999","Ok"]
["2014-01-08","NOM PRENOM 1310",null,"","VIDE"]
["2014-01-08","NOM PRENOM 1311","CNI C 9999 9999 99 DU 99/99/99 - TEL 99999999","99999999","Ok"]
["2014-01-08","NOM PRENOM 1312","PASS N A9999999 DU 99/99/99 AU 99/99/9999","","VIDE"]
["2014-01-08","NOM PRENOM 1313","TEL 99999999","99999999","Ok"]
["2014-01-08","NOM PRENOM 1314",99999999,"99999999","Ok"]
["2014-01-08","NOM PRENOM 1315","PC 99-99-99999999 DU 99/99/99","","VIDE"]
["2014-01-08","NOM PRENOM 1316",null,"","VIDE"]
["2014-01-08","NOM PRENOM 1317","CNI N9 999999999999 DU 99.99.9999","","VIDE"]
["2014-01-08","NOM PRENOM 1318",null,"","VIDE"]
["2014-01-08","NOM PRENOM 1319","VAL99/99/9999 CEL99999999","99999999","Ok"]
["2014-01-08","NOM PRENOM 1320",null,"","VIDE"]
["2014-01-08","NOM PRENOM 1321","TEL 99.99.99.99","99999999","Ok"]
["2014-01-08","NOM PRENOM 1322","CEL 99999999","99999999","Ok"]
["2014-01-08","NOM PRENOM 1323","CEL 99999999","99999999","Ok"]
["2014-01-08","NOM PRENOM 1324","CNI N° C9999999999 DU 99/99/9999","","VIDE"]
["2014-01-08","NOM PRENOM 1325","TEL 99.99.99.99","99999999","Ok"]
["2014-01-08","NOM PRENOM 1326","TEL 99.99.99.99","99999999","Ok"]
["2014-01-08","NOM PRENOM 1327","CNI C9999.9999.99 DU 99/99/9999","","VIDE"]
["2014-01-08","NOM PRENOM 1328","TEL 99.99.99.99","99999999","Ok"]
["2014-01-08","NOM PRENOM 1329","CNI C9999999999 DU 99/99/9999 AU 99/99/9999","","VIDE"]
["2014-01-08","NOM PRENOM 1330","TEL 99.99.99.99","99999999","Ok"]
["2014-01-08","NOM PRENOM 1331","CEL 99999999","99999999","Ok"]
["2014-01-08","NOM PRENOM 1332","CEL 99999999","99999999","Ok"]
["2014-01-08","NOM PRENOM 1333","CNI N9 C 9999.9999.99 DU 99.99.9999","","VIDE"]
["2014-01-08","NOM PRENOM 1334","PASS N 99 AB99999 DU 99/99/99 AU 99/99/99","","VIDE"]
["2014-01-08","NOM PRENOM 1335",null,"","VIDE"]
["2014-01-08","NOM PRENOM 1336","CNI C9999999999 DU 99/99/9999 AU 99/99/9999","","VIDE"]
["2014-01-08","NOM PRENOM 1337","CEL 99999999","99999999","Ok"]
["2014-01-08","NOM PRENOM 1338",99999999,"99999999","Ok"]
["2014-01-08","NOM PRENOM 1339","CNI C9999999999 DU 99/99/9999 AU 99/99/9999","","VIDE"]
["2014-01-08","NOM PRENOM 1340","TEL: 99999999","99999999","Ok"]
["2014-01-08","NOM PRENOM 1341","CNI C9999.9999.99 DU 99/99/9999","","VIDE"]
["2014-01-08","NOM PRENOM 1342","99/99/9999","","VIDE"]
["2014-01-08","NOM PRENOM 1343","CNI C9999999999 DU 99/99/9999 AU 99/99/9999","","VIDE"]
["2014-01-08","NOM PRENOM 1344","9999 9999 99 DU 99.99.99 AU 99.99.99","","VIDE"]
["2014-01-08","NOM PRENOM 1345","TEL 99.99.99.99","99999999","Ok"]
["2014-01-08","NOM PRENOM 1346","CNI C9999999999 DU 99/99/9999 AU 99/99/9999",{"$f":"gettel(C1347)","v":""},{"$f":"IF(LEN(D1347)=0,\"VIDE\",IF(LEN(D1347)=8,\"Ok\",\"?\"))","v":"VIDE"}]
["2014-01-08","NOM PRENOM 1347","TEL 99.99.99.99","99999999","Ok"]
["2014-01-08","NOM PRENOM 1348","TEL 99.99.99.99","99999999","Ok"]
["2014-01-08","NOM PRENOM 1349","TEL 99999999","99999999","Ok"]
["2014-01-08","NOM PRENOM 1350","TEL 99999999","99999999","Ok"]
["2014-01-08","NOM PRENOM 1351","TEL 99999999","99999999","Ok"]
["2014-01-08","NOM PRENOM 1352","CNI C9999999999 DU 99/99/9999 AU 99/99/9999","","VIDE"]
["2014-01-08","NOM PRENOM 1353","TEL 99999999","99999999","Ok"]
["2014-01-08","NOM PRENOM 1354","+ PERMIS 99-99-99999999","","VIDE"]
["2014-01-08","NOM PRENOM 1355","TEL 99999999","99999999","Ok"]
["2014-01-08","NOM PRENOM 1356","CEL:99999999","99999999","Ok"]
["2014-01-08","NOM PRENOM 1357","TEL 99999999","99999999","Ok"]
["2014-01-08","NOM PRENOM 1358","TEL 99999999","99999999","Ok"]
["2014-01-08","NOM PRENOM 1359","TEL 99999999","99999999","Ok"]
["2014-01-08","NOM PRENOM 1360","TEL 99999999","99999999","Ok"]
["2014-01-08","NOM PRENOM 1361","CEL 99999999","99999999","Ok"]
["2014-01-08","NOM PRENOM 1362","VAL99/99/9999 CEL99999999","99999999","Ok"]
["2014-01-08","NOM PRENOM 1363","CNI C 9999999999 DU 99/99/99","","VIDE"]
["2014-01-08","NOM PRENOM 1364","TEL 99999999","99999999","Ok"]
["2014-01-08","NOM PRENOM 1365","CNI C9999.9999.99 DU 99/99/9999","","VIDE"]
["2014-01-08","NOM PRENOM 1366","TEL 99.99.99.99","99999999","Ok"]
["2014-01-08","NOM PRENOM 1367",null,"","VIDE"]
["2014-01-08","NOM PRENOM 1368","CEL 99999999","99999999","Ok"]
["2014-01-08","NOM PRENOM 1369",null,"","VIDE"]
["2014-01-08","NOM PRENOM 1370","TEL 99999999","99999999","Ok"]
["2014-01-08","NOM PRENOM 1371","TEL : 99999999","99999999","Ok"]
["2014-01-08","NOM PRENOM 1372","CNI C9999.9999.99 DU 99/99/9999","","VIDE"]
["2014-01-08","NOM PRENOM 1373","CEL 99999999","99999999","Ok"]
["2014-01-08","NOM PRENOM 1374",null,"","VIDE"]
["2014-01-08","NOM PRENOM 1375","PC N°999999999999 DU 99/99/9999","","VIDE"]
["2014-01-08","NOM PRENOM 1376",99999999,"99999999","Ok"]
["2014-01-08","NOM PRENOM 1377","TEL 99999999","99999999","Ok"]
["2014-01-08","NOM PRENOM 1378","TEL 99999999","99999999","Ok"]
["2014-01-08","NOM PRENOM 1379","CNI N 9C 9999.9999.99 DU 99.99.9999","","VIDE"]
["2014-01-08","NOM PRENOM 1380","TEL: 99999999","99999999","Ok"]
["2014-01-08","NOM PRENOM 1381",null,"","VIDE"]
["2014-01-08","NOM PRENOM 1382","TEL 99999999","99999999","Ok"]
["2014-01-08","NOM PRENOM 1383","tel 99999999","99999999","Ok"]
["2014-01-08","NOM PRENOM 1384","PASSEPORT N9 99AA99999 DU 99.99.9999 **CEL 99.99.99.99","99999999","Ok"]
["2014-01-08","NOM PRENOM 1385","CEL 99999999","99999999","Ok"]
["2014-01-08","NOM PRENOM 1386","CNI N9 999999999999 DU 99.99.9999","","VIDE"]
["2014-01-08","NOM PRENOM 1387",null,"","VIDE"]
["2014-01-08","NOM PRENOM 1388","CELL 99999999","99999999","Ok"]
["2014-01-08","NOM PRENOM 1389",null,"","VIDE"]
["2014-01-08","NOM PRENOM 1390","TEL: 99999999","99999999","Ok"]
["2014-01-08","NOM PRENOM 1391","TEL 99.99.99.99","99999999","Ok"]
["2014-01-08","NOM PRENOM 1392","CNI C9999.9999.99 DU 99/99/9999","","VIDE"]
["2014-01-08","NOM PRENOM 1393","CNI C9999999999 DU 99.99.9999","","VIDE"]
["2014-01-08","NOM PRENOM 1394",null,"","VIDE"]
["2014-01-08","NOM PRENOM 1395","CEL 99999999","99999999","Ok"]
["2014-01-08","NOM PRENOM 1396","CNI C9999999999 DU 99/99/9999 AU 99/99/9999","","VIDE"]
["2014-01-08","NOM PRENOM 1397","CNI C 9999 9999 99 DU 99/99/99 TEL 99999999","99999999","Ok"]
["2014-01-08","NOM PRENOM 1398","ELVIRE CNI C9999.9999.99 DU 99.99.99","","VIDE"]
["2014-01-08","NOM PRENOM 1399","val 99/99/9999 cel 99999999","99999999","Ok"]
["2014-01-08","NOM PRENOM 1400","DU 99/99/9999 AU 99/99/9999","","VIDE"]
["2014-01-08","NOM PRENOM 1401",null,"","VIDE"]
["2014-01-08","NOM PRENOM 1402","TEL 99.99.99.99","99999999","Ok"]
["2014-01-08","NOM PRENOM 1403","TEL 99.99.99.99","99999999","Ok"]
["2014-01-08","NOM PRENOM 1404","CNI C9999.9999.99 DU 99/99/9999","","VIDE"]
["2014-01-08","NOM PRENOM 1405",null,"","VIDE"]
["2014-01-08","NOM PRENOM 1406",null,"","VIDE"]
["2014-01-08","NOM PRENOM 1407","TEL 99999999","99999999","Ok"]
["2014-01-08","NOM PRENOM 1408","DU 99.99.99","","VIDE"]
["2014-01-08","NOM PRENOM 1409","CNI N° C9999999999 DU 99/99/9999","","VIDE"]
["2014-01-08","NOM PRENOM 1410","CNI C9999999999 DU 99/99/9999 A KORHOGO",{"$f":"gettel(C1411)","v":""},{"$f":"IF(LEN(D1411)=0,\"VIDE\",IF(LEN(D1411)=8,\"Ok\",\"?\"))","v":"VIDE"}]
["2014-01-08","NOM PRENOM 1411","TEL 99999999","99999999","Ok"]
["2014-01-08","NOM PRENOM 1412",null,"","VIDE"]
["2014-01-08","NOM PRENOM 1413",null,"","VIDE"]
["2014-01-08","NOM PRENOM 1414","CNI C9999999999 DU 99/99/9999 AU 99/99/9999","","VIDE"]
["2014-01-08","NOM PRENOM 1415","TEL 99999999","99999999","Ok"]
["2014-01-08","NOM PRENOM 1416",null,"","VIDE"]
["2014-01-08","NOM PRENOM 1417","TEL 99999999","99999999","Ok"]
["2014-01-08","NOM PRENOM 1418","CNI C9999999999 DU 99.99.9999","","VIDE"]
["2014-01-08","NOM PRENOM 1419",null,"","VIDE"]
["2014-01-08","NOM PRENOM 1420","PERMIS DE CONDUIRE N°99-99-99999999 DELIVRE LE 99.99.9999","","VIDE"]
["2014-01-08","NOM PRENOM 1421",null,"","VIDE"]
["2014-01-08","NOM PRENOM 1422",null,"","VIDE"]
["2014-01-08","NOM PRENOM 1423","CNI C9999999999 DU 99/99/9999 AU 99/99/9999","","VIDE"]
["2014-01-08","NOM PRENOM 1424",null,"","VIDE"]
["2014-01-08","NOM PRENOM 1425","tel 99.99.99.99","99999999","Ok"]
["2014-01-08","NOM PRENOM 1426","TEL 99.99.99.99","99999999","Ok"]
["2014-01-08","NOM PRENOM 1427",null,"","VIDE"]
["2014-01-08","NOM PRENOM 1428","CEL 99999999","99999999","Ok"]
["2014-01-08","NOM PRENOM 1429",null,"","VIDE"]
["2014-01-08","NOM PRENOM 1430","TEL 99999999","99999999","Ok"]
["2014-01-08","NOM PRENOM 1431","CEL 99999999","99999999","Ok"]
["2014-01-08","NOM PRENOM 1432",null,"","VIDE"]
["2014-01-08","NOM PRENOM 1433",null,"","VIDE"]
["2014-01-08","NOM PRENOM 1434",null,"","VIDE"]
["2014-01-08","NOM PRENOM 1435","CEL 99999999","99999999","Ok"]
["2014-01-08","NOM PRENOM 1436","TEL 99.99.99.99","99999999","Ok"]
["2014-01-08","NOM PRENOM 1437",null,"","VIDE"]
["2014-01-08","NOM PRENOM 1438",null,"","VIDE"]
["2014-01-08","NOM PRENOM 1439","DU 99.99.99","","VIDE"]
["2014-01-08","NOM PRENOM 1440","CNI C9999.9999.99 DU 99/99/9999","","VIDE"]
["2014-01-08","NOM PRENOM 1441","PC 99-99-99999999 DU 99/99/9999","","VIDE"]
["2014-01-08","NOM PRENOM 1442","DU 99-99-9999 AU 99-99-9999","","VIDE"]
["2014-01-08","NOM PRENOM 1443",null,"","VIDE"]
["2014-01-08","NOM PRENOM 1444",null,"","VIDE"]
["2014-01-08","NOM PRENOM 1445","CNI C9999999999 DU 99/99/9999 AU 99/99/9999","","VIDE"]
["2014-01-08","NOM PRENOM 1446","TEL 99999999","99999999","Ok"]
["2014-01-08","NOM PRENOM 1447","TEL 99999999","99999999","Ok"]
["2014-01-08","NOM PRENOM 1448","PASS NBE999999 DU 99/99/9999 + CE INPHB N° 99INP99999 DE 9999-9999","","VIDE"]
["2014-01-08","NOM PRENOM 1449","VAL99/99/9999 CEL99999999","99999999","Ok"]
["2014-01-08","NOM PRENOM 1450","TEL 99999999","99999999","Ok"]
["2014-01-08","NOM PRENOM 1451",null,"","VIDE"]
["2014-01-08","NOM PRENOM 1452","CNI C9999999999 DU 99/99/9999 AU 99/99/9999","","VIDE"]
["2014-01-08","NOM PRENOM 1453",null,"","VIDE"]
["2014-01-08","NOM PRENOM 1454","TEL:99-99-99-99","99999999","Ok"]
["2014-01-08","NOM PRENOM 1455","CIC MLI N 999999.CGMA.CI DU 99/99/9999 A ABJ","","VIDE"]
["2014-01-08","NOM PRENOM 1456","/99 TEL 99999999","99999999","Ok"]
["2014-01-08","NOM PRENOM 1457","C9999.9999.99 DU 99.99.99","","VIDE"]
["2014-01-08","NOM PRENOM 1458","CNI C9999999999 DU 99/99/9999 A SOUBRE","","VIDE"]
["2014-01-08","NOM PRENOM 1459","TEL 99999999","99999999","Ok"]
["2014-01-08","NOM PRENOM 1460",null,"","VIDE"]
["2014-01-08","NOM PRENOM 1461","TEL 99999999","99999999","Ok"]
["2014-01-08","NOM PRENOM 1462",null,"","VIDE"]
["2014-01-08","NOM PRENOM 1463","tel 99999999","99999999","Ok"]
["2014-01-08","NOM PRENOM 1464",null,"","VIDE"]
["2014-01-08","NOM PRENOM 1465",null,"","VIDE"]
["2014-01-08","NOM PRENOM 1466",null,"","VIDE"]
["2014-01-08","NOM PRENOM 1467","TEL 99999999","99999999","Ok"]
["2014-01-08","NOM PRENOM 1468","TEL 99.99.99.99","99999999","Ok"]
["2014-01-08","NOM PRENOM 1469",99999999,"99999999","Ok"]
["2014-01-08","NOM PRENOM 1470",null,"","VIDE"]
["2014-01-08","NOM PRENOM 1471",null,"","VIDE"]
["2014-01-08","NOM PRENOM 1472",null,"","VIDE"]
["2014-01-08","NOM PRENOM 1473","TEL 99999999","99999999","Ok"]
["2014-01-08","NOM PRENOM 1474","TEL 99.99.99.99",{"$f":"gettel(C1475)","v":"99999999"},{"$f":"IF(LEN(D1475)=0,\"VIDE\",IF(LEN(D1475)=8,\"Ok\",\"?\"))","v":"Ok"}]
["2014-01-08","NOM PRENOM 1475",99999999,"99999999","Ok"]
["2014-01-08","NOM PRENOM 1476","TEL:99-99-99-99","99999999","Ok"]
["2014-01-08","NOM PRENOM 1477",null,"","VIDE"]
["2014-01-08","NOM PRENOM 1478",null,"","VIDE"]
["2014-01-08","NOM PRENOM 1479","TEL 99999999","99999999","Ok"]
["2014-01-08","NOM PRENOM 1480",null,"","VIDE"]
["2014-01-08","NOM PRENOM 1481","TEL 99999999","99999999","Ok"]
["2014-01-08","NOM PRENOM 1482","val 99/99/9999","","VIDE"]
["2014-01-08","NOM PRENOM 1483",null,"","VIDE"]
["2014-01-08","NOM PRENOM 1484","TEL 99999999","99999999","Ok"]
["2014-01-08","NOM PRENOM 1485",null,"","VIDE"]
["2014-01-08","NOM PRENOM 1486","TEL 99999999","99999999","Ok"]
["2014-01-08","NOM PRENOM 1487","TEL 99999999","99999999","Ok"]
["2014-01-08","NOM PRENOM 1488",null,"","VIDE"]
["2014-01-08","NOM PRENOM 1489","TEL: 99999999","99999999","Ok"]
["2014-01-08","NOM PRENOM 1490","TEL 99999999","99999999","Ok"]
["2014-01-08","NOM PRENOM 1491","DATE KOMLAN","","VIDE"]
["2014-01-08","NOM PRENOM 1492","PASS N°99AB99999 DU 99/99/9999","","VIDE"]
["2014-01-08","NOM PRENOM 1493","CEL 99.99.99.99","99999999","Ok"]
["2014-01-08","NOM PRENOM 1494","cisse mahamar","","VIDE"]
["2014-01-08","NOM PRENOM 1495",null,"","VIDE"]
["2014-01-08","NOM PRENOM 1496","TEL 99.99.99.99","99999999","Ok"]
["2014-01-08","NOM PRENOM 1497",null,"","VIDE"]
["2014-01-08","NOM PRENOM 1498",99999999,"99999999","Ok"]
["2014-01-08","NOM PRENOM 1499","TEL 99.99.99.99","99999999","Ok"]
["2014-01-08","NOM PRENOM 1500","KOUDE SOULEIMANE","","VIDE"]
["2014-01-08","NOM PRENOM 1501","TEL 99999999","99999999","Ok"]
["2014-01-08","NOM PRENOM 1502","TEL:99999999","99999999","Ok"]
["2014-01-08","NOM PRENOM 1503",null,"","VIDE"]
["2014-01-08","NOM PRENOM 1504",null,"","VIDE"]
["2014-01-08","NOM PRENOM 1505","CEL:99999999","99999999","Ok"]
["2014-01-08","NOM PRENOM 1506",99999999,"99999999","Ok"]
["2014-01-08","NOM PRENOM 1507",null,"","VIDE"]
["2014-01-08","NOM PRENOM 1508",null,"","VIDE"]
["2014-01-08","NOM PRENOM 1509","TEL 99999999","99999999","Ok"]
["2014-01-08","NOM PRENOM 1510",null,"","VIDE"]
["2014-01-08","NOM PRENOM 1511",null,"","VIDE"]
["2014-01-08","NOM PRENOM 1512","TEL 99999999","99999999","Ok"]
["2014-01-08","NOM PRENOM 1513",null,"","VIDE"]
["2014-01-09","NOM PRENOM 1514",null,"","VIDE"]
["2014-01-09","NOM PRENOM 1515","ET PC 99-99-99999999 DU 99.99.9999","","VIDE"]
["2014-01-09","NOM PRENOM 1516","CNI N° C9999999999 DU 99/99/9999","","VIDE"]
["2014-01-09","NOM PRENOM 1517",null,"","VIDE"]
["2014-01-09","NOM PRENOM 1518","CNI C9999999999 DU 99/99/9999 A GRD ZATTRY","","VIDE"]
["2014-01-09","NOM PRENOM 1519",null,"","VIDE"]
["2014-01-09","NOM PRENOM 1520","PC N°99.999.99.999999 DU 99.99.99","","VIDE"]
["2014-01-09","NOM PRENOM 1521",null,"","VIDE"]
["2014-01-09","NOM PRENOM 1522","CEL 99.99.99.99","99999999","Ok"]
["2014-01-09","NOM PRENOM 1523",null,"","VIDE"]
["2014-01-09","NOM PRENOM 1524","CEL 99999999","99999999","Ok"]
["2014-01-09","NOM PRENOM 1525",null,"","VIDE"]
["2014-01-09","NOM PRENOM 1526","CEL 99.99.99.99","99999999","Ok"]
["2014-01-09","NOM PRENOM 1527","CEL 99999999  AUTO: 99999",{"$f":"gettel(C1528)","v":"99999999AUTO99999"},"?"]
["2014-01-09","NOM PRENOM 1528",null,"","VIDE"]
["2014-01-09","NOM PRENOM 1529","TEL 99.99.99.99","99999999","Ok"]
["2014-01-09","NOM PRENOM 1530","9999 99 DU 99.99.99 AU 99.99.99","","VIDE"]
["2014-01-09","NOM PRENOM 1531",null,"","VIDE"]
["2014-01-09","NOM PRENOM 1532",null,"","VIDE"]
["2014-01-09","NOM PRENOM 1533","TEL 99999999","99999999","Ok"]
["2014-01-09","NOM PRENOM 1534","CNI N° C9999999999 DU 99/99/9999","","VIDE"]
["2014-01-09","NOM PRENOM 1535","TEL 99999999","99999999","Ok"]
["2014-01-09","NOM PRENOM 1536",null,"","VIDE"]
["2014-01-09","NOM PRENOM 1537","TEL 99.99.99.99","99999999","Ok"]
["2014-01-09","NOM PRENOM 1538","CNI C9999999999 DU 99/99/9999 AU 99/99/9999",{"$f":"gettel(C1539)","v":""},{"$f":"IF(LEN(D1539)=0,\"VIDE\",IF(LEN(D1539)=8,\"Ok\",\"?\"))","v":"VIDE"}]
["2014-01-09","NOM PRENOM 1539","TEL 99999999","99999999","Ok"]
["2014-01-09","NOM PRENOM 1540","TEL 99.99.99.99","99999999","Ok"]
["2014-01-09","NOM PRENOM 1541",null,"","VIDE"]
["2014-01-09","NOM PRENOM 1542",null,"","VIDE"]
["2014-01-09","NOM PRENOM 1543",null,"","VIDE"]
["2014-01-09","NOM PRENOM 1544","CNI C9999.9999.99 DU 99/99/9999","","VIDE"]
["2014-01-09","NOM PRENOM 1545","DU 99.99.99","","VIDE"]
["2014-01-09","NOM PRENOM 1546",null,"","VIDE"]
["2014-01-09","NOM PRENOM 1547",null,"","VIDE"]
["2014-01-09","NOM PRENOM 1548","CEL 99999999","99999999","Ok"]
["2014-01-09","NOM PRENOM 1549",null,"","VIDE"]
["2014-01-09","NOM PRENOM 1550","TEL 99999999","99999999","Ok"]
["2014-01-09","NOM PRENOM 1551","TEL 99999999","99999999","Ok"]
["2014-01-09","NOM PRENOM 1552",null,"","VIDE"]
["2014-01-09","NOM PRENOM 1553","TEL 99999999","99999999","Ok"]
["2014-01-09","NOM PRENOM 1554","CNI C 9999 9999 99 DU 99/99/99 - TEL 99999999","99999999","Ok"]
["2014-01-09","NOM PRENOM 1555","CELL 99999999","99999999","Ok"]
["2014-01-09","NOM PRENOM 1556","CEL 99.99.99.99","99999999","Ok"]
["2014-01-09","NOM PRENOM 1557","TEL 99.99.99.99","99999999","Ok"]
["2014-01-09","NOM PRENOM 1558","C9999.9999.99 DU 99.99.99","","VIDE"]
["2014-01-09","NOM PRENOM 1559","CEL 99999999","99999999","Ok"]
["2014-01-09","NOM PRENOM 1560",null,"","VIDE"]
["2014-01-09","NOM PRENOM 1561","CNI N9 C 9999.9999.99 DU 99.99.9999","","VIDE"]
["2014-01-09","NOM PRENOM 1562","CNI N 9C 9999.9999.99 DU 99.99.9999","","VIDE"]
["2014-01-09","NOM PRENOM 1563","CNI C9999.9999.99 DU 99/99/9999","","VIDE"]
["2014-01-09","NOM PRENOM 1564","TEL 99999999","99999999","Ok"]
["2014-01-09","NOM PRENOM 1565","CEL 99999999","99999999","Ok"]
["2014-01-09","NOM PRENOM 1566","CNI C9999.9999.99 DU 99.99.99","","VIDE"]
["2014-01-09","NOM PRENOM 1567","TEL 99999999","99999999","Ok"]
["2014-01-09","NOM PRENOM 1568","CNI C9999.9999.99 DU 99.99.99","","VIDE"]
["2014-01-09","NOM PRENOM 1569","TEL:99-99-99-99","99999999","Ok"]
["2014-01-09","NOM PRENOM 1570","DU 99-99-9999 AU 99-99-9999","","VIDE"]
["2014-01-09","NOM PRENOM 1571","TEL 99999999","99999999","Ok"]
["2014-01-09","NOM PRENOM 1572","CNI C9999999999 DU 99/99/9999 A SOUBRE","","VIDE"]
["2014-01-09","NOM PRENOM 1573","TEL 99999999","99999999","Ok"]
["2014-01-09","NOM PRENOM 1574",null,"","VIDE"]
["2014-01-09","NOM PRENOM 1575","CIC NIGER N 999999 DU 99/99/9999 A ABJ","","VIDE"]
["2014-01-09","NOM PRENOM 1576","TEL:99-99-99-99","99999999","Ok"]
["2014-01-09","NOM PRENOM 1577","TEL 99.99.99.99","99999999","Ok"]
["2014-01-09","NOM PRENOM 1578",null,"","VIDE"]
["2014-01-09","NOM PRENOM 1579","CNI 999999999999 DAU 99/99/9999","","VIDE"]
["2014-01-09","NOM PRENOM 1580","CELL 99999999","99999999","Ok"]
["2014-01-09","NOM PRENOM 1581","TEL 99999999","99999999","Ok"]
["2014-01-09","NOM PRENOM 1582","TEL 99.99.99.99","99999999","Ok"]
["2014-01-09","NOM PRENOM 1583","TEL 99.99.99.99","99999999","Ok"]
["2014-01-09","NOM PRENOM 1584","AI N 999/9999/99-99/PU-99 DU 99/99/9999 au 99/99/9999","","VIDE"]
["2014-01-09","NOM PRENOM 1585","CNI N9 C 9999.9999.99 DU 99.99.9999","","VIDE"]
["2014-01-09","NOM PRENOM 1586","TEL 99999999","99999999","Ok"]
["2014-01-09","NOM PRENOM 1587","DJAKARIDJA REF 99999999","","VIDE"]
["2014-01-09","NOM PRENOM 1588","CNI C9999.9999.99 DU 99/99/9999","","VIDE"]
["2014-01-09","NOM PRENOM 1589",null,"","VIDE"]
["2014-01-09","NOM PRENOM 1590","TEL 99999999","99999999","Ok"]
["2014-01-09","NOM PRENOM 1591",null,"","VIDE"]
["2014-01-09","NOM PRENOM 1592","CEL 99999999","99999999","Ok"]
["2014-01-09","NOM PRENOM 1593","CEL 99999999","99999999","Ok"]
["2014-01-09","NOM PRENOM 1594","TEL 99.99.99.99","99999999","Ok"]
["2014-01-09","NOM PRENOM 1595","CNI N9 C 9999.9999.99 DU 99.99.9999 SAN PEDRO","","VIDE"]
["2014-01-09","NOM PRENOM 1596","CNI C9999.9999.99 DU 99.99.99","","VIDE"]
["2014-01-09","NOM PRENOM 1597","CNI C9999.9999.99 DU 99/99/9999","","VIDE"]
["2014-01-09","NOM PRENOM 1598","TEL 99.99.99.99","99999999","Ok"]
["2014-01-09","NOM PRENOM 1599","TEL 99999999","99999999","Ok"]
["2014-01-09","NOM PRENOM 1600",null,"","VIDE"]
["2014-01-09","NOM PRENOM 1601","CEL 99999999","99999999","Ok"]
["2014-01-09","NOM PRENOM 1602","CNI C 9999999999 DU 99/99/99",{"$f":"gettel(C1603)","v":""},{"$f":"IF(LEN(D1603)=0,\"VIDE\",IF(LEN(D1603)=8,\"Ok\",\"?\"))","v":"VIDE"}]
["2014-01-09","NOM PRENOM 1603","CNI C9999999999 DU 99/99/9999 AU 99/99/9999","","VIDE"]
["2014-01-09","NOM PRENOM 1604","CNI 99999999999 DU 99/99/9999 AU 99/99/9999","","VIDE"]
["2014-01-09","NOM PRENOM 1605","TEL 99.99.99.99","99999999","Ok"]
["2014-01-09","NOM PRENOM 1606","CEL 99999999","99999999","Ok"]
["2014-01-09","NOM PRENOM 1607","CNI N 9C 9999.9999.99 DU 99.99.9999","","VIDE"]
["2014-01-09","NOM PRENOM 1608","CEL 99999999","99999999","Ok"]
["2014-01-09","NOM PRENOM 1609","TEL 99999999","99999999","Ok"]
["2014-01-09","NOM PRENOM 1610",null,"","VIDE"]
["2014-01-09","NOM PRENOM 1611","CNI C9999.9999.99 DU 99.99.99","","VIDE"]
["2014-01-09","NOM PRENOM 1612","CNI C9999.9999.99 DU 99.99.99","","VIDE"]
["2014-01-09","NOM PRENOM 1613","CEL:99999999","99999999","Ok"]
["2014-01-09","NOM PRENOM 1614",null,"","VIDE"]
["2014-01-09","NOM PRENOM 1615","CNI N° C9999999999 DU 99/99/9999","","VIDE"]
["2014-01-09","NOM PRENOM 1616","CEL 99999999","99999999","Ok"]
["2014-01-09","NOM PRENOM 1617","CNI N° C9999999999 DU 99/99/9999","","VIDE"]
["2014-01-09","NOM PRENOM 1618","CNI C9999.9999.99 DU 99/99/9999","","VIDE"]
["2014-01-09","NOM PRENOM 1619",null,"","VIDE"]
["2014-01-09","NOM PRENOM 1620",null,"","VIDE"]
["2014-01-09","NOM PRENOM 1621",null,"","VIDE"]
["2014-01-09","NOM PRENOM 1622",null,"","VIDE"]
["2014-01-09","NOM PRENOM 1623","CEL 99999999","99999999","Ok"]
["2014-01-09","NOM PRENOM 1624",null,"","VIDE"]
["2014-01-09","NOM PRENOM 1625","TEL 99999999","99999999","Ok"]
["2014-01-09","NOM PRENOM 1626","TEL 99.99.99.99","99999999","Ok"]
["2014-01-09","NOM PRENOM 1627","CNI C9999999999 DU 99/99/9999 AU 99/99/9999","","VIDE"]
["2014-01-09","NOM PRENOM 1628",null,"","VIDE"]
["2014-01-09","NOM PRENOM 1629",null,"","VIDE"]
["2014-01-09","NOM PRENOM 1630","CNI N 9C 9999.9999.99 DU 99.99.9999","","VIDE"]
["2014-01-09","NOM PRENOM 1631","CNI N° C9999999999 DU 99/99/9999","","VIDE"]
["2014-01-09","NOM PRENOM 1632",null,"","VIDE"]
["2014-01-09","NOM PRENOM 1633",99999999,"99999999","Ok"]
["2014-01-09","NOM PRENOM 1634","TEL 99.99.99.99","99999999","Ok"]
["2014-01-09","NOM PRENOM 1635",null,"","VIDE"]
["2014-01-09","NOM PRENOM 1636",null,"","VIDE"]
["2014-01-09","NOM PRENOM 1637","CEL 99999999","99999999","Ok"]
["2014-01-09","NOM PRENOM 1638",null,"","VIDE"]
["2014-01-09","NOM PRENOM 1639","VAL99/99/9999 CEL99999999","99999999","Ok"]
["2014-01-09","NOM PRENOM 1640",null,"","VIDE"]
["2014-01-09","NOM PRENOM 1641","TEL 99.99.99.99","99999999","Ok"]
["2014-01-09","NOM PRENOM 1642",null,"","VIDE"]
["2014-01-09","NOM PRENOM 1643","CEL 99999999","99999999","Ok"]
["2014-01-09","NOM PRENOM 1644","CNI 999999999999 AU 99/99/9999","","VIDE"]
["2014-01-09","NOM PRENOM 1645","CEL 99.99.99.99","99999999","Ok"]
["2014-01-09","NOM PRENOM 1646","CNI C9999999999 DU 99/99/9999 A SOUBRE","","VIDE"]
["2014-01-09","NOM PRENOM 1647","TEL 99999999","99999999","Ok"]
["2014-01-09","NOM PRENOM 1648",null,"","VIDE"]
["2014-01-09","NOM PRENOM 1649",null,"","VIDE"]
["2014-01-09","NOM PRENOM 1650","TEL 99999999","99999999","Ok"]
["2014-01-09","NOM PRENOM 1651",null,"","VIDE"]
["2014-01-09","NOM PRENOM 1652",null,"","VIDE"]
["2014-01-09","NOM PRENOM 1653",null,"","VIDE"]
["2014-01-09","NOM PRENOM 1654","CEL 99999999","99999999","Ok"]
["2014-01-09","NOM PRENOM 1655","CEL 99.999999","99999999","Ok"]
["2014-01-09","NOM PRENOM 1656","TEL 99999999","99999999","Ok"]
["2014-01-09","NOM PRENOM 1657","+ PASSEPORT CIV 99AA99999 DU 99/9/99 AU 99/9/99","","VIDE"]
["2014-01-09","NOM PRENOM 1658","TEL:99-99-99-99","99999999","Ok"]
["2014-01-09","NOM PRENOM 1659",null,"","VIDE"]
["2014-01-09","NOM PRENOM 1660",99999999,"99999999","Ok"]
["2014-01-09","NOM PRENOM 1661",null,"","VIDE"]
["2014-01-09","NOM PRENOM 1662",null,"","VIDE"]
["2014-01-09","NOM PRENOM 1663",null,"","VIDE"]
["2014-01-09","NOM PRENOM 1664","CEL 99.99.99.99","99999999","Ok"]
["2014-01-09","NOM PRENOM 1665",99999999,"99999999","Ok"]
["2014-01-09","NOM PRENOM 1666",99999999,{"$f":"gettel(C1667)","v":"99999999"},{"$f":"IF(LEN(D1667)=0,\"VIDE\",IF(LEN(D1667)=8,\"Ok\",\"?\"))","v":"Ok"}]
["2014-01-09","NOM PRENOM 1667",null,"","VIDE"]
["2014-01-09","NOM PRENOM 1668",null,"","VIDE"]
["2014-01-09","NOM PRENOM 1669","CNI C 9999999999 DU 99/99/99","","VIDE"]
["2014-01-09","NOM PRENOM 1670",null,"","VIDE"]
["2014-01-09","NOM PRENOM 1671",null,"","VIDE"]
["2014-01-09","NOM PRENOM 1672",null,"","VIDE"]
["2014-01-09","NOM PRENOM 1673","TEL 99.99.99.99","99999999","Ok"]
["2014-01-09","NOM PRENOM 1674",null,"","VIDE"]
["2014-01-09","NOM PRENOM 1675","CNI N° C 9999999999 DU 99/99/9999","","VIDE"]
["2014-01-09","NOM PRENOM 1676","CNI C 9999999999 DU 99/99/99","","VIDE"]
["2014-01-09","NOM PRENOM 1677",null,"","VIDE"]
["2014-01-09","NOM PRENOM 1678","CNI C9999999999 DU 99/99/9999 AU 99/99/9999","","VIDE"]
["2014-01-09","NOM PRENOM 1679",null,"","VIDE"]
["2014-01-09","NOM PRENOM 1680",null,"","VIDE"]
["2014-01-09","NOM PRENOM 1681","CNI N 999999999999 DU 99/99/99 AU 99/99/9999","","VIDE"]
["2014-01-09","NOM PRENOM 1682","TEL 99.99.99.99","99999999","Ok"]
["2014-01-09","NOM PRENOM 1683",99999999,"99999999","Ok"]
["2014-01-09","NOM PRENOM 1684",99999999,"99999999","Ok"]
["2014-01-09","NOM PRENOM 1685","DU 99-99-9999 AU 99-99-9999","","VIDE"]
["2014-01-09","NOM PRENOM 1686","TEL 99999999","99999999","Ok"]
["2014-01-09","NOM PRENOM 1687","cel 99999999","99999999","Ok"]
["2014-01-09","NOM PRENOM 1688","PC 99-99-99999999 DU 99/99/9999 + AI 9999-999/99-99/PU-BFLE DU 99/99/","","VIDE"]
["2014-01-09","NOM PRENOM 1689","c el 99999999","","VIDE"]
["2014-01-09","NOM PRENOM 1690","TEL 99.99.99.99","99999999","Ok"]
["2014-01-09","NOM PRENOM 1691",null,"","VIDE"]
["2014-01-09","NOM PRENOM 1692",null,"","VIDE"]
["2014-01-09","NOM PRENOM 1693","CNI C9999999999 DU 99/99/9999 AU 99/99/9999","","VIDE"]
["2014-01-09","NOM PRENOM 1694","CNI C9999.9999.99 DU 99/99/9999","","VIDE"]
["2014-01-09","NOM PRENOM 1695","PSSP 99AB99999 DU 99/99/99 AU 99/99/99","","VIDE"]
["2014-01-09","NOM PRENOM 1696","TEL 99999999","99999999","Ok"]
["2014-01-09","NOM PRENOM 1697","TEL 99.99.99.99","99999999","Ok"]
["2014-01-09","NOM PRENOM 1698",null,"","VIDE"]
["2014-01-09","NOM PRENOM 1699","CELL 99999999","99999999","Ok"]
["2014-01-09","NOM PRENOM 1700","TEL 99999999","99999999","Ok"]
["2014-01-09","NOM PRENOM 1701","CEL 99.99.99.99","99999999","Ok"]
["2014-01-09","NOM PRENOM 1702","TEL 99999999","99999999","Ok"]
["2014-01-09","NOM PRENOM 1703",null,"","VIDE"]
["2014-01-09","NOM PRENOM 1704",null,"","VIDE"]
["2014-01-09","NOM PRENOM 1705","TEL 99.99.99.99","99999999","Ok"]
["2014-01-09","NOM PRENOM 1706","CEL 99999999","99999999","Ok"]
["2014-01-09","NOM PRENOM 1707","tel 99999999","99999999","Ok"]
["2014-01-09","NOM PRENOM 1708","CNI C9999999999 DU 99/99/99","","VIDE"]
["2014-01-09","NOM PRENOM 1709",null,"","VIDE"]
["2014-01-09","NOM PRENOM 1710","TEL 999999999",{"$f":"gettel(C1711)","v":"999999999"},"?"]
["2014-01-09","NOM PRENOM 1711","CNI C9999999999 DU 99/99/9999 AU 99/99/9999","","VIDE"]
["2014-01-09","NOM PRENOM 1712","CEL 99999999","99999999","Ok"]
["2014-01-09","NOM PRENOM 1713",null,"","VIDE"]
["2014-01-09","NOM PRENOM 1714","CEL 99.99.99.99","99999999","Ok"]
["2014-01-09","NOM PRENOM 1715","TEL 99999999","99999999","Ok"]
["2014-01-09","NOM PRENOM 1716","CNI C9999.9999.99 DU 99/99/9999","","VIDE"]
["2014-01-09","NOM PRENOM 1717","TEL 99999999","99999999","Ok"]
["2014-01-09","NOM PRENOM 1718","CEL 99999999","99999999","Ok"]
["2014-01-09","NOM PRENOM 1719",null,"","VIDE"]
["2014-01-09","NOM PRENOM 1720","PC 99-99-99999999 DU 99/99/9999 - CIC CAM 999/99 DU 99/99/9999","","VIDE"]
["2014-01-09","NOM PRENOM 1721","TEL 99999999","99999999","Ok"]
["2014-01-09","NOM PRENOM 1722","CNI N 9C 9999.9999.99 DU 99.99.9999 SEGUELA","","VIDE"]
["2014-01-09","NOM PRENOM 1723",null,"","VIDE"]
["2014-01-09","NOM PRENOM 1724","TEL 99.99.99.99","99999999","Ok"]
["2014-01-09","NOM PRENOM 1725","TEL  99999999","99999999","Ok"]
["2014-01-09","NOM PRENOM 1726","CEL 99999999","99999999","Ok"]
["2014-01-09","NOM PRENOM 1727","CNI C9999.9999.99 DU 99/99/9999","","VIDE"]
["2014-01-09","NOM PRENOM 1728","TEL 99999999","99999999","Ok"]
["2014-01-09","NOM PRENOM 1729","CNI N9 999999999999 DU 99.99.9999","","VIDE"]
["2014-01-09","NOM PRENOM 1730","TEL 99.99.99.99",{"$f":"gettel(C1731)","v":"99999999"},{"$f":"IF(LEN(D1731)=0,\"VIDE\",IF(LEN(D1731)=8,\"Ok\",\"?\"))","v":"Ok"}]
["2014-01-09","NOM PRENOM 1731",null,"","VIDE"]
["2014-01-09","NOM PRENOM 1732","CNI C9999.9999.99 DU 99/99/9999","","VIDE"]
["2014-01-09","NOM PRENOM 1733","CNI N 9C 9999.9999.99 DU 99.99.9999 DIMBOKRO","","VIDE"]
["2014-01-09","NOM PRENOM 1734","TEL 99999999","99999999","Ok"]
["2014-01-09","NOM PRENOM 1735",null,"","VIDE"]
["2014-01-09","NOM PRENOM 1736",null,"","VIDE"]
["2014-01-09","NOM PRENOM 1737","TEL 99999999","99999999","Ok"]
["2014-01-09","NOM PRENOM 1738",null,"","VIDE"]
["2014-01-09","NOM PRENOM 1739","BOLLY DEMBA","","VIDE"]
["2014-01-09","NOM PRENOM 1740","kone djakaridja","","VIDE"]
["2014-01-09","NOM PRENOM 1741",null,"","VIDE"]
["2014-01-09","NOM PRENOM 1742","OUEDRAOGO ADISSA","","VIDE"]
["2014-01-09","NOM PRENOM 1743",null,"","VIDE"]
["2014-01-09","NOM PRENOM 1744",null,"","VIDE"]
["2014-01-09","NOM PRENOM 1745","TEL 99999999","99999999","Ok"]
["2014-01-09","NOM PRENOM 1746",null,"","VIDE"]
["2014-01-09","NOM PRENOM 1747",null,"","VIDE"]
["2014-01-09","NOM PRENOM 1748",99999999,"99999999","Ok"]
["2014-01-09","NOM PRENOM 1749","ATT 999-999/99-99/PU9 DU 99/99/99 - TEL","","VIDE"]
["2014-01-09","NOM PRENOM 1750",null,"","VIDE"]
["2014-01-09","NOM PRENOM 1751",null,"","VIDE"]
["2014-01-09","NOM PRENOM 1752",null,"","VIDE"]
["2014-01-09","NOM PRENOM 1753",null,"","VIDE"]
["2014-01-09","NOM PRENOM 1754",null,"","VIDE"]
["2014-01-09","NOM PRENOM 1755",null,"","VIDE"]
["2014-01-09","NOM PRENOM 1756",null,"","VIDE"]
["2014-01-09","NOM PRENOM 1757","TEL 99.99.99.99","99999999","Ok"]
["2014-01-09","NOM PRENOM 1758",null,"","VIDE"]
["2014-01-09","NOM PRENOM 1759",null,"","VIDE"]
["2014-01-09","NOM PRENOM 1760",99999999,"99999999","Ok"]
["2014-01-09","NOM PRENOM 1761","DIALLO MOUSSA","","VIDE"]
["2014-01-09","NOM PRENOM 1762",null,"","VIDE"]
["2014-01-09","NOM PRENOM 1763","ZI KOUDOUGOU","","VIDE"]
["2014-01-09","NOM PRENOM 1764","TOGO","","VIDE"]
["2014-01-09","NOM PRENOM 1765",null,"","VIDE"]
["2014-01-09","NOM PRENOM 1766","TEL 99999999","99999999","Ok"]
["2014-01-09","NOM PRENOM 1767",null,"","VIDE"]
["2014-01-09","NOM PRENOM 1768",null,"","VIDE"]
["2014-01-09","NOM PRENOM 1769","TEL 99999999","99999999","Ok"]
["2014-01-09","NOM PRENOM 1770",null,"","VIDE"]
["2014-01-09","NOM PRENOM 1771","TEL 99999999","99999999","Ok"]
["2014-01-09","NOM PRENOM 1772",null,"","VIDE"]
["2014-01-09","NOM PRENOM 1773","999999/CGMA/CI DU 99.99.9999","","VIDE"]
["2014-01-09","NOM PRENOM 1774","TEL 99999999","99999999","Ok"]
["2014-01-09","NOM PRENOM 1775",null,"","VIDE"]
["2014-01-09","NOM PRENOM 1776",null,"","VIDE"]
["2014-01-09","NOM PRENOM 1777",null,"","VIDE"]
["2014-01-09","NOM PRENOM 1778",null,"","VIDE"]
["2014-01-09","NOM PRENOM 1779","TEL 99999999","99999999","Ok"]
["2014-01-09","NOM PRENOM 1780",null,"","VIDE"]
["2014-01-09","NOM PRENOM 1781",null,"","VIDE"]
["2014-01-09","NOM PRENOM 1782","SANGARE ZOUMANA","","VIDE"]
["2014-01-09","NOM PRENOM 1783",null,"","VIDE"]
["2014-01-09","NOM PRENOM 1784","MALI","","VIDE"]
["2014-01-09","NOM PRENOM 1785","TEL 99999999","99999999","Ok"]
["2014-01-09","NOM PRENOM 1786",null,"","VIDE"]
["2014-01-09","NOM PRENOM 1787",null,"","VIDE"]
["2014-01-10","NOM PRENOM 1788","TEL 99.99.99.99","99999999","Ok"]
["2014-01-10","NOM PRENOM 1789",null,"","VIDE"]
["2014-01-10","NOM PRENOM 1790","CNI C9999999999 DU 99/99/9999 AU 99/99/9999","","VIDE"]
["2014-01-10","NOM PRENOM 1791","VAL99/99/9999 CEL99999999","99999999","Ok"]
["2014-01-10","NOM PRENOM 1792",null,"","VIDE"]
["2014-01-10","NOM PRENOM 1793","TEL:99-99-99-99","99999999","Ok"]
["2014-01-10","NOM PRENOM 1794","VAL99/99/9999 CEL99999999",{"$f":"gettel(C1795)","v":"99999999"},{"$f":"IF(LEN(D1795)=0,\"VIDE\",IF(LEN(D1795)=8,\"Ok\",\"?\"))","v":"Ok"}]
["2014-01-10","NOM PRENOM 1795","CEL 99999999","99999999","Ok"]
["2014-01-10","NOM PRENOM 1796","DU 99/99/9999 AU 99/99/9999","","VIDE"]
["2014-01-10","NOM PRENOM 1797","ET PC IV NO 99-99-99999999 DU 99/99/9999","","VIDE"]
["2014-01-10","NOM PRENOM 1798","TEL 99.99.99.99","99999999","Ok"]
["2014-01-10","NOM PRENOM 1799","PASS TOGO EB999999 DU 99/99/99 - TEL 99999999","99999999","Ok"]
["2014-01-10","NOM PRENOM 1800",null,"","VIDE"]
["2014-01-10","NOM PRENOM 1801","TEL 99999999","99999999","Ok"]
["2014-01-10","NOM PRENOM 1802","TEL: 99999999","99999999","Ok"]
["2014-01-10","NOM PRENOM 1803","TEL 99999999","99999999","Ok"]
["2014-01-10","NOM PRENOM 1804","CNI C 9999999999 DU 99/99/99 AU 99/99/99","","VIDE"]
["2014-01-10","NOM PRENOM 1805","99AD99999 DU 99.99.9999 ET ATT N°999-99999/","","VIDE"]
["2014-01-10","NOM PRENOM 1806","TEL 99.99.99.99","99999999","Ok"]
["2014-01-10","NOM PRENOM 1807","99 AU 99/99/99 PASSPORT 99AD99999 DU 99/99/","","VIDE"]
["2014-01-10","NOM PRENOM 1808",null,"","VIDE"]
["2014-01-10","NOM PRENOM 1809",null,"","VIDE"]
["2014-01-10","NOM PRENOM 1810",null,"","VIDE"]
["2014-01-10","NOM PRENOM 1811",null,"","VIDE"]
["2014-01-10","NOM PRENOM 1812","CNI C9999 9999 99 DU 99/99/99 - TEL 99999999","99999999","Ok"]
["2014-01-10","NOM PRENOM 1813","CNI C9999999999 DU 99/99/99 AU 99/99/99","","VIDE"]
["2014-01-10","NOM PRENOM 1814",null,"","VIDE"]
["2014-01-10","NOM PRENOM 1815","TEL 99.99.99.99","99999999","Ok"]
["2014-01-10","NOM PRENOM 1816",99999999,"99999999","Ok"]
["2014-01-10","NOM PRENOM 1817","TEL 99.99.99.99","99999999","Ok"]
["2014-01-10","NOM PRENOM 1818",null,"","VIDE"]
["2014-01-10","NOM PRENOM 1819","TEL 99.99.99.99","99999999","Ok"]
["2014-01-10","NOM PRENOM 1820","TEL 99.99.99.99","99999999","Ok"]
["2014-01-10","NOM PRENOM 1821","CNI C9999.9999.99 DU 99/99/9999","","VIDE"]
["2014-01-10","NOM PRENOM 1822",null,"","VIDE"]
["2014-01-10","NOM PRENOM 1823","TEL 99999999","99999999","Ok"]
["2014-01-10","NOM PRENOM 1824","CIC MALI 999999/CGMA/CI DU 99/99/99 - TEL 99999999","99999999","Ok"]
["2014-01-10","NOM PRENOM 1825","CEL 99.99.9999","99999999","Ok"]
["2014-01-10","NOM PRENOM 1826",null,"","VIDE"]
["2014-01-10","NOM PRENOM 1827","CNI C9999999999 DU 99/99/99 AU 99/9/99","","VIDE"]
["2014-01-10","NOM PRENOM 1828",null,"","VIDE"]
["2014-01-10","NOM PRENOM 1829","TEL 99.99.99.99","99999999","Ok"]
["2014-01-10","NOM PRENOM 1830","CEL 99999999","99999999","Ok"]
["2014-01-10","NOM PRENOM 1831",null,"","VIDE"]
["2014-01-10","NOM PRENOM 1832","TEL 99.99.99.99","99999999","Ok"]
["2014-01-10","NOM PRENOM 1833","TEL 99999999","99999999","Ok"]
["2014-01-10","NOM PRENOM 1834","CNI N 9C 9999.9999.99 DU 99.99.9999","","VIDE"]
["2014-01-10","NOM PRENOM 1835","CNI N° C9999999999 DU 99/99/9999","","VIDE"]
["2014-01-10","NOM PRENOM 1836","TEL 99999999","99999999","Ok"]
["2014-01-10","NOM PRENOM 1837",null,"","VIDE"]
["2014-01-10","NOM PRENOM 1838","TEL 99999999","99999999","Ok"]
["2014-01-10","NOM PRENOM 1839","TEL 99999999","99999999","Ok"]
["2014-01-10","NOM PRENOM 1840","ATT 999-9999/99-99/PU99 DU 99/99/99 - TEL 99999999","99999999","Ok"]
["2014-01-10","NOM PRENOM 1841","TEL 99999999","99999999","Ok"]
["2014-01-10","NOM PRENOM 1842","TEL 99999999","99999999","Ok"]
["2014-01-10","NOM PRENOM 1843","TEL:99-99-99-99","99999999","Ok"]
["2014-01-10","NOM PRENOM 1844","VAL99/99/9999 CEL99999999","99999999","Ok"]
["2014-01-10","NOM PRENOM 1845","TEL:99-99-99-99","99999999","Ok"]
["2014-01-10","NOM PRENOM 1846","TEL 99999999","99999999","Ok"]
["2014-01-10","NOM PRENOM 1847","TEL 99999999","99999999","Ok"]
["2014-01-10","NOM PRENOM 1848",null,"","VIDE"]
["2014-01-10","NOM PRENOM 1849","CEL 99999999","99999999","Ok"]
["2014-01-10","NOM PRENOM 1850",null,"","VIDE"]
["2014-01-10","NOM PRENOM 1851","CEL 99999999","99999999","Ok"]
["2014-01-10","NOM PRENOM 1852","TEL 99999999","99999999","Ok"]
["2014-01-10","NOM PRENOM 1853",null,"","VIDE"]
["2014-01-10","NOM PRENOM 1854","TEL 99.99.99.99","99999999","Ok"]
["2014-01-10","NOM PRENOM 1855","DECLARATION DE PERTE CNI + ATT N°99999999 DU 99-99-9999","","VIDE"]
["2014-01-10","NOM PRENOM 1856","TEL 99999999","99999999","Ok"]
["2014-01-10","NOM PRENOM 1857","cel 99999999","99999999","Ok"]
["2014-01-10","NOM PRENOM 1858",null,{"$f":"gettel(C1859)","v":""},{"$f":"IF(LEN(D1859)=0,\"VIDE\",IF(LEN(D1859)=8,\"Ok\",\"?\"))","v":"VIDE"}]
["2014-01-10","NOM PRENOM 1859","TEL 99.99.99.99","99999999","Ok"]
["2014-01-10","NOM PRENOM 1860","TEL 99.99.99.99","99999999","Ok"]
["2014-01-10","NOM PRENOM 1861","TEL 99.99.99.99","99999999","Ok"]
["2014-01-10","NOM PRENOM 1862","+ AI 999-99999/99-99/PPA/BCA DU 99/99/99 AU 99/99/99","","VIDE"]
["2014-01-10","NOM PRENOM 1863",null,"","VIDE"]
["2014-01-10","NOM PRENOM 1864","CEL 99999999","99999999","Ok"]
["2014-01-10","NOM PRENOM 1865","TEL 99999999","99999999","Ok"]
["2014-01-10","NOM PRENOM 1866","TEL 99.99.99.99","99999999","Ok"]
["2014-01-10","NOM PRENOM 1867","TEL:99-99-99-99","99999999","Ok"]
["2014-01-10","NOM PRENOM 1868","TEL 99999999","99999999","Ok"]
["2014-01-10","NOM PRENOM 1869","CNI C 9999999999 DU 99/99/99","","VIDE"]
["2014-01-10","NOM PRENOM 1870","CNI N° C9999999999 DU 99/99/9999","","VIDE"]
["2014-01-10","NOM PRENOM 1871","TEL 99999999","99999999","Ok"]
["2014-01-10","NOM PRENOM 1872","TEL:99-99-99-99","99999999","Ok"]
["2014-01-10","NOM PRENOM 1873","CNI C9999999999 DU 99/99/9999 AU 99/99/9999","","VIDE"]
["2014-01-10","NOM PRENOM 1874","TEL 99999999","99999999","Ok"]
["2014-01-10","NOM PRENOM 1875",null,"","VIDE"]
["2014-01-10","NOM PRENOM 1876","TEL:99-99-99-99","99999999","Ok"]
["2014-01-10","NOM PRENOM 1877","CNI N° C9999999999 DU 99/99/9999","","VIDE"]
["2014-01-10","NOM PRENOM 1878","DU 99/99/99 AU 99/99/99","","VIDE"]
["2014-01-10","NOM PRENOM 1879",null,"","VIDE"]
["2014-01-10","NOM PRENOM 1880",null,"","VIDE"]
["2014-01-10","NOM PRENOM 1881","TEL:99-99-99-99","99999999","Ok"]
["2014-01-10","NOM PRENOM 1882","CNI C9999999999 DU 99/99/9999","","VIDE"]
["2014-01-10","NOM PRENOM 1883",null,"","VIDE"]
["2014-01-10","NOM PRENOM 1884","TEL 99999999","99999999","Ok"]
["2014-01-10","NOM PRENOM 1885","CNI C 9999999999 DU 99/99/99","","VIDE"]
["2014-01-10","NOM PRENOM 1886","TEL 99.99.99.99","99999999","Ok"]
["2014-01-10","NOM PRENOM 1887","CNI 999999999999 DU 99/99/9999 AU 99/99/9999","","VIDE"]
["2014-01-10","NOM PRENOM 1888","TEL:99-99-99-99","99999999","Ok"]
["2014-01-10","NOM PRENOM 1889","CEL 99.99.99.99","99999999","Ok"]
["2014-01-10","NOM PRENOM 1890","CEL99999999","99999999","Ok"]
["2014-01-10","NOM PRENOM 1891","TEL 99999999","99999999","Ok"]
["2014-01-10","NOM PRENOM 1892","TEL 99.99.99.99","99999999","Ok"]
["2014-01-10","NOM PRENOM 1893","CEL99999999","99999999","Ok"]
["2014-01-10","NOM PRENOM 1894",99999999,"99999999","Ok"]
["2014-01-10","NOM PRENOM 1895","TEL 99999999","99999999","Ok"]
["2014-01-10","NOM PRENOM 1896","CEL99999999","99999999","Ok"]
["2014-01-10","NOM PRENOM 1897",null,"","VIDE"]
["2014-01-10","NOM PRENOM 1898","TEL:99-99-99-99","99999999","Ok"]
["2014-01-10","NOM PRENOM 1899","CEL 99999999","99999999","Ok"]
["2014-01-10","NOM PRENOM 1900","CNI C9999999999 DU 99/99/9999 AU 99/99/9999","","VIDE"]
["2014-01-10","NOM PRENOM 1901",99999999,"99999999","Ok"]
["2014-01-10","NOM PRENOM 1902","TEL 99999999","99999999","Ok"]
["2014-01-10","NOM PRENOM 1903",null,"","VIDE"]
["2014-01-10","NOM PRENOM 1904",null,"","VIDE"]
["2014-01-10","NOM PRENOM 1905",null,"","VIDE"]
["2014-01-10","NOM PRENOM 1906","CNI C9999999999 DU 99/99/9999 AU 99/99/9999","","VIDE"]
["2014-01-10","NOM PRENOM 1907","CEL 99999999","99999999","Ok"]
["2014-01-10","NOM PRENOM 1908",null,"","VIDE"]
["2014-01-10","NOM PRENOM 1909",null,"","VIDE"]
["2014-01-10","NOM PRENOM 1910","CNI C9999.9999.99 DU 99/99/9999","","VIDE"]
["2014-01-10","NOM PRENOM 1911","TEL 99999999","99999999","Ok"]
["2014-01-10","NOM PRENOM 1912","TEL 99.99.99.99","99999999","Ok"]
["2014-01-10","NOM PRENOM 1913","CNI C9999999999 DU 99.99.9999","","VIDE"]
["2014-01-10","NOM PRENOM 1914",99999999,"99999999","Ok"]
["2014-01-10","NOM PRENOM 1915","CNI C9999999999 DU 99/99/9999 A GUIBEROUA","","VIDE"]
["2014-01-10","NOM PRENOM 1916",null,"","VIDE"]
["2014-01-10","NOM PRENOM 1917",null,"","VIDE"]
["2014-01-10","NOM PRENOM 1918","TEL: 99999999","99999999","Ok"]
["2014-01-10","NOM PRENOM 1919",null,"","VIDE"]
["2014-01-10","NOM PRENOM 1920","CEL 99.99.99.99","99999999","Ok"]
["2014-01-10","NOM PRENOM 1921","CNI C9999.9999.99 DU 99/99/9999","","VIDE"]
["2014-01-10","NOM PRENOM 1922","CNI C9999999999 DU 99.99.9999",{"$f":"gettel(C1923)","v":""},{"$f":"IF(LEN(D1923)=0,\"VIDE\",IF(LEN(D1923)=8,\"Ok\",\"?\"))","v":"VIDE"}]
["2014-01-10","NOM PRENOM 1923","CNI C9999.9999.99 DU 99/99/9999","","VIDE"]
["2014-01-10","NOM PRENOM 1924","TEL 99999999","99999999","Ok"]
["2014-01-10","NOM PRENOM 1925","TEL 99.99.99.99","99999999","Ok"]
["2014-01-10","NOM PRENOM 1926","CNI C9999999999 DU 99.99.9999","","VIDE"]
["2014-01-10","NOM PRENOM 1927","TEL:99-99-99-99","99999999","Ok"]
["2014-01-10","NOM PRENOM 1928","VAL99/99/9999 CEL99999999","99999999","Ok"]
["2014-01-10","NOM PRENOM 1929","TEL 99.99.99.99","99999999","Ok"]
["2014-01-10","NOM PRENOM 1930","TEL 99999999","99999999","Ok"]
["2014-01-10","NOM PRENOM 1931","TEL 99.99.99.99","99999999","Ok"]
["2014-01-10","NOM PRENOM 1932","CEL 99.99.99.99","99999999","Ok"]
["2014-01-10","NOM PRENOM 1933",null,"","VIDE"]
["2014-01-10","NOM PRENOM 1934",null,"","VIDE"]
["2014-01-10","NOM PRENOM 1935",null,"","VIDE"]
["2014-01-10","NOM PRENOM 1936","CEL 99999999","99999999","Ok"]
["2014-01-10","NOM PRENOM 1937","DU 99/99/9999","","VIDE"]
["2014-01-10","NOM PRENOM 1938","val 99/99/9999  cel 99999999","99999999","Ok"]
["2014-01-10","NOM PRENOM 1939",null,"","VIDE"]
["2014-01-10","NOM PRENOM 1940","TEL 99.99.99.99","99999999","Ok"]
["2014-01-10","NOM PRENOM 1941","CNI C9999.9999.99 DU 99/99/9999","","VIDE"]
["2014-01-10","NOM PRENOM 1942","CNI C9999999999 DUN 99/99/9999 A SOUBRE","","VIDE"]
["2014-01-10","NOM PRENOM 1943","cel 99999999","99999999","Ok"]
["2014-01-10","NOM PRENOM 1944","CNI N° C9999 9999 99 DU 99/99/9999 AU 99/99/9999","","VIDE"]
["2014-01-10","NOM PRENOM 1945",null,"","VIDE"]
["2014-01-10","NOM PRENOM 1946","CEL 99999999","99999999","Ok"]
["2014-01-10","NOM PRENOM 1947","CNI N° C9999 9999 99 DU 99/99/9999 AU 99/99/9999","","VIDE"]
["2014-01-10","NOM PRENOM 1948","TEL 99999999","99999999","Ok"]
["2014-01-10","NOM PRENOM 1949","CNI C9999.9999.99 DU 99.99.99","","VIDE"]
["2014-01-10","NOM PRENOM 1950","TEL 99999999","99999999","Ok"]
["2014-01-10","NOM PRENOM 1951","TEL99.99.99.99","99999999","Ok"]
["2014-01-10","NOM PRENOM 1952","CNI N 9C 9999.9999.99 DU 99.99.9999","","VIDE"]
["2014-01-10","NOM PRENOM 1953",null,"","VIDE"]
["2014-01-10","NOM PRENOM 1954","CEL 99.99.99.99","99999999","Ok"]
["2014-01-10","NOM PRENOM 1955",null,"","VIDE"]
["2014-01-10","NOM PRENOM 1956","VAL99/99/9999 CEL99999999","99999999","Ok"]
["2014-01-10","NOM PRENOM 1957","TEL 99999999","99999999","Ok"]
["2014-01-10","NOM PRENOM 1958","CEL 99999999","99999999","Ok"]
["2014-01-10","NOM PRENOM 1959","TEL 99.99.99.99","99999999","Ok"]
["2014-01-10","NOM PRENOM 1960","TEL 99.99.99.99","99999999","Ok"]
["2014-01-10","NOM PRENOM 1961","PASS N 99AD99999 DU 99/99/99 AU 99/99/99","","VIDE"]
["2014-01-10","NOM PRENOM 1962","CNI C9999.9999.99 DU 99/99/9999","","VIDE"]
["2014-01-10","NOM PRENOM 1963","CNI C 9999999999 DU 99/99/99","","VIDE"]
["2014-01-10","NOM PRENOM 1964","CEL 99999999","99999999","Ok"]
["2014-01-10","NOM PRENOM 1965","CNI C9999999999 DU 99/99/9999 AU 99/99/9999","","VIDE"]
["2014-01-10","NOM PRENOM 1966","TEL:99-99-99-99","99999999","Ok"]
["2014-01-10","NOM PRENOM 1967",null,"","VIDE"]
["2014-01-10","NOM PRENOM 1968","TEL 99999999","99999999","Ok"]
["2014-01-10","NOM PRENOM 1969",null,"","VIDE"]
["2014-01-10","NOM PRENOM 1970","CNI C 9999999999 DU 99/99/99","","VIDE"]
["2014-01-10","NOM PRENOM 1971","CNI N 9C 9999.9999.99 DU 99.99.9999","","VIDE"]
["2014-01-10","NOM PRENOM 1972","TEL 99999999","99999999","Ok"]
["2014-01-10","NOM PRENOM 1973","TEL 99.99.99.99","99999999","Ok"]
["2014-01-10","NOM PRENOM 1974","+CP CHAMBRE DE COMMERCE MAT 9999","","VIDE"]
["2014-01-10","NOM PRENOM 1975","AU 99/99/9999","","VIDE"]
["2014-01-10","NOM PRENOM 1976","TEL 99999999","99999999","Ok"]
["2014-01-10","NOM PRENOM 1977","CNI N9 C 9999.9999.99 DU 99.99.9999","","VIDE"]
["2014-01-10","NOM PRENOM 1978",null,"","VIDE"]
["2014-01-10","NOM PRENOM 1979","CNI C9999999999 DU 99/99/9999 AU 99/99/9999","","VIDE"]
["2014-01-10","NOM PRENOM 1980","CIC BF N 9999999/ABFA/9999 DU 99/99/9999 A SOUBRE","","VIDE"]
["2014-01-10","NOM PRENOM 1981","DIABATE LACINE","","VIDE"]
["2014-01-10","NOM PRENOM 1982",null,"","VIDE"]
["2014-01-10","NOM PRENOM 1983","TEL 99.99.99.99","99999999","Ok"]
["2014-01-10","NOM PRENOM 1984",null,"","VIDE"]
["2014-01-10","NOM PRENOM 1985","CNI C 9999999999 DU 99/99/9999 A ABJ","","VIDE"]
["2014-01-10","NOM PRENOM 1986","TEL 99.99.99.99",{"$f":"gettel(C1987)","v":"99999999"},{"$f":"IF(LEN(D1987)=0,\"VIDE\",IF(LEN(D1987)=8,\"Ok\",\"?\"))","v":"Ok"}]
["2014-01-10","NOM PRENOM 1987",null,"","VIDE"]
["2014-01-10","NOM PRENOM 1988",null,"","VIDE"]
["2014-01-10","NOM PRENOM 1989","TITRE DE SEJOUR N°99999999/99-9999/MI/ONI/DIE/TP VAL 99/99/9999","","VIDE"]
["2014-01-10","NOM PRENOM 1990",null,"","VIDE"]
["2014-01-10","NOM PRENOM 1991",null,"","VIDE"]
["2014-01-10","NOM PRENOM 1992","CNI C 99999999999","","VIDE"]
["2014-01-10","NOM PRENOM 1993",null,"","VIDE"]
["2014-01-10","NOM PRENOM 1994","TEL 99999999","99999999","Ok"]
["2014-01-10","NOM PRENOM 1995",null,"","VIDE"]
["2014-01-10","NOM PRENOM 1996","CNI N°C9999999999 DU 99/99/9999","","VIDE"]
["2014-01-10","NOM PRENOM 1997","CNI C 9999999999 DU 99/99/99","","VIDE"]
["2014-01-10","NOM PRENOM 1998",null,"","VIDE"]
["2014-01-10","NOM PRENOM 1999",null,"","VIDE"]
["2014-01-10","NOM PRENOM 2000","TEL 99.99.99.99","99999999","Ok"]
["2014-01-10","NOM PRENOM 2001","TEL:99-99-99-99","99999999","Ok"]
["2014-01-10","NOM PRENOM 2002",null,"","VIDE"]
["2014-01-10","NOM PRENOM 2003","TEL 99.99.99.99","99999999","Ok"]
["2014-01-10","NOM PRENOM 2004",null,"","VIDE"]
["2014-01-10","NOM PRENOM 2005",null,"","VIDE"]
["2014-01-10","NOM PRENOM 2006","CEL 99999999","99999999","Ok"]
["2014-01-10","NOM PRENOM 2007",null,"","VIDE"]
["2014-01-10","NOM PRENOM 2008",null,"","VIDE"]
["2014-01-10","NOM PRENOM 2009","CEL 99999999","99999999","Ok"]
["2014-01-10","NOM PRENOM 2010","PASS 99AB99999 DU 99/99/99 AU 99/99/99","","VIDE"]
["2014-01-10","NOM PRENOM 2011","TEL 99999999","99999999","Ok"]
["2014-01-10","NOM PRENOM 2012","CNI C9999999999 DU 99/99/9999 A SOUBRE","","VIDE"]
["2014-01-10","NOM PRENOM 2013",null,"","VIDE"]
["2014-01-10","NOM PRENOM 2014",99999999,"99999999","Ok"]
["2014-01-10","NOM PRENOM 2015",null,"","VIDE"]
["2014-01-10","NOM PRENOM 2016",null,"","VIDE"]
["2014-01-10","NOM PRENOM 2017",null,"","VIDE"]
["2014-01-10","NOM PRENOM 2018","AI 9999/999.999/99.99/PU9YAKRO + PASS 99AD99999 DU 99/99/9999","","VIDE"]
["2014-01-10","NOM PRENOM 2019",null,"","VIDE"]
["2014-01-10","NOM PRENOM 2020","TEL 99.99.99.99","99999999","Ok"]
["2014-01-10","NOM PRENOM 2021","TEL 99.99.99.99","99999999","Ok"]
["2014-01-10","NOM PRENOM 2022","TEL:99-99-99-99","99999999","Ok"]
["2014-01-10","NOM PRENOM 2023","TEL 99.99.99.99","99999999","Ok"]
["2014-01-10","NOM PRENOM 2024","TEL 99999999","99999999","Ok"]
["2014-01-10","NOM PRENOM 2025","9999.9999.99 DU 99.99.99","","VIDE"]
["2014-01-10","NOM PRENOM 2026",null,"","VIDE"]
["2014-01-10","NOM PRENOM 2027","CNI C9999.9999.99 DU 99/99/9999","","VIDE"]
["2014-01-10","NOM PRENOM 2028",null,"","VIDE"]
["2014-01-10","NOM PRENOM 2029","MLE 9999","","VIDE"]
["2014-01-10","NOM PRENOM 2030",null,"","VIDE"]
["2014-01-10","NOM PRENOM 2031",null,"","VIDE"]
["2014-01-10","NOM PRENOM 2032",null,"","VIDE"]
["2014-01-10","NOM PRENOM 2033","TEL 99999999","99999999","Ok"]
["2014-01-10","NOM PRENOM 2034",null,"","VIDE"]
["2014-01-10","NOM PRENOM 2035",null,"","VIDE"]
["2014-01-10","NOM PRENOM 2036","DEST ABDOUL/ SGAL","","VIDE"]
["2014-01-10","NOM PRENOM 2037","TEL 99999999","99999999","Ok"]
["2014-01-10","NOM PRENOM 2038","TEL 99999999","99999999","Ok"]
["2014-01-10","NOM PRENOM 2039","etablie le 99/99/9999 cel 99999999","99999999","Ok"]
["2014-01-10","NOM PRENOM 2040","TEL 99999999","99999999","Ok"]
["2014-01-10","NOM PRENOM 2041","TEL:99-99-99-99","99999999","Ok"]
["2014-01-10","NOM PRENOM 2042","TEL 99.99.99.99","99999999","Ok"]
["2014-01-10","NOM PRENOM 2043","CNI C9999999999 DU 99/99/9999","","VIDE"]
["2014-01-10","NOM PRENOM 2044",null,"","VIDE"]
["2014-01-10","NOM PRENOM 2045",null,"","VIDE"]
["2014-01-10","NOM PRENOM 2046",99999999,"99999999","Ok"]
["2014-01-10","NOM PRENOM 2047",99999999,"99999999","Ok"]
["2014-01-10","NOM PRENOM 2048","TEL 99.99.99.99","99999999","Ok"]
["2014-01-10","NOM PRENOM 2049","TEL 99999999","99999999","Ok"]
["2014-01-10","NOM PRENOM 2050","TEL 99999999",{"$f":"gettel(C2051)","v":"99999999"},{"$f":"IF(LEN(D2051)=0,\"VIDE\",IF(LEN(D2051)=8,\"Ok\",\"?\"))","v":"Ok"}]
["2014-01-10","NOM PRENOM 2051","DAFF IBRAHIMA","","VIDE"]
["2014-01-10","NOM PRENOM 2052",null,"","VIDE"]
["2014-01-10","NOM PRENOM 2053","TEL 99999999","99999999","Ok"]
["2014-01-10","NOM PRENOM 2054","GUINDO ABDOULAYE","","VIDE"]
["2014-01-10","NOM PRENOM 2055","CNI C C9999 9999 99 DU 99/99/99 - TEL 99999999","99999999","Ok"]
["2014-01-10","NOM PRENOM 2056",null,"","VIDE"]
["2014-01-10","NOM PRENOM 2057",null,"","VIDE"]
["2014-01-10","NOM PRENOM 2058",null,"","VIDE"]
["2014-01-10","NOM PRENOM 2059","TEL 99999999","99999999","Ok"]
["2014-01-10","NOM PRENOM 2060","TEL 99.99.99.99","99999999","Ok"]
["2014-01-10","NOM PRENOM 2061",null,"","VIDE"]
["2014-01-10","NOM PRENOM 2062",null,"","VIDE"]
["2014-01-10","NOM PRENOM 2063",null,"","VIDE"]
["2014-01-10","NOM PRENOM 2064",null,"","VIDE"]
["2014-01-10","NOM PRENOM 2065","TEL 99.99.99.99","99999999","Ok"]
["2014-01-10","NOM PRENOM 2066","TEL 99999999","99999999","Ok"]
["2014-01-10","NOM PRENOM 2067",null,"","VIDE"]
["2014-01-10","NOM PRENOM 2068","TEL 99999999","99999999","Ok"]
["2014-01-10","NOM PRENOM 2069",null,"","VIDE"]
["2014-01-10","NOM PRENOM 2070","TEL 99999999","99999999","Ok"]
["2014-01-10","NOM PRENOM 2071","val 99/99/9999","","VIDE"]
["2014-01-10","NOM PRENOM 2072","TEL 99.99.99.99","99999999","Ok"]
["2014-01-10","NOM PRENOM 2073",null,"","VIDE"]
["2014-01-10","NOM PRENOM 2074",null,"","VIDE"]
["2014-01-10","NOM PRENOM 2075","TEL 99999999","99999999","Ok"]
["2014-01-10","NOM PRENOM 2076","SANGARE ZOUMANA","","VIDE"]
["2014-01-10","NOM PRENOM 2077","TEL 99999999","99999999","Ok"]
["2014-01-10","NOM PRENOM 2078","TEL 99999999","99999999","Ok"]
["2014-01-10","NOM PRENOM 2079","TEL 99.99.99.99","99999999","Ok"]
["2014-01-14","NOM PRENOM 2080",99999999,"99999999","Ok"]
["2014-01-14","NOM PRENOM 2081","CEL 99999999","99999999","Ok"]
["2014-01-14","NOM PRENOM 2082","cel 99999999","99999999","Ok"]
["2014-01-14","NOM PRENOM 2083",null,"","VIDE"]
["2014-01-14","NOM PRENOM 2084","99.99.99.99","","VIDE"]
["2014-01-14","NOM PRENOM 2085","cel 99999999","99999999","Ok"]
["2014-01-14","NOM PRENOM 2086","CNI C9999999999 DU 99/99/9999 AU 99/99/9999","","VIDE"]
["2014-01-14","NOM PRENOM 2087",null,"","VIDE"]
["2014-01-14","NOM PRENOM 2088","CNI C9999999999 DU 99/99/9999 A GDR ZATTRY","","VIDE"]
["2014-01-14","NOM PRENOM 2089","cel 99999999","99999999","Ok"]
["2014-01-14","NOM PRENOM 2090","CNI C9999999999 DU 99/99/9999 A GRD ZATTRY","","VIDE"]
["2014-01-14","NOM PRENOM 2091",null,"","VIDE"]
["2014-01-14","NOM PRENOM 2092",null,"","VIDE"]
["2014-01-14","NOM PRENOM 2093","CIC 9999999/ABFA//99 DU 99-99-99","","VIDE"]
["2014-01-14","NOM PRENOM 2094","CNI C 9999.9999.99 DU 99/99/9999","","VIDE"]
["2014-01-14","NOM PRENOM 2095","CNI N 9C 9999.9999.99 DU 99.99.9999 SAN PEDRO","","VIDE"]
["2014-01-14","NOM PRENOM 2096",null,"","VIDE"]
["2014-01-14","NOM PRENOM 2097","CNI C9999999999 DU 99/99/9999 A SOUBRE","","VIDE"]
["2014-01-14","NOM PRENOM 2098","99.99.99.99","","VIDE"]
["2014-01-14","NOM PRENOM 2099",null,"","VIDE"]
["2014-01-14","NOM PRENOM 2100",null,"","VIDE"]
["2014-01-14","NOM PRENOM 2101","CNI C9999999999 DU 99/99/9999 AU 99/99/9999","","VIDE"]
["2014-01-14","NOM PRENOM 2102",null,"","VIDE"]
["2014-01-14","NOM PRENOM 2103","CNI N° C9999 9999 99 DU 99/99/9999 AU 99/99/9999","","VIDE"]
["2014-01-14","NOM PRENOM 2104","CNI C9999999999 DU 99/99/9999 A SOUBRE","","VIDE"]
["2014-01-14","NOM PRENOM 2105",null,"","VIDE"]
["2014-01-14","NOM PRENOM 2106","MLE 9999","","VIDE"]
["2014-01-14","NOM PRENOM 2107","TEL:99-99-99-99","99999999","Ok"]
["2014-01-14","NOM PRENOM 2108","CNI N°C9999999999 VAL 99.99.9999","","VIDE"]
["2014-01-14","NOM PRENOM 2109","CEL 99.99.99.99","99999999","Ok"]
["2014-01-14","NOM PRENOM 2110","TEL 99999999","99999999","Ok"]
["2014-01-14","NOM PRENOM 2111","99.99.99.99","","VIDE"]
["2014-01-14","NOM PRENOM 2112",null,"","VIDE"]
["2014-01-14","NOM PRENOM 2113",null,"","VIDE"]
["2014-01-14","NOM PRENOM 2114",null,{"$f":"gettel(C2115)","v":""},{"$f":"IF(LEN(D2115)=0,\"VIDE\",IF(LEN(D2115)=8,\"Ok\",\"?\"))","v":"VIDE"}]
["2014-01-14","NOM PRENOM 2115",null,"","VIDE"]
["2014-01-14","NOM PRENOM 2116","pc n 99-99-99999999 etablie le 99/99/9999","","VIDE"]
["2014-01-14","NOM PRENOM 2117","TEL 99.99.99.99","99999999","Ok"]
["2014-01-14","NOM PRENOM 2118",null,"","VIDE"]
["2014-01-14","NOM PRENOM 2119","CNI C9999.9999.99 DU 99/99/9999","","VIDE"]
["2014-01-14","NOM PRENOM 2120","CNI C 9999.9999.99 DU 99/99/9999","","VIDE"]
["2014-01-14","NOM PRENOM 2121","99 DU 99.99.99 AU 99.99.99","","VIDE"]
["2014-01-14","NOM PRENOM 2122","TEL 99999999","99999999","Ok"]
["2014-01-14","NOM PRENOM 2123","CNI N° C9999999999 DU 99/99/9999","","VIDE"]
["2014-01-14","NOM PRENOM 2124",null,"","VIDE"]
["2014-01-14","NOM PRENOM 2125",null,"","VIDE"]
["2014-01-14","NOM PRENOM 2126",null,"","VIDE"]
["2014-01-14","NOM PRENOM 2127","TEL:99-99-99-99","99999999","Ok"]
["2014-01-14","NOM PRENOM 2128",null,"","VIDE"]
["2014-01-14","NOM PRENOM 2129","TEL 99999999","99999999","Ok"]
["2014-01-14","NOM PRENOM 2130","TEL:99-99-99-99","99999999","Ok"]
["2014-01-14","NOM PRENOM 2131",null,"","VIDE"]
["2014-01-14","NOM PRENOM 2132","TEL 99.99.99.99","99999999","Ok"]
["2014-01-14","NOM PRENOM 2133",null,"","VIDE"]
["2014-01-14","NOM PRENOM 2134","CNI N° C9999999999 DU 99/99/9999","","VIDE"]
["2014-01-14","NOM PRENOM 2135","TEL 99999999","99999999","Ok"]
["2014-01-14","NOM PRENOM 2136","CNI N° C9999999999 DU 99/99/9999","","VIDE"]
["2014-01-14","NOM PRENOM 2137","PASS EBO99999 DU 99/99/9999","","VIDE"]
["2014-01-14","NOM PRENOM 2138","99.99.99.99","","VIDE"]
["2014-01-14","NOM PRENOM 2139","TEL 99999999","99999999","Ok"]
["2014-01-14","NOM PRENOM 2140","TEL 99999999","99999999","Ok"]
["2014-01-14","NOM PRENOM 2141","TEL 99999999","99999999","Ok"]
["2014-01-14","NOM PRENOM 2142","TEL 99999999","99999999","Ok"]
["2014-01-14","NOM PRENOM 2143","TEL 99999999","99999999","Ok"]
["2014-01-14","NOM PRENOM 2144","99.99.99.99","","VIDE"]
["2014-01-14","NOM PRENOM 2145","TEL 99999999","99999999","Ok"]
["2014-01-14","NOM PRENOM 2146","TEL 99999999 / 99999999",{"$f":"gettel(C2147)","v":"99999999/99999999"},"?"]
["2014-01-14","NOM PRENOM 2147","TEL 99999999","99999999","Ok"]
["2014-01-14","NOM PRENOM 2148",null,"","VIDE"]
["2014-01-14","NOM PRENOM 2149",99999999,"99999999","Ok"]
["2014-01-14","NOM PRENOM 2150","TEL 99999999","99999999","Ok"]
["2014-01-14","NOM PRENOM 2151","CNI C9999.9999.99 DU 99/99/9999","","VIDE"]
["2014-01-14","NOM PRENOM 2152","CEL 99.99.99.99","99999999","Ok"]
["2014-01-14","NOM PRENOM 2153",null,"","VIDE"]
["2014-01-14","NOM PRENOM 2154","TEL 99999999","99999999","Ok"]
["2014-01-14","NOM PRENOM 2155","CIC N° AB/9999/AGCI/99/99 DU 99/99/9999","","VIDE"]
["2014-01-14","NOM PRENOM 2156",99999999,"99999999","Ok"]
["2014-01-14","NOM PRENOM 2157","CNI C9999.9999.99 DU 99/99/9999","","VIDE"]
["2014-01-14","NOM PRENOM 2158",null,"","VIDE"]
["2014-01-14","NOM PRENOM 2159","CNI N° C9999 9999 99 DU 99/99/9999 AU 99/99/9999","","VIDE"]
["2014-01-14","NOM PRENOM 2160",null,"","VIDE"]
["2014-01-14","NOM PRENOM 2161",99999999,"99999999","Ok"]
["2014-01-14","NOM PRENOM 2162",null,"","VIDE"]
["2014-01-14","NOM PRENOM 2163","CEL 99999999","99999999","Ok"]
["2014-01-14","NOM PRENOM 2164",null,"","VIDE"]
["2014-01-14","NOM PRENOM 2165","TEL 99999999","99999999","Ok"]
["2014-01-14","NOM PRENOM 2166","TEL 99.99.99.99","99999999","Ok"]
["2014-01-14","NOM PRENOM 2167","CNI C 9999 9999 99 DU 99/99/99 - TEL 99999999","99999999","Ok"]
["2014-01-14","NOM PRENOM 2168","TEL 99999999","99999999","Ok"]
["2014-01-14","NOM PRENOM 2169","CNI C9999.9999.99 DU 99/99/9999","","VIDE"]
["2014-01-14","NOM PRENOM 2170",null,"","VIDE"]
["2014-01-14","NOM PRENOM 2171","CNI C9999999999 DU 99/99/9999","","VIDE"]
["2014-01-14","NOM PRENOM 2172","99999999 CEL 9999999",{"$f":"gettel(C2173)","v":"9999999"},"?"]
["2014-01-14","NOM PRENOM 2173","TEL 99.99.99.99","99999999","Ok"]
["2014-01-14","NOM PRENOM 2174","CNI N 9C 9999.9999.99 DU 99.99.9999","","VIDE"]
["2014-01-14","NOM PRENOM 2175",null,"","VIDE"]
["2014-01-14","NOM PRENOM 2176","TEL 99999999","99999999","Ok"]
["2014-01-14","NOM PRENOM 2177",null,"","VIDE"]
["2014-01-14","NOM PRENOM 2178","CNI C 9999 9999 99 DU 99/99/99 - TEL 99999999",{"$f":"gettel(C2179)","v":"99999999"},{"$f":"IF(LEN(D2179)=0,\"VIDE\",IF(LEN(D2179)=8,\"Ok\",\"?\"))","v":"Ok"}]
["2014-01-14","NOM PRENOM 2179","VAL99/99/9999 CEL99999999","99999999","Ok"]
["2014-01-14","NOM PRENOM 2180",null,"","VIDE"]
["2014-01-14","NOM PRENOM 2181","TEL 99999999","99999999","Ok"]
["2014-01-14","NOM PRENOM 2182","CNI N9 C 9999.9999.99 DU 99.99.9999","","VIDE"]
["2014-01-14","NOM PRENOM 2183","TEL 99.99.99.99","99999999","Ok"]
["2014-01-14","NOM PRENOM 2184",null,"","VIDE"]
["2014-01-14","NOM PRENOM 2185","TEL 99999999","99999999","Ok"]
["2014-01-14","NOM PRENOM 2186",null,"","VIDE"]
["2014-01-14","NOM PRENOM 2187","TEL 99.99.99.99","99999999","Ok"]
["2014-01-14","NOM PRENOM 2188","CNI N 9C 9999.9999.99 DU 99.99.9999 BONGOUANOU","","VIDE"]
["2014-01-14","NOM PRENOM 2189","TEL 99999999","99999999","Ok"]
["2014-01-14","NOM PRENOM 2190","CNI C9999999999 DU 99/99/9999 AU 99/99/9999","","VIDE"]
["2014-01-14","NOM PRENOM 2191","TEL 99999999","99999999","Ok"]
["2014-01-14","NOM PRENOM 2192","CNI C9999.9999.99 DU 99/99/9999","","VIDE"]
["2014-01-14","NOM PRENOM 2193","ABFA/999 DU 99.99.9999 ET PC","","VIDE"]
["2014-01-14","NOM PRENOM 2194",99999999,"99999999","Ok"]
["2014-01-14","NOM PRENOM 2195","TEL 99999999","99999999","Ok"]
["2014-01-14","NOM PRENOM 2196","CIC TOGO 99999999999 DU 99/99/9999","","VIDE"]
["2014-01-14","NOM PRENOM 2197","TEL 99.99.99.99","99999999","Ok"]
["2014-01-14","NOM PRENOM 2198","CNI C 9999999999 DU 99-99-99","","VIDE"]
["2014-01-14","NOM PRENOM 2199","CNI C 9999999999 DU 99/99/99","","VIDE"]
["2014-01-14","NOM PRENOM 2200",null,"","VIDE"]
["2014-01-14","NOM PRENOM 2201","CNI N° C9999999999 DU 99/99/9999","","VIDE"]
["2014-01-14","NOM PRENOM 2202","CNI N9 C 9999.9999.99 DU 99.99.9999 BOUAKE","","VIDE"]
["2014-01-14","NOM PRENOM 2203","CNI C 9999999999 DU 99-99-99","","VIDE"]
["2014-01-14","NOM PRENOM 2204","CNI C9999999999 DU 99/99/9999 AU 99/99/9999","","VIDE"]
["2014-01-14","NOM PRENOM 2205",null,"","VIDE"]
["2014-01-14","NOM PRENOM 2206","TEL 99999999","99999999","Ok"]
["2014-01-14","NOM PRENOM 2207","CNI C9999.9999.99 DU 99/99/9999","","VIDE"]
["2014-01-14","NOM PRENOM 2208","CNI C9999999999 DU 99/99/99","","VIDE"]
["2014-01-14","NOM PRENOM 2209","TEL:99-99-99-99","99999999","Ok"]
["2014-01-14","NOM PRENOM 2210",null,"","VIDE"]
["2014-01-14","NOM PRENOM 2211",null,"","VIDE"]
["2014-01-14","NOM PRENOM 2212","CNI N9 C 9999.9999.99 DU 99.99.9999 GAGNOA","","VIDE"]
["2014-01-14","NOM PRENOM 2213","CNI C9999.9999.99 DU 99.99.99","","VIDE"]
["2014-01-14","NOM PRENOM 2214",null,"","VIDE"]
["2014-01-14","NOM PRENOM 2215","CEL 99.99.99.99","99999999","Ok"]
["2014-01-14","NOM PRENOM 2216","CNI C9999999999 DU 99/99/9999 AU 99/99/9999","","VIDE"]
["2014-01-14","NOM PRENOM 2217","CNI C9999999999 DU 99/99/9999 A OKROUYO","","VIDE"]
["2014-01-14","NOM PRENOM 2218","TEL 99.99.99.99","99999999","Ok"]
["2014-01-14","NOM PRENOM 2219",null,"","VIDE"]
["2014-01-14","NOM PRENOM 2220","CNI N° 999999999999 DU 99/99/9999","","VIDE"]
["2014-01-14","NOM PRENOM 2221","CNI N 9C 9999.9999.99 DU 99.99.9999","","VIDE"]
["2014-01-14","NOM PRENOM 2222","+ CIC NIGERIA 99999999NG DU 99/99/9999","","VIDE"]
["2014-01-14","NOM PRENOM 2223","CEL 99999999","99999999","Ok"]
["2014-01-14","NOM PRENOM 2224","CNI C9999999999 DU 99/99/9999 AU 99/99/9999","","VIDE"]
["2014-01-14","NOM PRENOM 2225",null,"","VIDE"]
["2014-01-14","NOM PRENOM 2226","CNI N 9C 9999.9999.99 DU 99.99.9999","","VIDE"]
["2014-01-14","NOM PRENOM 2227","N°999999999999 DU 99.99.9999","","VIDE"]
["2014-01-14","NOM PRENOM 2228","TEL 99.99.99.99","99999999","Ok"]
["2014-01-14","NOM PRENOM 2229","TEL 99.99.99.99","99999999","Ok"]
["2014-01-14","NOM PRENOM 2230","CNI C9999999999 DU 99/99/9999 AU 99/99/9999","","VIDE"]
["2014-01-14","NOM PRENOM 2231","CNI N 9C 9999.9999.99 DU 99.99.9999","","VIDE"]
["2014-01-14","NOM PRENOM 2232","TEL:99-99-99-99","99999999","Ok"]
["2014-01-14","NOM PRENOM 2233","TEL 99999999","99999999","Ok"]
["2014-01-14","NOM PRENOM 2234","TEL 99.99.99.99","99999999","Ok"]
["2014-01-14","NOM PRENOM 2235","+PC N°99-99-99999999 CEL99999999","99999999","Ok"]
["2014-01-14","NOM PRENOM 2236","CNI N 9C 9999.9999.99 DU 99.99.9999","","VIDE"]
["2014-01-14","NOM PRENOM 2237","CEL 99999999","99999999","Ok"]
["2014-01-14","NOM PRENOM 2238","CIC BF N 9999999/ABFA/99 DU 99/99/9999 A SOUBRE","","VIDE"]
["2014-01-14","NOM PRENOM 2239","pas n) 99ad99999 du 99.99.9999","","VIDE"]
["2014-01-14","NOM PRENOM 2240",null,"","VIDE"]
["2014-01-14","NOM PRENOM 2241","PC 99-99-99999999 DU 99/99/99","","VIDE"]
["2014-01-14","NOM PRENOM 2242","CNI C 9999 9999 99 DU 99/99/99 - TEL 99999999",{"$f":"gettel(C2243)","v":"99999999"},{"$f":"IF(LEN(D2243)=0,\"VIDE\",IF(LEN(D2243)=8,\"Ok\",\"?\"))","v":"Ok"}]
["2014-01-14","NOM PRENOM 2243","CNI C9999999999 DU 99/99/9999","","VIDE"]
["2014-01-14","NOM PRENOM 2244","CNI C 9999999999 DU 99/99/9999 A OUME","","VIDE"]
["2014-01-14","NOM PRENOM 2245","CIC NIG N°99999 AU 99.99.99","","VIDE"]
["2014-01-14","NOM PRENOM 2246",null,"","VIDE"]
["2014-01-14","NOM PRENOM 2247","PASS USA 999999999 DU 99/99/99 - TEL 99999999","99999999","Ok"]
["2014-01-14","NOM PRENOM 2248","CEL 99.99.99.99","99999999","Ok"]
["2014-01-14","NOM PRENOM 2249","AI N° 999999999999E/99-99/MEMI/ONI/DECI DU 99/99/99","","VIDE"]
["2014-01-14","NOM PRENOM 2250",null,"","VIDE"]
["2014-01-14","NOM PRENOM 2251","CNI C9999999999 DU 99/99/9999 AU 99/99/9999","","VIDE"]
["2014-01-14","NOM PRENOM 2252","CEL 99-99-99-99","99999999","Ok"]
["2014-01-14","NOM PRENOM 2253","TEL 99999999","99999999","Ok"]
["2014-01-14","NOM PRENOM 2254","TEL:99-99-99-99","99999999","Ok"]
["2014-01-14","NOM PRENOM 2255","DU 99/99/9999","","VIDE"]
["2014-01-14","NOM PRENOM 2256","TEL 99999999","99999999","Ok"]
["2014-01-14","NOM PRENOM 2257","CEL 99999999","99999999","Ok"]
["2014-01-14","NOM PRENOM 2258",null,"","VIDE"]
["2014-01-14","NOM PRENOM 2259",null,"","VIDE"]
["2014-01-14","NOM PRENOM 2260","TEL 99999999","99999999","Ok"]
["2014-01-14","NOM PRENOM 2261","CNI C9999.9999.99 DU 99/99/9999","","VIDE"]
["2014-01-14","NOM PRENOM 2262","CNI C 9999999999 DU 99/99/9999","","VIDE"]
["2014-01-14","NOM PRENOM 2263",null,"","VIDE"]
["2014-01-14","NOM PRENOM 2264","CEL 99-99-99-99","99999999","Ok"]
["2014-01-14","NOM PRENOM 2265","DU 99.99.9999 ET ATT N°9999-999999999999J/","","VIDE"]
["2014-01-14","NOM PRENOM 2266","CNI N 9C 9999.9999.99 DU 99.99.9999","","VIDE"]
["2014-01-14","NOM PRENOM 2267","TEL 99.99.99.99","99999999","Ok"]
["2014-01-14","NOM PRENOM 2268","TEL 99.99.99.99","99999999","Ok"]
["2014-01-14","NOM PRENOM 2269","CIC DU GHANA N 999999 DU 99.99.99","","VIDE"]
["2014-01-14","NOM PRENOM 2270","VAL99/99/9999 CEL99999999","99999999","Ok"]
["2014-01-14","NOM PRENOM 2271","CEL 99999999","99999999","Ok"]
["2014-01-14","NOM PRENOM 2272","TEL:99-99-99-99","99999999","Ok"]
["2014-01-14","NOM PRENOM 2273","PC 99-99-99999999 DU 99/99/99 - TEL 99999999","99999999","Ok"]
["2014-01-14","NOM PRENOM 2274","TEL 99.99.99.99","99999999","Ok"]
["2014-01-14","NOM PRENOM 2275",null,"","VIDE"]
["2014-01-14","NOM PRENOM 2276","CNI C 9999999999 DU 99/99/9999","","VIDE"]
["2014-01-14","NOM PRENOM 2277","TEL 99.99.99.99","99999999","Ok"]
["2014-01-14","NOM PRENOM 2278","CEL 99999999","99999999","Ok"]
["2014-01-14","NOM PRENOM 2279","CNI 999999999999 DU 99/99/9999 AU 99/99/9999","","VIDE"]
["2014-01-14","NOM PRENOM 2280","TEL:99-99-99-99","99999999","Ok"]
["2014-01-14","NOM PRENOM 2281",null,"","VIDE"]
["2014-01-14","NOM PRENOM 2282","cel 99999999","99999999","Ok"]
["2014-01-14","NOM PRENOM 2283","CNI N9 999999999999 VAL AU 99.99.9999","","VIDE"]
["2014-01-14","NOM PRENOM 2284","CEL 99999999","99999999","Ok"]
["2014-01-14","NOM PRENOM 2285",null,"","VIDE"]
["2014-01-14","NOM PRENOM 2286","TEL 99.99.99.99","99999999","Ok"]
["2014-01-14","NOM PRENOM 2287","CNI C9999999999 DU 99/99/9999","","VIDE"]
["2014-01-14","NOM PRENOM 2288","CNI C9999999999 DU 99/99/9999 AU 99/99/9999","","VIDE"]
["2014-01-14","NOM PRENOM 2289","TEL 99999999","99999999","Ok"]
["2014-01-14","NOM PRENOM 2290","CEL 99999999","99999999","Ok"]
["2014-01-14","NOM PRENOM 2291","CNI N 9C 9999.9999.99 DU 99.99.9999","","VIDE"]
["2014-01-14","NOM PRENOM 2292","99.99.99.99","","VIDE"]
["2014-01-14","NOM PRENOM 2293",null,"","VIDE"]
["2014-01-14","NOM PRENOM 2294","TEL 99.99.99.99","99999999","Ok"]
["2014-01-14","NOM PRENOM 2295","TEL 99999999","99999999","Ok"]
["2014-01-14","NOM PRENOM 2296","CEL 99.99.99.99","99999999","Ok"]
["2014-01-14","NOM PRENOM 2297","CNI N9 C 9999.9999.99 DU 99.99.9999","","VIDE"]
["2014-01-14","NOM PRENOM 2298","CNI FRANCAISE 999999999999 DU 99.99.9999","","VIDE"]
["2014-01-14","NOM PRENOM 2299","TEL 99999999","99999999","Ok"]
["2014-01-14","NOM PRENOM 2300","TEL 99.99.99.99","99999999","Ok"]
["2014-01-14","NOM PRENOM 2301","DU 99/99/9999 AU 99/999/9999","","VIDE"]
["2014-01-14","NOM PRENOM 2302",null,"","VIDE"]
["2014-01-14","NOM PRENOM 2303","CEL 99999999","99999999","Ok"]
["2014-01-14","NOM PRENOM 2304","CNI N 9C 9999.9999.99 DU 99.99.9999","","VIDE"]
["2014-01-14","NOM PRENOM 2305","CNI C9999.9999.99 DU 99/99/9999","","VIDE"]
["2014-01-14","NOM PRENOM 2306",null,{"$f":"gettel(C2307)","v":""},{"$f":"IF(LEN(D2307)=0,\"VIDE\",IF(LEN(D2307)=8,\"Ok\",\"?\"))","v":"VIDE"}]
["2014-01-14","NOM PRENOM 2307","CEL 99.99.99.99","99999999","Ok"]
["2014-01-14","NOM PRENOM 2308","TEL 99999999","99999999","Ok"]
["2014-01-14","NOM PRENOM 2309","CEL 99.99.99.99","99999999","Ok"]
["2014-01-14","NOM PRENOM 2310",null,"","VIDE"]
["2014-01-14","NOM PRENOM 2311","TEL 99.99.99.99","99999999","Ok"]
["2014-01-14","NOM PRENOM 2312","CNI N° C9999 9999 99 DU 99/99/9999 AU 99/99/9999","","VIDE"]
["2014-01-14","NOM PRENOM 2313","CEL 99.99.99.99","99999999","Ok"]
["2014-01-14","NOM PRENOM 2314","TEL 99999999","99999999","Ok"]
["2014-01-14","NOM PRENOM 2315","CNI N 9C 9999.9999.99 DU 99.99.9999","","VIDE"]
["2014-01-14","NOM PRENOM 2316","CEL 99-99-99-99/99-99-99-99",{"$f":"gettel(C2317)","v":"99999999/99999999"},"?"]
["2014-01-14","NOM PRENOM 2317","CEL 99.99.99.99","99999999","Ok"]
["2014-01-14","NOM PRENOM 2318","TEL 99999999","99999999","Ok"]
["2014-01-14","NOM PRENOM 2319","CNI C9999999999 DU 99/99/9999 AU 99/99/9999","","VIDE"]
["2014-01-14","NOM PRENOM 2320",null,"","VIDE"]
["2014-01-14","NOM PRENOM 2321","CEL 99.99.99.99","99999999","Ok"]
["2014-01-14","NOM PRENOM 2322","VAL 99/99/9999  CEL 99999999","99999999","Ok"]
["2014-01-14","NOM PRENOM 2323","CNI N 9C 9999.9999.99 DU 99.99.9999 BANGOLO","","VIDE"]
["2014-01-14","NOM PRENOM 2324",null,"","VIDE"]
["2014-01-14","NOM PRENOM 2325",null,"","VIDE"]
["2014-01-14","NOM PRENOM 2326","TEL.99.99.99.99","99999999","Ok"]
["2014-01-14","NOM PRENOM 2327","CNI N 9C 9999.9999.99 DU 99.99.9999","","VIDE"]
["2014-01-14","NOM PRENOM 2328","TEL 99.99.99.99","99999999","Ok"]
["2014-01-14","NOM PRENOM 2329","CEL 99.99.99.99","99999999","Ok"]
["2014-01-14","NOM PRENOM 2330","TEL:99-99-99-99","99999999","Ok"]
["2014-01-14","NOM PRENOM 2331","CNI C9999999999 DU 99/99/9999 AU 99/99/9999","","VIDE"]
["2014-01-14","NOM PRENOM 2332","CNI N° 9999999999 DU 99/99/9999","","VIDE"]
["2014-01-14","NOM PRENOM 2333","val 99/99/9999 cel 99999999","99999999","Ok"]
["2014-01-14","NOM PRENOM 2334",null,"","VIDE"]
["2014-01-14","NOM PRENOM 2335","DU 99/99/9999","","VIDE"]
["2014-01-14","NOM PRENOM 2336","CNI C 9999 9999 99 DU 99/99/99 - TEL 99999999","99999999","Ok"]
["2014-01-14","NOM PRENOM 2337",null,"","VIDE"]
["2014-01-14","NOM PRENOM 2338","cel 99999999","99999999","Ok"]
["2014-01-14","NOM PRENOM 2339","TEL 99.99.99.99","99999999","Ok"]
["2014-01-14","NOM PRENOM 2340","TEL:99-99-99-99","99999999","Ok"]
["2014-01-14","NOM PRENOM 2341","CNI C9999.9999.99 DU 99/99/9999","","VIDE"]
["2014-01-14","NOM PRENOM 2342","CNI C9999.9999.99 DU 99.99.99","","VIDE"]
["2014-01-14","NOM PRENOM 2343","CNI C9999999999 DU 99/99/9999 AU 99/99/9999","","VIDE"]
["2014-01-14","NOM PRENOM 2344",null,"","VIDE"]
["2014-01-14","NOM PRENOM 2345","CNI N9 C 9999.9999.99 DU 99.99.9999","","VIDE"]
["2014-01-14","NOM PRENOM 2346","CEL  99999999/99999999",{"$f":"gettel(C2347)","v":"99999999/99999999"},"?"]
["2014-01-14","NOM PRENOM 2347","CNI C9999.9999.99 DU 99/99/9999","","VIDE"]
["2014-01-14","NOM PRENOM 2348","TEL 99.99.99.99","99999999","Ok"]
["2014-01-14","NOM PRENOM 2349","TEL 99999999","99999999","Ok"]
["2014-01-14","NOM PRENOM 2350","TEL 99.99.99.99","99999999","Ok"]
["2014-01-14","NOM PRENOM 2351","CNI N 9C 9999.9999.99 DU 99.99.9999","","VIDE"]
["2014-01-14","NOM PRENOM 2352","TEL:99-99-99-99","99999999","Ok"]
["2014-01-14","NOM PRENOM 2353","val 99/99/9999 pssport n 99ad99999 val 99/99/9999","","VIDE"]
["2014-01-14","NOM PRENOM 2354","TEL 99999999","99999999","Ok"]
["2014-01-14","NOM PRENOM 2355","CNI C9999.9999.99 DU 99.99.99","","VIDE"]
["2014-01-14","NOM PRENOM 2356","CNI C 9999999999 DU 99/99/9999 A OUME","","VIDE"]
["2014-01-14","NOM PRENOM 2357",null,"","VIDE"]
["2014-01-14","NOM PRENOM 2358","TEL 99999999","99999999","Ok"]
["2014-01-14","NOM PRENOM 2359","ATTEST N 9999999999M/99-99/MEMI/ONI/DECI DU 99/99/9999 AU 99/99/99","","VIDE"]
["2014-01-14","NOM PRENOM 2360",null,"","VIDE"]
["2014-01-14","NOM PRENOM 2361","TEL 99999999","99999999","Ok"]
["2014-01-14","NOM PRENOM 2362",null,"","VIDE"]
["2014-01-14","NOM PRENOM 2363",null,"","VIDE"]
["2014-01-14","NOM PRENOM 2364",null,"","VIDE"]
["2014-01-14","NOM PRENOM 2365","val 99/99/9999 cel 99999999","99999999","Ok"]
["2014-01-14","NOM PRENOM 2366","+ CIC SENEGAL 9999/9999 DU 99/99/9999","","VIDE"]
["2014-01-14","NOM PRENOM 2367","CNI N 9C 9999.9999.99 DU 99.99.9999 OURAGAHIO","","VIDE"]
["2014-01-14","NOM PRENOM 2368","CIC BF 9999999/ABFA/99 DU 99/99/99 - TEL 99999999","99999999","Ok"]
["2014-01-14","NOM PRENOM 2369","TEL 99999999","99999999","Ok"]
["2014-01-14","NOM PRENOM 2370","cel 99999999",{"$f":"gettel(C2371)","v":"99999999"},{"$f":"IF(LEN(D2371)=0,\"VIDE\",IF(LEN(D2371)=8,\"Ok\",\"?\"))","v":"Ok"}]
["2014-01-14","NOM PRENOM 2371","CNI C9999999999 DU 99/99/99 AU 99/99/9999","","VIDE"]
["2014-01-14","NOM PRENOM 2372",null,"","VIDE"]
["2014-01-14","NOM PRENOM 2373",null,"","VIDE"]
["2014-01-14","NOM PRENOM 2374","99.99.99.99","","VIDE"]
["2014-01-14","NOM PRENOM 2375","CNI N° C9999999999 DU 99/99/9999","","VIDE"]
["2014-01-14","NOM PRENOM 2376","cel 99999999","99999999","Ok"]
["2014-01-14","NOM PRENOM 2377",null,"","VIDE"]
["2014-01-14","NOM PRENOM 2378","CNI C9999999999 DU 99/99/9999 AU 99/99/9999","","VIDE"]
["2014-01-14","NOM PRENOM 2379","CNI N9 C 9999.9999.99 DU 99.99.9999","","VIDE"]
["2014-01-14","NOM PRENOM 2380","CIC B FASO 9999999 DU 99/99/9999","","VIDE"]
["2014-01-14","NOM PRENOM 2381","CNI C9999.9999.99 DU 99/99/9999","","VIDE"]
["2014-01-14","NOM PRENOM 2382","CEL 99999999","99999999","Ok"]
["2014-01-14","NOM PRENOM 2383",99999999,"99999999","Ok"]
["2014-01-14","NOM PRENOM 2384","TEL 99999999","99999999","Ok"]
["2014-01-14","NOM PRENOM 2385","CIC DU BENIN N° 99999/99 DU 99/99/9999","","VIDE"]
["2014-01-14","NOM PRENOM 2386","CNI C9999.9999.99 DU 99/99/9999","","VIDE"]
["2014-01-14","NOM PRENOM 2387","TEL 99999999","99999999","Ok"]
["2014-01-14","NOM PRENOM 2388","CEL 99999999","99999999","Ok"]
["2014-01-14","NOM PRENOM 2389","TEL 99999999","99999999","Ok"]
["2014-01-14","NOM PRENOM 2390","CELL 99999999","99999999","Ok"]
["2014-01-14","NOM PRENOM 2391","TEL 99999999","99999999","Ok"]
["2014-01-14","NOM PRENOM 2392","CIC MALI 999999/CGMA/CI DU 99/99/99","","VIDE"]
["2014-01-14","NOM PRENOM 2393","DU 99/99/9999","","VIDE"]
["2014-01-14","NOM PRENOM 2394",99999999,"99999999","Ok"]
["2014-01-14","NOM PRENOM 2395","TEL 99999999","99999999","Ok"]
["2014-01-14","NOM PRENOM 2396","TEL 99999999","99999999","Ok"]
["2014-01-14","NOM PRENOM 2397","TEL 99.99.99.99","99999999","Ok"]
["2014-01-14","NOM PRENOM 2398",null,"","VIDE"]
["2014-01-14","NOM PRENOM 2399","CNI C9999.9999.99 DU 99/99/9999","","VIDE"]
["2014-01-14","NOM PRENOM 2400",null,"","VIDE"]
["2014-01-14","NOM PRENOM 2401","CEL 99.99.99.99","99999999","Ok"]
["2014-01-14","NOM PRENOM 2402","CNI C9999 9999 99 DU 99/99/99 - TEL 99999999","99999999","Ok"]
["2014-01-14","NOM PRENOM 2403","CNI C9999.9999.99 DU 99/99/9999","","VIDE"]
["2014-01-14","NOM PRENOM 2404","TEL 99999999","99999999","Ok"]
["2014-01-14","NOM PRENOM 2405","CEL 999999999",{"$f":"gettel(C2406)","v":"999999999"},"?"]
["2014-01-14","NOM PRENOM 2406",99999999,"99999999","Ok"]
["2014-01-14","NOM PRENOM 2407",null,"","VIDE"]
["2014-01-14","NOM PRENOM 2408","CNI N° 999999999999 VAL 99/99/9999","","VIDE"]
["2014-01-14","NOM PRENOM 2409","TEL 99.99.99.99","99999999","Ok"]
["2014-01-14","NOM PRENOM 2410",null,"","VIDE"]
["2014-01-14","NOM PRENOM 2411","TEL 99999999","99999999","Ok"]
["2014-01-14","NOM PRENOM 2412","tel 99999999","99999999","Ok"]
["2014-01-14","NOM PRENOM 2413","CNI C9999.9999.99 DU 99/99/9999","","VIDE"]
["2014-01-14","NOM PRENOM 2414","CEL 99.99.99.99","99999999","Ok"]
["2014-01-14","NOM PRENOM 2415","DU 99.99.9999","","VIDE"]
["2014-01-14","NOM PRENOM 2416","TEL 99999999","99999999","Ok"]
["2014-01-14","NOM PRENOM 2417",null,"","VIDE"]
["2014-01-14","NOM PRENOM 2418","TEL 99.99.9.99",{"$f":"gettel(C2419)","v":"9999999"},"?"]
["2014-01-14","NOM PRENOM 2419",null,"","VIDE"]
["2014-01-14","NOM PRENOM 2420","TEL 99999999","99999999","Ok"]
["2014-01-14","NOM PRENOM 2421","CNI N9 C 9999.9999.99 DU 99.99.9999","","VIDE"]
["2014-01-14","NOM PRENOM 2422",null,"","VIDE"]
["2014-01-14","NOM PRENOM 2423","TEL 99.99.99.99","99999999","Ok"]
["2014-01-14","NOM PRENOM 2424","CNI C9999.9999.99 DU 99/99/9999","","VIDE"]
["2014-01-14","NOM PRENOM 2425","99 DU 99.99.99 AU 99.99.99","","VIDE"]
["2014-01-14","NOM PRENOM 2426","TEL 99999999","99999999","Ok"]
["2014-01-14","NOM PRENOM 2427","VAL99/99/9999 CEL99999999","99999999","Ok"]
["2014-01-14","NOM PRENOM 2428","CNI C C9999 9999 99 DU 99/99/99 - TEL 99999999","99999999","Ok"]
["2014-01-14","NOM PRENOM 2429","CEL 99999999","99999999","Ok"]
["2014-01-14","NOM PRENOM 2430","CNI C9999999999 DU 99/99/9999 A ABJ","","VIDE"]
["2014-01-14","NOM PRENOM 2431",null,"","VIDE"]
["2014-01-14","NOM PRENOM 2432","TEL 99.99.99.99","99999999","Ok"]
["2014-01-14","NOM PRENOM 2433",null,"","VIDE"]
["2014-01-14","NOM PRENOM 2434","TEL 99999999",{"$f":"gettel(C2435)","v":"99999999"},{"$f":"IF(LEN(D2435)=0,\"VIDE\",IF(LEN(D2435)=8,\"Ok\",\"?\"))","v":"Ok"}]
["2014-01-14","NOM PRENOM 2435",null,"","VIDE"]
["2014-01-14","NOM PRENOM 2436",null,"","VIDE"]
["2014-01-14","NOM PRENOM 2437","DU 99-99-9999 AU 99-99-9999","","VIDE"]
["2014-01-14","NOM PRENOM 2438","CEL 99999999","99999999","Ok"]
["2014-01-14","NOM PRENOM 2439","CNI C9999999999 DU 99.99.9999","","VIDE"]
["2014-01-14","NOM PRENOM 2440","TEL 99.99.99.99","99999999","Ok"]
["2014-01-14","NOM PRENOM 2441","CNI N° C 9999999999 DU 99/99/9999 AU 99/99/9999","","VIDE"]
["2014-01-14","NOM PRENOM 2442",null,"","VIDE"]
["2014-01-14","NOM PRENOM 2443",null,"","VIDE"]
["2014-01-14","NOM PRENOM 2444",null,"","VIDE"]
["2014-01-14","NOM PRENOM 2445",null,"","VIDE"]
["2014-01-14","NOM PRENOM 2446","TEL 99.99.99.99","99999999","Ok"]
["2014-01-14","NOM PRENOM 2447","cel 99999999","99999999","Ok"]
["2014-01-14","NOM PRENOM 2448",null,"","VIDE"]
["2014-01-14","NOM PRENOM 2449","TEL 99999999","99999999","Ok"]
["2014-01-14","NOM PRENOM 2450","CEL 99999999","99999999","Ok"]
["2014-01-14","NOM PRENOM 2451","TEL 99.99.99.99","99999999","Ok"]
["2014-01-14","NOM PRENOM 2452","TEL 99.99.99.99","99999999","Ok"]
["2014-01-14","NOM PRENOM 2453","TEL 999999999",{"$f":"gettel(C2454)","v":"999999999"},"?"]
["2014-01-14","NOM PRENOM 2454","CNI C9999999999  DU 99/99/99","","VIDE"]
["2014-01-14","NOM PRENOM 2455",null,"","VIDE"]
["2014-01-14","NOM PRENOM 2456","CNI C 9999999999 DU 99/99/99","","VIDE"]
["2014-01-14","NOM PRENOM 2457","CNI C9999.9999.99 DU 99/99/9999","","VIDE"]
["2014-01-14","NOM PRENOM 2458","CNI N° C 99999999 DU 99/99/9999","","VIDE"]
["2014-01-14","NOM PRENOM 2459",null,"","VIDE"]
["2014-01-14","NOM PRENOM 2460","CNI C 9999999999 DU 99/99/99","","VIDE"]
["2014-01-14","NOM PRENOM 2461",null,"","VIDE"]
["2014-01-14","NOM PRENOM 2462","CNI N C 9999 9999 99 DU 99.99.99 AU 99.99","","VIDE"]
["2014-01-14","NOM PRENOM 2463","CNI C9999.9999.99 DU 99/99/9999","","VIDE"]
["2014-01-14","NOM PRENOM 2464",null,"","VIDE"]
["2014-01-14","NOM PRENOM 2465","TEL 99.99.99.99","99999999","Ok"]
["2014-01-14","NOM PRENOM 2466","TEL 99.99.99.99","99999999","Ok"]
["2014-01-14","NOM PRENOM 2467",null,"","VIDE"]
["2014-01-14","NOM PRENOM 2468",null,"","VIDE"]
["2014-01-14","NOM PRENOM 2469","VAL 99/99/9999 CEL 99999999","99999999","Ok"]
["2014-01-14","NOM PRENOM 2470","CNI C9999.9999.99 DU 99/99/9999","","VIDE"]
["2014-01-14","NOM PRENOM 2471",null,"","VIDE"]
["2014-01-14","NOM PRENOM 2472",null,"","VIDE"]
["2014-01-14","NOM PRENOM 2473","CNI C9999.9999.99 DU 99/99/9999","","VIDE"]
["2014-01-14","NOM PRENOM 2474","TEL 99999999","99999999","Ok"]
["2014-01-14","NOM PRENOM 2475",null,"","VIDE"]
["2014-01-14","NOM PRENOM 2476","TEL 99.99.99.99","99999999","Ok"]
["2014-01-14","NOM PRENOM 2477","TEL 99999999","99999999","Ok"]
["2014-01-14","NOM PRENOM 2478","AU 99/99/9999 CARTE MILITAIRE 999K999999999 DU 99/99/9999","","VIDE"]
["2014-01-14","NOM PRENOM 2479","CEL 99999999","99999999","Ok"]
["2014-01-14","NOM PRENOM 2480","TEL 99.99.99.99","99999999","Ok"]
["2014-01-14","NOM PRENOM 2481",null,"","VIDE"]
["2014-01-14","NOM PRENOM 2482","TEL 99.99.99.99","99999999","Ok"]
["2014-01-14","NOM PRENOM 2483","CNI C9999 9999 99 DU 99/99/99 - TEL 99999999","99999999","Ok"]
["2014-01-14","NOM PRENOM 2484","TEL 99.99.99.99","99999999","Ok"]
["2014-01-14","NOM PRENOM 2485",null,"","VIDE"]
["2014-01-14","NOM PRENOM 2486",null,"","VIDE"]
["2014-01-14","NOM PRENOM 2487","TEL:99-99-99-99","99999999","Ok"]
["2014-01-14","NOM PRENOM 2488",null,"","VIDE"]
["2014-01-14","NOM PRENOM 2489",null,"","VIDE"]
["2014-01-14","NOM PRENOM 2490","TEL 99.99.99.99","99999999","Ok"]
["2014-01-14","NOM PRENOM 2491",null,"","VIDE"]
["2014-01-14","NOM PRENOM 2492",null,"","VIDE"]
["2014-01-14","NOM PRENOM 2493","TEL 99.99.99.99","99999999","Ok"]
["2014-01-14","NOM PRENOM 2494","CEL 99999999","99999999","Ok"]
["2014-01-14","NOM PRENOM 2495",null,"","VIDE"]
["2014-01-14","NOM PRENOM 2496","TEL 99999999","99999999","Ok"]
["2014-01-14","NOM PRENOM 2497","TEL 99.99.99.99","99999999","Ok"]
["2014-01-14","NOM PRENOM 2498",null,{"$f":"gettel(C2499)","v":""},{"$f":"IF(LEN(D2499)=0,\"VIDE\",IF(LEN(D2499)=8,\"Ok\",\"?\"))","v":"VIDE"}]
["2014-01-14","NOM PRENOM 2499",null,"","VIDE"]
["2014-01-14","NOM PRENOM 2500","CNI C9999999999 DU 99/99/99","","VIDE"]
["2014-01-14","NOM PRENOM 2501","CEL 99999999","99999999","Ok"]
["2014-01-14","NOM PRENOM 2502","CEL 99999999","99999999","Ok"]
["2014-01-14","NOM PRENOM 2503","TEL 99999999","99999999","Ok"]
["2014-01-14","NOM PRENOM 2504","CNI N° C9999999999 DU 99/99/9999","","VIDE"]
["2014-01-14","NOM PRENOM 2505",null,"","VIDE"]
["2014-01-14","NOM PRENOM 2506",null,"","VIDE"]
["2014-01-14","NOM PRENOM 2507","TEL:99-99-99-99","99999999","Ok"]
["2014-01-14","NOM PRENOM 2508","CIC DU BURKINA N° 9999999 DU 99/99/9999 AU 99/99/9999","","VIDE"]
["2014-01-14","NOM PRENOM 2509","PASSPORT N° 99AD99999 DU N99/99/99","","VIDE"]
["2014-01-14","NOM PRENOM 2510","CEL 99999999","99999999","Ok"]
["2014-01-14","NOM PRENOM 2511","CELL 99999999","99999999","Ok"]
["2014-01-14","NOM PRENOM 2512","DU 99/99/9999 AU 99/99/9999","","VIDE"]
["2014-01-14","NOM PRENOM 2513","CNI N° C9999 9999 99 DU 99/99/9999 AU 99/99/9999","","VIDE"]
["2014-01-14","NOM PRENOM 2514","CELL 99999999","99999999","Ok"]
["2014-01-14","NOM PRENOM 2515","CNI C9999.9999.99 DU 99/99/9999","","VIDE"]
["2014-01-14","NOM PRENOM 2516","TEL 99.99.99.99","99999999","Ok"]
["2014-01-14","NOM PRENOM 2517","CNI N9 C 9999.9999.99 DU 99.99.9999 GUIBEROUA","","VIDE"]
["2014-01-14","NOM PRENOM 2518","TEL:99-99-99-99","99999999","Ok"]
["2014-01-14","NOM PRENOM 2519",99999999,"99999999","Ok"]
["2014-01-14","NOM PRENOM 2520",null,"","VIDE"]
["2014-01-14","NOM PRENOM 2521",null,"","VIDE"]
["2014-01-14","NOM PRENOM 2522",99999999,"99999999","Ok"]
["2014-01-14","NOM PRENOM 2523","CEL 99999999","99999999","Ok"]
["2014-01-14","NOM PRENOM 2524",null,"","VIDE"]
["2014-01-14","NOM PRENOM 2525","CNI N° C9999999999 DU 99/99/9999","","VIDE"]
["2014-01-14","NOM PRENOM 2526","TEL 99.99.99.99","99999999","Ok"]
["2014-01-14","NOM PRENOM 2527","CEL 99999999","99999999","Ok"]
["2014-01-14","NOM PRENOM 2528","CNI C9999.9999.99 DU 99.99.99","","VIDE"]
["2014-01-14","NOM PRENOM 2529","TEL 99.99.99.99","99999999","Ok"]
["2014-01-14","NOM PRENOM 2530",null,"","VIDE"]
["2014-01-14","NOM PRENOM 2531","TEL 99999999","99999999","Ok"]
["2014-01-14","NOM PRENOM 2532","EPSE BAYAI CNI C9999.9999.99 DU 99.99.99","","VIDE"]
["2014-01-14","NOM PRENOM 2533","TEL:99-99-99-99","99999999","Ok"]
["2014-01-14","NOM PRENOM 2534","TEL 99.99.99.99","99999999","Ok"]
["2014-01-14","NOM PRENOM 2535","CEL 99999999","99999999","Ok"]
["2014-01-14","NOM PRENOM 2536",99999999,"99999999","Ok"]
["2014-01-14","NOM PRENOM 2537","CNI FRANCE N°999999U99999 DU 99/99/9999 +PC N°999999999999 DU 99/99/99","","VIDE"]
["2014-01-14","NOM PRENOM 2538","DU 99/99/9999 AU 99/99/9999","","VIDE"]
["2014-01-14","NOM PRENOM 2539","AI 999-999/99-99/MI/PU-99 DU 99/99/99","","VIDE"]
["2014-01-14","NOM PRENOM 2540","TEL 99999999","99999999","Ok"]
["2014-01-14","NOM PRENOM 2541",null,"","VIDE"]
["2014-01-14","NOM PRENOM 2542","CNI N° C9999999999 DU 99/99/9999","","VIDE"]
["2014-01-14","NOM PRENOM 2543","TEL 99999999","99999999","Ok"]
["2014-01-14","NOM PRENOM 2544","TEL 99.99.99.99","99999999","Ok"]
["2014-01-14","NOM PRENOM 2545",null,"","VIDE"]
["2014-01-14","NOM PRENOM 2546","TEL 99.99.99.99","99999999","Ok"]
["2014-01-14","NOM PRENOM 2547",null,"","VIDE"]
["2014-01-14","NOM PRENOM 2548","C9999.9999.99 DU 99.99.99","","VIDE"]
["2014-01-14","NOM PRENOM 2549","CNI N° C9999999999 DU 99/99/9999","","VIDE"]
["2014-01-14","NOM PRENOM 2550","*","","VIDE"]
["2014-01-14","NOM PRENOM 2551","TEL 99999999","99999999","Ok"]
["2014-01-14","NOM PRENOM 2552","cel 99999999","99999999","Ok"]
["2014-01-14","NOM PRENOM 2553","TEL 99.99.99.99","99999999","Ok"]
["2014-01-14","NOM PRENOM 2554","DU 99/99/9999","","VIDE"]
["2014-01-14","NOM PRENOM 2555",null,"","VIDE"]
["2014-01-14","NOM PRENOM 2556","val 99/99/9999 cel 99999999","99999999","Ok"]
["2014-01-14","NOM PRENOM 2557","TEL.99.99.99.99","99999999","Ok"]
["2014-01-14","NOM PRENOM 2558","ATT 999-999/9999/PU9 DU 99/99/99 - TEL 99999999","99999999","Ok"]
["2014-01-14","NOM PRENOM 2559","TEL 99999999","99999999","Ok"]
["2014-01-14","NOM PRENOM 2560","CEL 99.99.99.99","99999999","Ok"]
["2014-01-14","NOM PRENOM 2561","CEL 99999999","99999999","Ok"]
["2014-01-14","NOM PRENOM 2562",null,{"$f":"gettel(C2563)","v":""},{"$f":"IF(LEN(D2563)=0,\"VIDE\",IF(LEN(D2563)=8,\"Ok\",\"?\"))","v":"VIDE"}]
["2014-01-14","NOM PRENOM 2563",null,"","VIDE"]
["2014-01-14","NOM PRENOM 2564","PC N°999999999999 DU 99/99/9999","","VIDE"]
["2014-01-14","NOM PRENOM 2565",null,"","VIDE"]
["2014-01-14","NOM PRENOM 2566","TEL 99999999","99999999","Ok"]
["2014-01-14","NOM PRENOM 2567",null,"","VIDE"]
["2014-01-14","NOM PRENOM 2568","TEL 99999999","99999999","Ok"]
["2014-01-14","NOM PRENOM 2569",null,"","VIDE"]
["2014-01-14","NOM PRENOM 2570",null,"","VIDE"]
["2014-01-14","NOM PRENOM 2571","CEL 99999999","99999999","Ok"]
["2014-01-14","NOM PRENOM 2572",null,"","VIDE"]
["2014-01-14","NOM PRENOM 2573","TEL 99.99.99.99","99999999","Ok"]
["2014-01-14","NOM PRENOM 2574",null,"","VIDE"]
["2014-01-14","NOM PRENOM 2575",null,"","VIDE"]
["2014-01-14","NOM PRENOM 2576",null,"","VIDE"]
["2014-01-14","NOM PRENOM 2577","CIC N° 9999999 DU 99/99/9999","","VIDE"]
["2014-01-14","NOM PRENOM 2578",null,"","VIDE"]
["2014-01-14","NOM PRENOM 2579",null,"","VIDE"]
["2014-01-14","NOM PRENOM 2580",null,"","VIDE"]
["2014-01-14","NOM PRENOM 2581","ATT N9 999/9999/99/99/99/PU.99","","VIDE"]
["2014-01-14","NOM PRENOM 2582","CNI N 9C 9999.9999.99 DU 99.99.9999","","VIDE"]
["2014-01-14","NOM PRENOM 2583",null,"","VIDE"]
["2014-01-14","NOM PRENOM 2584","CNI N 9C 9999.9999.99 DU 99.99.9999","","VIDE"]
["2014-01-14","NOM PRENOM 2585","CNI N 9C 9999.9999.99 DU 99.99.9999","","VIDE"]
["2014-01-14","NOM PRENOM 2586",null,"","VIDE"]
["2014-01-14","NOM PRENOM 2587",null,"","VIDE"]
["2014-01-14","NOM PRENOM 2588",null,"","VIDE"]
["2014-01-14","NOM PRENOM 2589",null,"","VIDE"]
["2014-01-14","NOM PRENOM 2590",null,"","VIDE"]
["2014-01-14","NOM PRENOM 2591","CEL 99999999","99999999","Ok"]
["2014-01-14","NOM PRENOM 2592",null,"","VIDE"]
["2014-01-14","NOM PRENOM 2593","cel 99999999","99999999","Ok"]
["2014-01-14","NOM PRENOM 2594","CNI MALI N° 9999999 DU 99-99-9999","","VIDE"]
["2014-01-14","NOM PRENOM 2595","TEL 99999999","99999999","Ok"]
["2014-01-14","NOM PRENOM 2596","MALI","","VIDE"]
["2014-01-14","NOM PRENOM 2597","CNI C9999.9999.99 DU 99.99.99","","VIDE"]
["2014-01-14","NOM PRENOM 2598",null,"","VIDE"]
["2014-01-14","NOM PRENOM 2599","TEL 99999999","99999999","Ok"]
["2014-01-14","NOM PRENOM 2600","CIC BENIN 9999/99 DU 99/99/99","","VIDE"]
["2014-01-14","NOM PRENOM 2601",null,"","VIDE"]
["2014-01-14","NOM PRENOM 2602","TEL 99999999","99999999","Ok"]
["2014-01-14","NOM PRENOM 2603",null,"","VIDE"]
["2014-01-14","NOM PRENOM 2604",null,"","VIDE"]
["2014-01-14","NOM PRENOM 2605",null,"","VIDE"]
["2014-01-14","NOM PRENOM 2606",null,"","VIDE"]
["2014-01-14","NOM PRENOM 2607",null,"","VIDE"]
["2014-01-14","NOM PRENOM 2608",null,"","VIDE"]
["2014-01-14","NOM PRENOM 2609","TEL 99999999","99999999","Ok"]
["2014-01-14","NOM PRENOM 2610",null,"","VIDE"]
["2014-01-14","NOM PRENOM 2611",null,"","VIDE"]
["2014-01-14","NOM PRENOM 2612",null,"","VIDE"]
["2014-01-14","NOM PRENOM 2613",null,"","VIDE"]
["2014-01-14","NOM PRENOM 2614","TEL 99999999","99999999","Ok"]
["2014-01-14","NOM PRENOM 2615","TEL 99999999","99999999","Ok"]
["2014-01-14","NOM PRENOM 2616",99999999,"99999999","Ok"]
["2014-01-14","NOM PRENOM 2617",null,"","VIDE"]
["2014-01-14","NOM PRENOM 2618","val 99/99/9999 cel 99999999","99999999","Ok"]
["2014-01-14","NOM PRENOM 2619",null,"","VIDE"]
["2014-01-14","NOM PRENOM 2620","TEL 99999999","99999999","Ok"]
["2014-01-14","NOM PRENOM 2621",null,"","VIDE"]
["2014-01-14","NOM PRENOM 2622",null,"","VIDE"]
["2014-01-14","NOM PRENOM 2623",null,"","VIDE"]
["2014-01-14","NOM PRENOM 2624",null,"","VIDE"]
["2014-01-14","NOM PRENOM 2625",null,"","VIDE"]
["2014-01-15","NOM PRENOM 2626","VAL 99/99/9999",{"$f":"gettel(C2627)","v":""},{"$f":"IF(LEN(D2627)=0,\"VIDE\",IF(LEN(D2627)=8,\"Ok\",\"?\"))","v":"VIDE"}]
["2014-01-15","NOM PRENOM 2627","TEL 99.99.99.99","99999999","Ok"]
["2014-01-15","NOM PRENOM 2628","CNI C9999999999 DU 99/99/9999 AU 99/99/9999","","VIDE"]
["2014-01-15","NOM PRENOM 2629","TEL 99999999","99999999","Ok"]
["2014-01-15","NOM PRENOM 2630","TEL 99999999","99999999","Ok"]
["2014-01-15","NOM PRENOM 2631","CNI C9999999999 DU 99/99/9999 AU 99/99/9999","","VIDE"]
["2014-01-15","NOM PRENOM 2632",null,"","VIDE"]
["2014-01-15","NOM PRENOM 2633","ATT 999-9999-99-99/PPA/BCA BCA 99.99.9999","","VIDE"]
["2014-01-15","NOM PRENOM 2634","CNI C9999999999 DU 99/99/9999 AU 99/99/9999","","VIDE"]
["2014-01-15","NOM PRENOM 2635","TEL 99999999 / 99999999",{"$f":"gettel(C2636)","v":"99999999/99999999"},"?"]
["2014-01-15","NOM PRENOM 2636",null,"","VIDE"]
["2014-01-15","NOM PRENOM 2637","PASS 99AD99999 DU 99/99/9999 + AI 999-99999/99-99/PU-99 DU 99/99/9999","","VIDE"]
["2014-01-15","NOM PRENOM 2638","TEL 99.99.99.99","99999999","Ok"]
["2014-01-15","NOM PRENOM 2639","CNI 999999999999 DU 99/99/99","","VIDE"]
["2014-01-15","NOM PRENOM 2640","CEL 99999999","99999999","Ok"]
["2014-01-15","NOM PRENOM 2641","CNI C9999999999 DU 99/99/9999 AU 99/99/9999","","VIDE"]
["2014-01-15","NOM PRENOM 2642",null,"","VIDE"]
["2014-01-15","NOM PRENOM 2643","CNI N° C9999999999 DU 99/99/9999","","VIDE"]
["2014-01-15","NOM PRENOM 2644","cni c9999999999 du 99/9/99 au 99/9/99","","VIDE"]
["2014-01-15","NOM PRENOM 2645","TEL 99999999","99999999","Ok"]
["2014-01-15","NOM PRENOM 2646","CEL 99999999","99999999","Ok"]
["2014-01-15","NOM PRENOM 2647",null,"","VIDE"]
["2014-01-15","NOM PRENOM 2648",null,"","VIDE"]
["2014-01-15","NOM PRENOM 2649","CIC MLI 9999999.CGMA.CI DU 99/99/9999 AU 99/99/9999 A ABJ","","VIDE"]
["2014-01-15","NOM PRENOM 2650",null,"","VIDE"]
["2014-01-15","NOM PRENOM 2651","CNI C 9999999999 DU 99/99/9999 AU 99/99/9999","","VIDE"]
["2014-01-15","NOM PRENOM 2652",null,"","VIDE"]
["2014-01-15","NOM PRENOM 2653","DU 99.99.99","","VIDE"]
["2014-01-15","NOM PRENOM 2654",99999999,"99999999","Ok"]
["2014-01-15","NOM PRENOM 2655","CELL 99999999","99999999","Ok"]
["2014-01-15","NOM PRENOM 2656","CNI N° C9999999999 DU 99/99/9999","","VIDE"]
["2014-01-15","NOM PRENOM 2657",null,"","VIDE"]
["2014-01-15","NOM PRENOM 2658","CNI N° C9999999999 DU 99/99/9999","","VIDE"]
["2014-01-15","NOM PRENOM 2659",null,"","VIDE"]
["2014-01-15","NOM PRENOM 2660","TEL 99999999","99999999","Ok"]
["2014-01-15","NOM PRENOM 2661",null,"","VIDE"]
["2014-01-15","NOM PRENOM 2662",null,"","VIDE"]
["2014-01-15","NOM PRENOM 2663",null,"","VIDE"]
["2014-01-15","NOM PRENOM 2664",null,"","VIDE"]
["2014-01-15","NOM PRENOM 2665",null,"","VIDE"]
["2014-01-15","NOM PRENOM 2666","val 99/99/9999  cel 99999999","99999999","Ok"]
["2014-01-15","NOM PRENOM 2667","CEL 99999999","99999999","Ok"]
["2014-01-15","NOM PRENOM 2668","CNI C 9999999999","","VIDE"]
["2014-01-15","NOM PRENOM 2669","CNI N° C9999999999 DU 99/99/9999","","VIDE"]
["2014-01-15","NOM PRENOM 2670","C9999.9999.99 DU 99.99.99","","VIDE"]
["2014-01-15","NOM PRENOM 2671",null,"","VIDE"]
["2014-01-15","NOM PRENOM 2672",null,"","VIDE"]
["2014-01-15","NOM PRENOM 2673","99.99.99.99","","VIDE"]
["2014-01-15","NOM PRENOM 2674","DU 99.99.9999 AU 99.99.9999","","VIDE"]
["2014-01-15","NOM PRENOM 2675","CNI N°C9999999999 VAL 99 99 9999","","VIDE"]
["2014-01-15","NOM PRENOM 2676",null,"","VIDE"]
["2014-01-15","NOM PRENOM 2677","CNI N° C9999 9999 99 DU 99/99/9999 AU 99/99/9999","","VIDE"]
["2014-01-15","NOM PRENOM 2678","TEL 99999999","99999999","Ok"]
["2014-01-15","NOM PRENOM 2679","+ PC N V 99999999M DU 99/99/9999 ITALIANA","","VIDE"]
["2014-01-15","NOM PRENOM 2680","TEL 99.99.99.99","99999999","Ok"]
["2014-01-15","NOM PRENOM 2681",null,"","VIDE"]
["2014-01-15","NOM PRENOM 2682","CNI C9999.9999.99 DU 99/99/9999","","VIDE"]
["2014-01-15","NOM PRENOM 2683","TEL 99.99.99.99","99999999","Ok"]
["2014-01-15","NOM PRENOM 2684",null,"","VIDE"]
["2014-01-15","NOM PRENOM 2685",null,"","VIDE"]
["2014-01-15","NOM PRENOM 2686",null,"","VIDE"]
["2014-01-15","NOM PRENOM 2687","DU 99/99/9999 AU 99/99/9999","","VIDE"]
["2014-01-15","NOM PRENOM 2688","CNI N° C9999 9999 99 DU 99/99/9999 AU 99/99/9999","","VIDE"]
["2014-01-15","NOM PRENOM 2689","DU 99/99/9999","","VIDE"]
["2014-01-15","NOM PRENOM 2690","99.99.99.99",{"$f":"gettel(C2691)","v":""},{"$f":"IF(LEN(D2691)=0,\"VIDE\",IF(LEN(D2691)=8,\"Ok\",\"?\"))","v":"VIDE"}]
["2014-01-15","NOM PRENOM 2691","CEL 99999999","99999999","Ok"]
["2014-01-15","NOM PRENOM 2692","TEL 99999999","99999999","Ok"]
["2014-01-15","NOM PRENOM 2693",null,"","VIDE"]
["2014-01-15","NOM PRENOM 2694","99.99.99.99","","VIDE"]
["2014-01-15","NOM PRENOM 2695","TEL 99999999 / 99999999",{"$f":"gettel(C2696)","v":"99999999/99999999"},"?"]
["2014-01-15","NOM PRENOM 2696","TEL 99999999","99999999","Ok"]
["2014-01-15","NOM PRENOM 2697",null,"","VIDE"]
["2014-01-15","NOM PRENOM 2698",null,"","VIDE"]
["2014-01-15","NOM PRENOM 2699","CEL 99999999","99999999","Ok"]
["2014-01-15","NOM PRENOM 2700","TEL 99.99.99.99","99999999","Ok"]
["2014-01-15","NOM PRENOM 2701",null,"","VIDE"]
["2014-01-15","NOM PRENOM 2702","CNI C 9999999999 DU 99/99/99","","VIDE"]
["2014-01-15","NOM PRENOM 2703",null,"","VIDE"]
["2014-01-15","NOM PRENOM 2704","TEL 99999999","99999999","Ok"]
["2014-01-15","NOM PRENOM 2705","CNI N° C9999999999 DU 99/99/9999","","VIDE"]
["2014-01-15","NOM PRENOM 2706",null,"","VIDE"]
["2014-01-15","NOM PRENOM 2707",null,"","VIDE"]
["2014-01-15","NOM PRENOM 2708","99.99.99.99","","VIDE"]
["2014-01-15","NOM PRENOM 2709","TEL 99999999","99999999","Ok"]
["2014-01-15","NOM PRENOM 2710","CIC NIGERIA N 99999999NG DU 99/99/9999 AUN 99/99/9999","","VIDE"]
["2014-01-15","NOM PRENOM 2711",null,"","VIDE"]
["2014-01-15","NOM PRENOM 2712",null,"","VIDE"]
["2014-01-15","NOM PRENOM 2713","TEL 99.99.99.99","99999999","Ok"]
["2014-01-15","NOM PRENOM 2714","TEL 99999999","99999999","Ok"]
["2014-01-15","NOM PRENOM 2715","CNI C9999.9999.99 DU 99/99/9999","","VIDE"]
["2014-01-15","NOM PRENOM 2716","ONI 999-99999/99-99-MI/PU-99 DU 99/99/99","","VIDE"]
["2014-01-15","NOM PRENOM 2717","CNI C9999.9999.99 DU 99/99/9999","","VIDE"]
["2014-01-15","NOM PRENOM 2718","TEL 99.99.99.99","99999999","Ok"]
["2014-01-15","NOM PRENOM 2719","99.99.99.99","","VIDE"]
["2014-01-15","NOM PRENOM 2720","CNI C9999.9999.99 DU 99/99/9999","","VIDE"]
["2014-01-15","NOM PRENOM 2721","TEL 99999999","99999999","Ok"]
["2014-01-15","NOM PRENOM 2722",null,"","VIDE"]
["2014-01-15","NOM PRENOM 2723","99.99.99.99","","VIDE"]
["2014-01-15","NOM PRENOM 2724","PASS YA9999999 DU 99/99/99","","VIDE"]
["2014-01-15","NOM PRENOM 2725","CNI C9999.9999.99 DU 99/99/9999","","VIDE"]
["2014-01-15","NOM PRENOM 2726","C9999.9999.99 DU 99.99.99","","VIDE"]
["2014-01-15","NOM PRENOM 2727",null,"","VIDE"]
["2014-01-15","NOM PRENOM 2728","CNI N9 C 9999.9999.99 DU 99.99.9999","","VIDE"]
["2014-01-15","NOM PRENOM 2729","DU 99/99/9999","","VIDE"]
["2014-01-15","NOM PRENOM 2730","CELL 99999999","99999999","Ok"]
["2014-01-15","NOM PRENOM 2731","TEL 99999999","99999999","Ok"]
["2014-01-15","NOM PRENOM 2732",null,"","VIDE"]
["2014-01-15","NOM PRENOM 2733","PASS 9/9/ACA/99/999999 VAL 99.99.9999","","VIDE"]
["2014-01-15","NOM PRENOM 2734","TEL 99999999","99999999","Ok"]
["2014-01-15","NOM PRENOM 2735","99.99.99.99","","VIDE"]
["2014-01-15","NOM PRENOM 2736","CEL 99.99.99.99","99999999","Ok"]
["2014-01-15","NOM PRENOM 2737","TEL 99999999","99999999","Ok"]
["2014-01-15","NOM PRENOM 2738","DU 99.99.99","","VIDE"]
["2014-01-15","NOM PRENOM 2739","99.99.99.99","","VIDE"]
["2014-01-15","NOM PRENOM 2740",null,"","VIDE"]
["2014-01-15","NOM PRENOM 2741","CNI N 9C 9999.9999.99 DU 99.99.9999","","VIDE"]
["2014-01-15","NOM PRENOM 2742","CNI C 9999999999 DUB 99/99/9999 A SOUBRE","","VIDE"]
["2014-01-15","NOM PRENOM 2743","TEL 99.99.99.99","99999999","Ok"]
["2014-01-15","NOM PRENOM 2744","CNI N 9C 9999.9999.99 DU 99.99.9999 HIRE","","VIDE"]
["2014-01-15","NOM PRENOM 2745","TEL 99999999","99999999","Ok"]
["2014-01-15","NOM PRENOM 2746","TEL 99.99.99.99","99999999","Ok"]
["2014-01-15","NOM PRENOM 2747","+PC N 99-99-99999999 DU 99/99/9999","","VIDE"]
["2014-01-15","NOM PRENOM 2748","TEL 99999999","99999999","Ok"]
["2014-01-15","NOM PRENOM 2749","CNI C9999999999 DU 99/99/9999 AU 99/99/9999","","VIDE"]
["2014-01-15","NOM PRENOM 2750","CEL 99999999","99999999","Ok"]
["2014-01-15","NOM PRENOM 2751","TEL 99.99.99.99","99999999","Ok"]
["2014-01-15","NOM PRENOM 2752","TEL 99999999","99999999","Ok"]
["2014-01-15","NOM PRENOM 2753","99.99.99.99","","VIDE"]
["2014-01-15","NOM PRENOM 2754","TEL 99999999",{"$f":"gettel(C2755)","v":"99999999"},{"$f":"IF(LEN(D2755)=0,\"VIDE\",IF(LEN(D2755)=8,\"Ok\",\"?\"))","v":"Ok"}]
["2014-01-15","NOM PRENOM 2755","TEL 99.9.99.99",{"$f":"gettel(C2756)","v":"9999999"},"?"]
["2014-01-15","NOM PRENOM 2756",null,"","VIDE"]
["2014-01-15","NOM PRENOM 2757",null,"","VIDE"]
["2014-01-15","NOM PRENOM 2758","CEL 99999999","99999999","Ok"]
["2014-01-15","NOM PRENOM 2759","TEL 99999999","99999999","Ok"]
["2014-01-15","NOM PRENOM 2760",null,"","VIDE"]
["2014-01-15","NOM PRENOM 2761","DU 99/99/9999 AU 99/99/9999","","VIDE"]
["2014-01-15","NOM PRENOM 2762","CNI N9 C 9999.9999.99 DU 99.99.9999","","VIDE"]
["2014-01-15","NOM PRENOM 2763","CNI C 9999999999","","VIDE"]
["2014-01-15","NOM PRENOM 2764","+ CE INPHB N° 99INP99999 DE 9999-9999","","VIDE"]
["2014-01-15","NOM PRENOM 2765","TEL 99999999","99999999","Ok"]
["2014-01-15","NOM PRENOM 2766","TEL 99.99.99.99","99999999","Ok"]
["2014-01-15","NOM PRENOM 2767","CNI C 9999999999 DU 99/99/9999 A OUME","","VIDE"]
["2014-01-15","NOM PRENOM 2768","CEL 99.99.99.99","99999999","Ok"]
["2014-01-15","NOM PRENOM 2769",99999999,"99999999","Ok"]
["2014-01-15","NOM PRENOM 2770","CNI C9999.9999.99 DU 99/99/9999","","VIDE"]
["2014-01-15","NOM PRENOM 2771",null,"","VIDE"]
["2014-01-15","NOM PRENOM 2772","TEL 99.99.99.99","99999999","Ok"]
["2014-01-15","NOM PRENOM 2773","TEL 99999999","99999999","Ok"]
["2014-01-15","NOM PRENOM 2774","CIC BENIN A.9999/99 DU 99/99/9999 + CNI BENIN","","VIDE"]
["2014-01-15","NOM PRENOM 2775","CEL 99.99.99.99","99999999","Ok"]
["2014-01-15","NOM PRENOM 2776",null,"","VIDE"]
["2014-01-15","NOM PRENOM 2777","TEL 99999999","99999999","Ok"]
["2014-01-15","NOM PRENOM 2778","DU 99.99.99","","VIDE"]
["2014-01-15","NOM PRENOM 2779",null,"","VIDE"]
["2014-01-15","NOM PRENOM 2780",null,"","VIDE"]
["2014-01-15","NOM PRENOM 2781","DU 99/99/9999 AU 99/99/9999","","VIDE"]
["2014-01-15","NOM PRENOM 2782","TEL 99999999","99999999","Ok"]
["2014-01-15","NOM PRENOM 2783","CNI C9999.9999.99 DU 99/99/9999","","VIDE"]
["2014-01-15","NOM PRENOM 2784","CNI N°C9999999999 VAL 99 99 9999","","VIDE"]
["2014-01-15","NOM PRENOM 2785","TEL 99.99.99.99","99999999","Ok"]
["2014-01-15","NOM PRENOM 2786","TEL 99999999","99999999","Ok"]
["2014-01-15","NOM PRENOM 2787","du 99/99/9999 au 99/99/9999","","VIDE"]
["2014-01-15","NOM PRENOM 2788","CNI C9999999999 DU 99/99/99","","VIDE"]
["2014-01-15","NOM PRENOM 2789","CIC MLI N 9999/CGMB/9999 DU 99/99/9999 AU 99/99/9999 A CGM BOUAKE","","VIDE"]
["2014-01-15","NOM PRENOM 2790","TEL 99999999","99999999","Ok"]
["2014-01-15","NOM PRENOM 2791","CNI C 9999999999 DU 99/99/9999 A OUME","","VIDE"]
["2014-01-15","NOM PRENOM 2792",null,"","VIDE"]
["2014-01-15","NOM PRENOM 2793","TEL 99999999","99999999","Ok"]
["2014-01-15","NOM PRENOM 2794","99.99.99.99","","VIDE"]
["2014-01-15","NOM PRENOM 2795","TEL 99999999","99999999","Ok"]
["2014-01-15","NOM PRENOM 2796","CNI C9999999999 DU 99/99/9999 A ABJ","","VIDE"]
["2014-01-15","NOM PRENOM 2797","TEL 99999999","99999999","Ok"]
["2014-01-15","NOM PRENOM 2798","CNI N 9C 9999.9999.99 DU 99.99.9999","","VIDE"]
["2014-01-15","NOM PRENOM 2799","CNI N 9C 9999.9999.99 DU 99.99.9999","","VIDE"]
["2014-01-15","NOM PRENOM 2800","CEL 99999999","99999999","Ok"]
["2014-01-15","NOM PRENOM 2801","CNI C9999999999 DU 99/99/99 AU 99/9/99","","VIDE"]
["2014-01-15","NOM PRENOM 2802","TEL 99999999","99999999","Ok"]
["2014-01-15","NOM PRENOM 2803","CNI N9 C 9999.9999.99 DU 99.99.9999","","VIDE"]
["2014-01-15","NOM PRENOM 2804","CNI N° C9999999999 DU 99/99/9999","","VIDE"]
["2014-01-15","NOM PRENOM 2805","CEL 99999999","99999999","Ok"]
["2014-01-15","NOM PRENOM 2806","CNI 999999999999","","VIDE"]
["2014-01-15","NOM PRENOM 2807","CNI C9999999999 DU 99/99/99999","","VIDE"]
["2014-01-15","NOM PRENOM 2808","CEL 99999999","99999999","Ok"]
["2014-01-15","NOM PRENOM 2809","TEL 99999999","99999999","Ok"]
["2014-01-15","NOM PRENOM 2810","CNI C 9999 9999 99 DU 99/99/99 - TEL 99999999","99999999","Ok"]
["2014-01-15","NOM PRENOM 2811","CNI N° C9999999999 DU 99/99/9999","","VIDE"]
["2014-01-15","NOM PRENOM 2812","TEL 99999999","99999999","Ok"]
["2014-01-15","NOM PRENOM 2813",null,"","VIDE"]
["2014-01-15","NOM PRENOM 2814",null,"","VIDE"]
["2014-01-15","NOM PRENOM 2815","CEL 99999999","99999999","Ok"]
["2014-01-15","NOM PRENOM 2816",null,"","VIDE"]
["2014-01-15","NOM PRENOM 2817",null,"","VIDE"]
["2014-01-15","NOM PRENOM 2818","TEL:99-99-99-99",{"$f":"gettel(C2819)","v":"99999999"},{"$f":"IF(LEN(D2819)=0,\"VIDE\",IF(LEN(D2819)=8,\"Ok\",\"?\"))","v":"Ok"}]
["2014-01-15","NOM PRENOM 2819","CNI C9999.9999.99 DU 99/99/9999","","VIDE"]
["2014-01-15","NOM PRENOM 2820",99999999,"99999999","Ok"]
["2014-01-15","NOM PRENOM 2821","TEL 99999999/ 99999999",{"$f":"gettel(C2822)","v":"99999999/99999999"},"?"]
["2014-01-15","NOM PRENOM 2822","CEL 99.99.99.99","99999999","Ok"]
["2014-01-15","NOM PRENOM 2823","TEL 99.99.99.99","99999999","Ok"]
["2014-01-15","NOM PRENOM 2824","CNI C9999999999 DU 99/99/9999 AU 99/99/9999 A SOUBRE","","VIDE"]
["2014-01-15","NOM PRENOM 2825","VAL99/99/9999 CEL99999999","99999999","Ok"]
["2014-01-15","NOM PRENOM 2826","PASS N9 99AD99999 DU 99.99.99 ET ATD","","VIDE"]
["2014-01-15","NOM PRENOM 2827","CNI C9999999999 DU 99/99/99","","VIDE"]
["2014-01-15","NOM PRENOM 2828","CNI C9999.9999.99 DU 99.99.99","","VIDE"]
["2014-01-15","NOM PRENOM 2829","CNI C9999999999 DU 99/99/9999","","VIDE"]
["2014-01-15","NOM PRENOM 2830","CEL 99999999","99999999","Ok"]
["2014-01-15","NOM PRENOM 2831","TEL 99999999","99999999","Ok"]
["2014-01-15","NOM PRENOM 2832",null,"","VIDE"]
["2014-01-15","NOM PRENOM 2833","TEL 99999999","99999999","Ok"]
["2014-01-15","NOM PRENOM 2834",null,"","VIDE"]
["2014-01-15","NOM PRENOM 2835","TEL 99.99.99.99","99999999","Ok"]
["2014-01-15","NOM PRENOM 2836","CNI N° C9999 9999 99 DU 99/99/9999 AU 99/99/9999","","VIDE"]
["2014-01-15","NOM PRENOM 2837","CEL 99999999","99999999","Ok"]
["2014-01-15","NOM PRENOM 2838","CIC SENEGAL N°9999999999999 DU 99/99/9999","","VIDE"]
["2014-01-15","NOM PRENOM 2839","MLE 9999","","VIDE"]
["2014-01-15","NOM PRENOM 2840","TEL 99.99.99.99","99999999","Ok"]
["2014-01-15","NOM PRENOM 2841",null,"","VIDE"]
["2014-01-15","NOM PRENOM 2842",99999999,"99999999","Ok"]
["2014-01-15","NOM PRENOM 2843","TEL 99999999","99999999","Ok"]
["2014-01-15","NOM PRENOM 2844","CIC BENIN 99999/99 DU 99/99/99 - TEL 99999999","99999999","Ok"]
["2014-01-15","NOM PRENOM 2845",null,"","VIDE"]
["2014-01-15","NOM PRENOM 2846",null,"","VIDE"]
["2014-01-15","NOM PRENOM 2847","TEL 99999999","99999999","Ok"]
["2014-01-15","NOM PRENOM 2848","TEL 99999999","99999999","Ok"]
["2014-01-15","NOM PRENOM 2849",null,"","VIDE"]
["2014-01-15","NOM PRENOM 2850","cel 99999999","99999999","Ok"]
["2014-01-15","NOM PRENOM 2851",null,"","VIDE"]
["2014-01-15","NOM PRENOM 2852",null,"","VIDE"]
["2014-01-15","NOM PRENOM 2853",null,"","VIDE"]
["2014-01-15","NOM PRENOM 2854","TEL 99.99.99.99","99999999","Ok"]
["2014-01-15","NOM PRENOM 2855","TEL 99.99.99.99","99999999","Ok"]
["2014-01-15","NOM PRENOM 2856",null,"","VIDE"]
["2014-01-15","NOM PRENOM 2857","val 99/99/9999","","VIDE"]
["2014-01-15","NOM PRENOM 2858",null,"","VIDE"]
["2014-01-15","NOM PRENOM 2859",null,"","VIDE"]
["2014-01-15","NOM PRENOM 2860",null,"","VIDE"]
["2014-01-15","NOM PRENOM 2861","CNI N°999999999999 DU 99.99.9999","","VIDE"]
["2014-01-15","NOM PRENOM 2862","TEL 99.99.99.99","99999999","Ok"]
["2014-01-15","NOM PRENOM 2863","TOGO","","VIDE"]
["2014-01-15","NOM PRENOM 2864",null,"","VIDE"]
["2014-01-15","NOM PRENOM 2865",null,"","VIDE"]
["2014-01-15","NOM PRENOM 2866","TEL 99999999","99999999","Ok"]
["2014-01-15","NOM PRENOM 2867",null,"","VIDE"]
["2014-01-15","NOM PRENOM 2868",null,"","VIDE"]
["2014-01-15","NOM PRENOM 2869",null,"","VIDE"]
["2014-01-15","NOM PRENOM 2870","TEL 99999999","99999999","Ok"]
["2014-01-15","NOM PRENOM 2871",null,"","VIDE"]
["2014-01-15","NOM PRENOM 2872","TEL 99999999","99999999","Ok"]
["2014-01-15","NOM PRENOM 2873",null,"","VIDE"]
["2014-01-15","NOM PRENOM 2874",null,"","VIDE"]
["2014-01-15","NOM PRENOM 2875",null,"","VIDE"]
["2014-01-16","NOM PRENOM 2876","ATT N9 999.9999.99.99.PU.99 ** CEL 99.99.99.99","99999999","Ok"]
["2014-01-16","NOM PRENOM 2877","cel 99999999","99999999","Ok"]
["2014-01-16","NOM PRENOM 2878","TEL 99.99.99.99","99999999","Ok"]
["2014-01-16","NOM PRENOM 2879","cel 99999999","99999999","Ok"]
["2014-01-16","NOM PRENOM 2880",null,"","VIDE"]
["2014-01-16","NOM PRENOM 2881","cel 99999999","99999999","Ok"]
["2014-01-16","NOM PRENOM 2882","TEL 99.99.99.99",{"$f":"gettel(C2883)","v":"99999999"},{"$f":"IF(LEN(D2883)=0,\"VIDE\",IF(LEN(D2883)=8,\"Ok\",\"?\"))","v":"Ok"}]
["2014-01-16","NOM PRENOM 2883","CELL 99999999","99999999","Ok"]
["2014-01-16","NOM PRENOM 2884","cel 99999999","99999999","Ok"]
["2014-01-16","NOM PRENOM 2885",null,"","VIDE"]
["2014-01-16","NOM PRENOM 2886",null,"","VIDE"]
["2014-01-16","NOM PRENOM 2887",null,"","VIDE"]
["2014-01-16","NOM PRENOM 2888","DU 99/99/9999 +PC 99-99-99999999 DU 99/99/9999","","VIDE"]
["2014-01-16","NOM PRENOM 2889","val 99/99/9999 laisser passer n 99999999","","VIDE"]
["2014-01-16","NOM PRENOM 2890","TEL99999999","99999999","Ok"]
["2014-01-16","NOM PRENOM 2891","CIC DU MALI N° 999999/CGMA DU 99/99/9999 AU 99/99/9999","","VIDE"]
["2014-01-16","NOM PRENOM 2892","TEL 99999999","99999999","Ok"]
["2014-01-16","NOM PRENOM 2893","CEL 99999999","99999999","Ok"]
["2014-01-16","NOM PRENOM 2894","VAL99/99/9999 CEL99999999","99999999","Ok"]
["2014-01-16","NOM PRENOM 2895","ET PERMIS DE CONDUIRE N°99-99-99999999 DELIVRE LE 99.99.9999","","VIDE"]
["2014-01-16","NOM PRENOM 2896","DU 99/99/9999","","VIDE"]
["2014-01-16","NOM PRENOM 2897",null,"","VIDE"]
["2014-01-16","NOM PRENOM 2898","TEL 99.99.99.99","99999999","Ok"]
["2014-01-16","NOM PRENOM 2899",null,"","VIDE"]
["2014-01-16","NOM PRENOM 2900",null,"","VIDE"]
["2014-01-16","NOM PRENOM 2901",null,"","VIDE"]
["2014-01-16","NOM PRENOM 2902","DU 99/99/9999","","VIDE"]
["2014-01-16","NOM PRENOM 2903",null,"","VIDE"]
["2014-01-16","NOM PRENOM 2904","AU 99/9/99 + AI 999-9999/99-99/MI/PU-ANY DU 99/9/99 AU 99/9/99","","VIDE"]
["2014-01-16","NOM PRENOM 2905","ATTEST N 999-9999/99-99/MI/PU-9 DU 99/99/99 AU 99/99/99","","VIDE"]
["2014-01-16","NOM PRENOM 2906","CNI C 9999999999","","VIDE"]
["2014-01-16","NOM PRENOM 2907","TEL 99999999","99999999","Ok"]
["2014-01-16","NOM PRENOM 2908","CNI C9999.9999.99 DU 99/99/9999","","VIDE"]
["2014-01-16","NOM PRENOM 2909","99.99.99.99","","VIDE"]
["2014-01-16","NOM PRENOM 2910","PASS N 99AA99999 DU 99/99/99 AU 99/99/99","","VIDE"]
["2014-01-16","NOM PRENOM 2911","PASS N 99AA99999 DU 99/99/9999 AU 99/99/99","","VIDE"]
["2014-01-16","NOM PRENOM 2912","PC N° 99.99.99999999 DU 99.99.99","","VIDE"]
["2014-01-16","NOM PRENOM 2913","99.99.99.99","","VIDE"]
["2014-01-16","NOM PRENOM 2914","PASS N 99AA99999 DU 99/99/9999 AU 99/99/99","","VIDE"]
["2014-01-16","NOM PRENOM 2915","TEL 99.99.99.99","99999999","Ok"]
["2014-01-16","NOM PRENOM 2916","DU 99.99.99.99","","VIDE"]
["2014-01-16","NOM PRENOM 2917","CNI C9999.9999.99 DU 99/99/9999","","VIDE"]
["2014-01-16","NOM PRENOM 2918","CNI C 9999999999 DU 99/99/99","","VIDE"]
["2014-01-16","NOM PRENOM 2919",null,"","VIDE"]
["2014-01-16","NOM PRENOM 2920","TEL 99999999","99999999","Ok"]
["2014-01-16","NOM PRENOM 2921",null,"","VIDE"]
["2014-01-16","NOM PRENOM 2922","TEL 99.99.99.99","99999999","Ok"]
["2014-01-16","NOM PRENOM 2923","CNI C 9999999999 DU 99/99/99","","VIDE"]
["2014-01-16","NOM PRENOM 2924","TEL 99999999","99999999","Ok"]
["2014-01-16","NOM PRENOM 2925","TEL 99999999","99999999","Ok"]
["2014-01-16","NOM PRENOM 2926",null,"","VIDE"]
["2014-01-16","NOM PRENOM 2927",null,"","VIDE"]
["2014-01-16","NOM PRENOM 2928","TEL 99999999","99999999","Ok"]
["2014-01-16","NOM PRENOM 2929","TEL 99.99.99.99","99999999","Ok"]
["2014-01-16","NOM PRENOM 2930","TEL 99999999","99999999","Ok"]
["2014-01-16","NOM PRENOM 2931","DU 99/99/9999","","VIDE"]
["2014-01-16","NOM PRENOM 2932",null,"","VIDE"]
["2014-01-16","NOM PRENOM 2933",null,"","VIDE"]
["2014-01-16","NOM PRENOM 2934","TEL 99999999","99999999","Ok"]
["2014-01-16","NOM PRENOM 2935","TEL 99999999","99999999","Ok"]
["2014-01-16","NOM PRENOM 2936",null,"","VIDE"]
["2014-01-16","NOM PRENOM 2937","CNI C9999.9999.99 DU 99/99/9999","","VIDE"]
["2014-01-16","NOM PRENOM 2938","TEL 99.99.99.99","99999999","Ok"]
["2014-01-16","NOM PRENOM 2939","TEL 99999999","99999999","Ok"]
["2014-01-16","NOM PRENOM 2940","CNI C9999.9999.99 DU 99/99/9999","","VIDE"]
["2014-01-16","NOM PRENOM 2941","TEL 99.99.99.99","99999999","Ok"]
["2014-01-16","NOM PRENOM 2942","TEL 99999999","99999999","Ok"]
["2014-01-16","NOM PRENOM 2943","TEL 99999999","99999999","Ok"]
["2014-01-16","NOM PRENOM 2944","val 99/99/9999","","VIDE"]
["2014-01-16","NOM PRENOM 2945","TEL 99.99.99.99","99999999","Ok"]
["2014-01-16","NOM PRENOM 2946","CNI N 9C 9999.9999.99 DU 99.99.9999",{"$f":"gettel(C2947)","v":""},{"$f":"IF(LEN(D2947)=0,\"VIDE\",IF(LEN(D2947)=8,\"Ok\",\"?\"))","v":"VIDE"}]
["2014-01-16","NOM PRENOM 2947","CNI N 9C 9999.9999.99 DU 99.99.9999","","VIDE"]
["2014-01-16","NOM PRENOM 2948","TEL 99999999","99999999","Ok"]
["2014-01-16","NOM PRENOM 2949","DU 99/99/9999","","VIDE"]
["2014-01-16","NOM PRENOM 2950",null,"","VIDE"]
["2014-01-16","NOM PRENOM 2951","CELL 99999999","99999999","Ok"]
["2014-01-16","NOM PRENOM 2952","CNI N9 C 9999.9999.99 DU 99.99.9999 LOGOUALE","","VIDE"]
["2014-01-16","NOM PRENOM 2953","AI N° 999.9999/99/99/PU99 DU 99/99/9999 AU 99/99/9999","","VIDE"]
["2014-01-16","NOM PRENOM 2954","CNI C9999999999 DU 99/99/9999 AU 99/99/9999","","VIDE"]
["2014-01-16","NOM PRENOM 2955","TEL 99.99.99.99","99999999","Ok"]
["2014-01-16","NOM PRENOM 2956",null,"","VIDE"]
["2014-01-16","NOM PRENOM 2957",null,"","VIDE"]
["2014-01-16","NOM PRENOM 2958","DU 99-99-9999 AU 99-99-9999","","VIDE"]
["2014-01-16","NOM PRENOM 2959","TEL 99.99.99.99","99999999","Ok"]
["2014-01-16","NOM PRENOM 2960",null,"","VIDE"]
["2014-01-16","NOM PRENOM 2961",null,"","VIDE"]
["2014-01-16","NOM PRENOM 2962","TEL 99.99.99.99","99999999","Ok"]
["2014-01-16","NOM PRENOM 2963",null,"","VIDE"]
["2014-01-16","NOM PRENOM 2964",null,"","VIDE"]
["2014-01-16","NOM PRENOM 2965","tel 99.99.99.99","99999999","Ok"]
["2014-01-16","NOM PRENOM 2966","CNI N9 C 9999.9999.99 DU 99.99.9999 FACOBLY","","VIDE"]
["2014-01-16","NOM PRENOM 2967","DU 99.99.9999 ET ATT N°999-9999/99-99/MI/","","VIDE"]
["2014-01-16","NOM PRENOM 2968","TEL99.99.99.99","99999999","Ok"]
["2014-01-16","NOM PRENOM 2969","CNI C9999.9999.99 DU 99/99/9999","","VIDE"]
["2014-01-16","NOM PRENOM 2970","tel 99.99.99.99","99999999","Ok"]
["2014-01-16","NOM PRENOM 2971","TEL 99.99.99.99","99999999","Ok"]
["2014-01-16","NOM PRENOM 2972","TEL 99.99.99.99","99999999","Ok"]
["2014-01-16","NOM PRENOM 2973","DU 99/99/9999","","VIDE"]
["2014-01-16","NOM PRENOM 2974",null,"","VIDE"]
["2014-01-16","NOM PRENOM 2975","CNI C 9999999999","","VIDE"]
["2014-01-16","NOM PRENOM 2976",null,"","VIDE"]
["2014-01-16","NOM PRENOM 2977","CNI N 9C 9999.9999.99 DU 99.99.9999","","VIDE"]
["2014-01-16","NOM PRENOM 2978",null,"","VIDE"]
["2014-01-16","NOM PRENOM 2979","TEL 99.99.99.99","99999999","Ok"]
["2014-01-16","NOM PRENOM 2980","TEL 99.99.99.99","99999999","Ok"]
["2014-01-16","NOM PRENOM 2981","TEL 99999999","99999999","Ok"]
["2014-01-16","NOM PRENOM 2982","CEL 99.99.99.99","99999999","Ok"]
["2014-01-16","NOM PRENOM 2983","CNI C 9999999999","","VIDE"]
["2014-01-16","NOM PRENOM 2984",null,"","VIDE"]
["2014-01-16","NOM PRENOM 2985","CNI C 9999999999 DU 99/99/99","","VIDE"]
["2014-01-16","NOM PRENOM 2986",null,"","VIDE"]
["2014-01-16","NOM PRENOM 2987","CELL 99999999","99999999","Ok"]
["2014-01-16","NOM PRENOM 2988",null,"","VIDE"]
["2014-01-16","NOM PRENOM 2989","CNI C 9999999999","","VIDE"]
["2014-01-16","NOM PRENOM 2990","TEL 99999999","99999999","Ok"]
["2014-01-16","NOM PRENOM 2991",null,"","VIDE"]
["2014-01-16","NOM PRENOM 2992","TEL 99999999","99999999","Ok"]
["2014-01-16","NOM PRENOM 2993",null,"","VIDE"]
["2014-01-16","NOM PRENOM 2994","CNI C 9999999999 DU 99-99-99","","VIDE"]
["2014-01-16","NOM PRENOM 2995","CIC NIGERIA 9999999999999 DU 99/99/99 - TEL 99999999","99999999","Ok"]
["2014-01-16","NOM PRENOM 2996",null,"","VIDE"]
["2014-01-16","NOM PRENOM 2997",null,"","VIDE"]
["2014-01-16","NOM PRENOM 2998","CNI N 9C 9999.9999.99 DU 99.99.9999","","VIDE"]
["2014-01-16","NOM PRENOM 2999","CNI N° C9999 9999 99 DU 99/99/9999 AU 99/99/9999","","VIDE"]
["2014-01-16","NOM PRENOM 3000",null,"","VIDE"]
["2014-01-16","NOM PRENOM 3001","TEL 99.99.99.99","99999999","Ok"]
["2014-01-16","NOM PRENOM 3002","TEL.99.99.99.99","99999999","Ok"]
["2014-01-16","NOM PRENOM 3003","DU 99/99/9999","","VIDE"]
["2014-01-16","NOM PRENOM 3004",null,"","VIDE"]
["2014-01-16","NOM PRENOM 3005",null,"","VIDE"]
["2014-01-16","NOM PRENOM 3006","TEL 99.99.99.99","99999999","Ok"]
["2014-01-16","NOM PRENOM 3007","CEL 99999999","99999999","Ok"]
["2014-01-16","NOM PRENOM 3008","TEL.99.99.99.99","99999999","Ok"]
["2014-01-16","NOM PRENOM 3009","CNI C9999.9999.99 DU 99/99/9999","","VIDE"]
["2014-01-16","NOM PRENOM 3010","TEL 99999999",{"$f":"gettel(C3011)","v":"99999999"},{"$f":"IF(LEN(D3011)=0,\"VIDE\",IF(LEN(D3011)=8,\"Ok\",\"?\"))","v":"Ok"}]
["2014-01-16","NOM PRENOM 3011","CNI 999999999999 DU 99/99/9999 AU 99/99/9999","","VIDE"]
["2014-01-16","NOM PRENOM 3012","CEL 99999999","99999999","Ok"]
["2014-01-16","NOM PRENOM 3013","TEL 99999999","99999999","Ok"]
["2014-01-16","NOM PRENOM 3014",null,"","VIDE"]
["2014-01-16","NOM PRENOM 3015","tel 99999999","99999999","Ok"]
["2014-01-16","NOM PRENOM 3016","TEL 99999999","99999999","Ok"]
["2014-01-16","NOM PRENOM 3017",null,"","VIDE"]
["2014-01-16","NOM PRENOM 3018","TEL.99.99.99.99","99999999","Ok"]
["2014-01-16","NOM PRENOM 3019","TEL99.99.99.99","99999999","Ok"]
["2014-01-16","NOM PRENOM 3020","VAL99/99/9999 CEL99999999","99999999","Ok"]
["2014-01-16","NOM PRENOM 3021",".TEL 99999999","99999999","Ok"]
["2014-01-16","NOM PRENOM 3022","CNI N° C9999999999 DU 99/99/9999","","VIDE"]
["2014-01-16","NOM PRENOM 3023","CNI C9999999999 DU 99/99/9999 AU 99/99/9999","","VIDE"]
["2014-01-16","NOM PRENOM 3024",null,"","VIDE"]
["2014-01-16","NOM PRENOM 3025","DU 99/99/9999","","VIDE"]
["2014-01-16","NOM PRENOM 3026","TEL 99.99.99.99","99999999","Ok"]
["2014-01-16","NOM PRENOM 3027",null,"","VIDE"]
["2014-01-16","NOM PRENOM 3028","CNI N 9C 9999.9999.99 DU 99.99.9999 GRAND BASSAM","","VIDE"]
["2014-01-16","NOM PRENOM 3029","cel 99999999","99999999","Ok"]
["2014-01-16","NOM PRENOM 3030","CEL 99999999","99999999","Ok"]
["2014-01-16","NOM PRENOM 3031",null,"","VIDE"]
["2014-01-16","NOM PRENOM 3032",null,"","VIDE"]
["2014-01-16","NOM PRENOM 3033",null,"","VIDE"]
["2014-01-16","NOM PRENOM 3034","cel 99999999","99999999","Ok"]
["2014-01-16","NOM PRENOM 3035",null,"","VIDE"]
["2014-01-16","NOM PRENOM 3036",null,"","VIDE"]
["2014-01-16","NOM PRENOM 3037","CNI C9999.9999.99 DU 99/99/9999","","VIDE"]
["2014-01-16","NOM PRENOM 3038","CNI C9999999999 DU 99/99/9999 AU 99/99/9999","","VIDE"]
["2014-01-16","NOM PRENOM 3039","TEL 99.99.99.99","99999999","Ok"]
["2014-01-16","NOM PRENOM 3040","CNI C9999.9999.99 DU 99/99/9999","","VIDE"]
["2014-01-16","NOM PRENOM 3041","cel 99999999","99999999","Ok"]
["2014-01-16","NOM PRENOM 3042",null,"","VIDE"]
["2014-01-16","NOM PRENOM 3043",null,"","VIDE"]
["2014-01-16","NOM PRENOM 3044","TEL 99.99.99.99","99999999","Ok"]
["2014-01-16","NOM PRENOM 3045","CNI C9999999999 DU 99/99/9999 AU 99/99/9999","","VIDE"]
["2014-01-16","NOM PRENOM 3046","val 99/99/9999","","VIDE"]
["2014-01-16","NOM PRENOM 3047",null,"","VIDE"]
["2014-01-16","NOM PRENOM 3048","CNI C9999999999 DU 99/99/9999 AU 99/99/9999","","VIDE"]
["2014-01-16","NOM PRENOM 3049","TEL 99.99.99.99","99999999","Ok"]
["2014-01-16","NOM PRENOM 3050","CNI N° C9999999999 DU 99/99/9999","","VIDE"]
["2014-01-16","NOM PRENOM 3051","TEL 99999999","99999999","Ok"]
["2014-01-16","NOM PRENOM 3052",null,"","VIDE"]
["2014-01-16","NOM PRENOM 3053","DU 99.99.99","","VIDE"]
["2014-01-16","NOM PRENOM 3054","cel 99999999","99999999","Ok"]
["2014-01-16","NOM PRENOM 3055","ATD N°999.999.99.99.MI.PU.9 DU 99.99.99","","VIDE"]
["2014-01-16","NOM PRENOM 3056","DU 99-99-9999 AU 99-99-9999","","VIDE"]
["2014-01-16","NOM PRENOM 3057","CNI N9 C 9999.9999.99 DU 99.99.9999","","VIDE"]
["2014-01-16","NOM PRENOM 3058","TEL 99.99.99.99","99999999","Ok"]
["2014-01-16","NOM PRENOM 3059","cel 99999999","99999999","Ok"]
["2014-01-16","NOM PRENOM 3060",null,"","VIDE"]
["2014-01-16","NOM PRENOM 3061",null,"","VIDE"]
["2014-01-16","NOM PRENOM 3062","CNI C9999999999 DU 99/99/9999 AU 99/99/9999","","VIDE"]
["2014-01-16","NOM PRENOM 3063",null,"","VIDE"]
["2014-01-16","NOM PRENOM 3064",null,"","VIDE"]
["2014-01-16","NOM PRENOM 3065",null,"","VIDE"]
["2014-01-16","NOM PRENOM 3066","CEL 99.99.99.99","99999999","Ok"]
["2014-01-16","NOM PRENOM 3067",null,"","VIDE"]
["2014-01-16","NOM PRENOM 3068",null,"","VIDE"]
["2014-01-16","NOM PRENOM 3069","CNI C 9999999999 DU 99-99-99","","VIDE"]
["2014-01-16","NOM PRENOM 3070",null,"","VIDE"]
["2014-01-16","NOM PRENOM 3071",null,"","VIDE"]
["2014-01-16","NOM PRENOM 3072","CNI N 9C 9999.9999.99 DU 99.99.9999","","VIDE"]
["2014-01-16","NOM PRENOM 3073","TEL 99.99.99.99","99999999","Ok"]
["2014-01-16","NOM PRENOM 3074","CNI C9999999999 DU 99/99/99",{"$f":"gettel(C3075)","v":""},{"$f":"IF(LEN(D3075)=0,\"VIDE\",IF(LEN(D3075)=8,\"Ok\",\"?\"))","v":"VIDE"}]
["2014-01-16","NOM PRENOM 3075","TEL 99.99.99.99","99999999","Ok"]
["2014-01-16","NOM PRENOM 3076","CEL 99999999","99999999","Ok"]
["2014-01-16","NOM PRENOM 3077",null,"","VIDE"]
["2014-01-16","NOM PRENOM 3078","CNI N9 C 9999.9999.99 DU 99.99.9999","","VIDE"]
["2014-01-16","NOM PRENOM 3079",null,"","VIDE"]
["2014-01-16","NOM PRENOM 3080","CNI C9999999999 DU 99/99/9999 AU 99/99/9999","","VIDE"]
["2014-01-16","NOM PRENOM 3081","TEL 99.99.99.99","99999999","Ok"]
["2014-01-16","NOM PRENOM 3082","TEL 99999999","99999999","Ok"]
["2014-01-16","NOM PRENOM 3083","TEL 99999999","99999999","Ok"]
["2014-01-16","NOM PRENOM 3084","CNI N9C 9999.9999.99 DU 99.99.9999","","VIDE"]
["2014-01-16","NOM PRENOM 3085","TEL 99.99.99.99","99999999","Ok"]
["2014-01-16","NOM PRENOM 3086",null,"","VIDE"]
["2014-01-16","NOM PRENOM 3087","TEL 99.99.99.99","99999999","Ok"]
["2014-01-16","NOM PRENOM 3088","CNIN9 C 9999.9999.99 DU 99.99.9999 ZEO","","VIDE"]
["2014-01-16","NOM PRENOM 3089","CEL 99-99-99-99","99999999","Ok"]
["2014-01-16","NOM PRENOM 3090","TEL 99.99.99.99","99999999","Ok"]
["2014-01-16","NOM PRENOM 3091","CNI C9999999999 DU 99/99/9999 AU 99/99/9999","","VIDE"]
["2014-01-16","NOM PRENOM 3092","TEL 99.99.99.99","99999999","Ok"]
["2014-01-16","NOM PRENOM 3093",null,"","VIDE"]
["2014-01-16","NOM PRENOM 3094","DU 99/99/9999 AU 99/99/9999","","VIDE"]
["2014-01-16","NOM PRENOM 3095","CEL 99999999","99999999","Ok"]
["2014-01-16","NOM PRENOM 3096","DU 99/99/9999 AU 99/99/9999","","VIDE"]
["2014-01-16","NOM PRENOM 3097","CEL 99.99.99.99","99999999","Ok"]
["2014-01-16","NOM PRENOM 3098","CNI C9999.9999.99 DU 999/99/9999","","VIDE"]
["2014-01-16","NOM PRENOM 3099","TPS 9999999/99-9999/MI/ONI/DIE/99 DU 99/99/99","","VIDE"]
["2014-01-16","NOM PRENOM 3100","VAL 99/99/9999 PASSPORT N 99AD99999 VAL 99/99/9999","","VIDE"]
["2014-01-16","NOM PRENOM 3101","cel 99999999","99999999","Ok"]
["2014-01-16","NOM PRENOM 3102","CEL 99.99.99.99","99999999","Ok"]
["2014-01-16","NOM PRENOM 3103",null,"","VIDE"]
["2014-01-16","NOM PRENOM 3104","DU 99/99/9999 AU 99/99/9999","","VIDE"]
["2014-01-16","NOM PRENOM 3105","CEL 99999999","99999999","Ok"]
["2014-01-16","NOM PRENOM 3106","PC N° 99-99-99999999","","VIDE"]
["2014-01-16","NOM PRENOM 3107","TEL 99.99.99.99","99999999","Ok"]
["2014-01-16","NOM PRENOM 3108","CNI C9999.9999.99 DU 99.99.99","","VIDE"]
["2014-01-16","NOM PRENOM 3109",null,"","VIDE"]
["2014-01-16","NOM PRENOM 3110",null,"","VIDE"]
["2014-01-16","NOM PRENOM 3111","KONATE SOULEYMANE","","VIDE"]
["2014-01-16","NOM PRENOM 3112",null,"","VIDE"]
["2014-01-16","NOM PRENOM 3113","CEL 99-99-99-99","99999999","Ok"]
["2014-01-16","NOM PRENOM 3114",null,"","VIDE"]
["2014-01-16","NOM PRENOM 3115",null,"","VIDE"]
["2014-01-16","NOM PRENOM 3116","CEL 99.99.99.99","99999999","Ok"]
["2014-01-16","NOM PRENOM 3117","cel 99999999","99999999","Ok"]
["2014-01-16","NOM PRENOM 3118","cel 99999999","99999999","Ok"]
["2014-01-16","NOM PRENOM 3119","CIC N° 999999/CGMA/CI VAL 99/99/9999","","VIDE"]
["2014-01-16","NOM PRENOM 3120",null,"","VIDE"]
["2014-01-16","NOM PRENOM 3121",null,"","VIDE"]
["2014-01-16","NOM PRENOM 3122",null,"","VIDE"]
["2014-01-16","NOM PRENOM 3123",null,"","VIDE"]
["2014-01-16","NOM PRENOM 3124",null,"","VIDE"]
["2014-01-16","NOM PRENOM 3125","cel 99999999","99999999","Ok"]
["2014-01-16","NOM PRENOM 3126",null,"","VIDE"]
["2014-01-16","NOM PRENOM 3127","CEL 99999999","99999999","Ok"]
["2014-01-16","NOM PRENOM 3128",null,"","VIDE"]
["2014-01-16","NOM PRENOM 3129",null,"","VIDE"]
["2014-01-16","NOM PRENOM 3130","TRAORE ABDOUL KARIM","","VIDE"]
["2014-01-16","NOM PRENOM 3131","CEL 99999999","99999999","Ok"]
["2014-01-16","NOM PRENOM 3132","TEL 99999999","99999999","Ok"]
["2014-01-16","NOM PRENOM 3133",null,"","VIDE"]
["2014-01-16","NOM PRENOM 3134","TEL 99.99.99.99","99999999","Ok"]
["2014-01-16","NOM PRENOM 3135","TEL 99999999","99999999","Ok"]
["2014-01-16","NOM PRENOM 3136","TEL 99.99.99.99","99999999","Ok"]
["2014-01-16","NOM PRENOM 3137",null,"","VIDE"]
["2014-01-16","NOM PRENOM 3138","VAL 99/99/9999",{"$f":"gettel(C3139)","v":""},{"$f":"IF(LEN(D3139)=0,\"VIDE\",IF(LEN(D3139)=8,\"Ok\",\"?\"))","v":"VIDE"}]
["2014-01-16","NOM PRENOM 3139","TEL 99.99.99.99","99999999","Ok"]
["2014-01-16","NOM PRENOM 3140","CNI C 9999999999 DU 99/99/99","","VIDE"]
["2014-01-16","NOM PRENOM 3141","TEL 99.99.99.99","99999999","Ok"]
["2014-01-16","NOM PRENOM 3142","CEL 99999999","99999999","Ok"]
["2014-01-16","NOM PRENOM 3143","TEL 99.99.99.99","99999999","Ok"]
["2014-01-16","NOM PRENOM 3144","TEL 99.99.99.99","99999999","Ok"]
["2014-01-16","NOM PRENOM 3145",null,"","VIDE"]
["2014-01-16","NOM PRENOM 3146","TEL 99.99.99.99","99999999","Ok"]
["2014-01-16","NOM PRENOM 3147",null,"","VIDE"]
["2014-01-16","NOM PRENOM 3148",99999999,"99999999","Ok"]
["2014-01-16","NOM PRENOM 3149",null,"","VIDE"]
["2014-01-16","NOM PRENOM 3150",null,"","VIDE"]
["2014-01-16","NOM PRENOM 3151","NIKIEMA JUSTIN","","VIDE"]
["2014-01-16","NOM PRENOM 3152","SOULEYMANE DIABAGATE","","VIDE"]
["2014-01-16","NOM PRENOM 3153",null,"","VIDE"]
["2014-01-16","NOM PRENOM 3154","TEL 99999999","99999999","Ok"]
["2014-01-16","NOM PRENOM 3155",null,"","VIDE"]
["2014-01-17","NOM PRENOM 3156","CIC CMR N°999/9999 DU 99/99/9999 + TPS N°99999999/99-99 DU 99/99/99","","VIDE"]
["2014-01-17","NOM PRENOM 3157","tel 99.99.99.99","99999999","Ok"]
["2014-01-17","NOM PRENOM 3158","TEL 99999999","99999999","Ok"]
["2014-01-17","NOM PRENOM 3159","CNI C9999999999 DU 99/99/9999","","VIDE"]
["2014-01-17","NOM PRENOM 3160","DU 99/99/9999","","VIDE"]
["2014-01-17","NOM PRENOM 3161","TEL:99-99-99-99","99999999","Ok"]
["2014-01-17","NOM PRENOM 3162","CNI C9999999999 DU 99/99/9999 AU 99/99/9999","","VIDE"]
["2014-01-17","NOM PRENOM 3163","TEL:99-99-99-99","99999999","Ok"]
["2014-01-17","NOM PRENOM 3164","TEL 99.99.99.99","99999999","Ok"]
["2014-01-17","NOM PRENOM 3165","TEL 99999999","99999999","Ok"]
["2014-01-17","NOM PRENOM 3166",99999999,"99999999","Ok"]
["2014-01-17","NOM PRENOM 3167","TEL:99-99-99-99","99999999","Ok"]
["2014-01-17","NOM PRENOM 3168","DU 99/99/9999 AU 99/99/9999","","VIDE"]
["2014-01-17","NOM PRENOM 3169",null,"","VIDE"]
["2014-01-17","NOM PRENOM 3170","CNI C 9999999999 DU 99/99/99","","VIDE"]
["2014-01-17","NOM PRENOM 3171","TEL 99999999","99999999","Ok"]
["2014-01-17","NOM PRENOM 3172",null,"","VIDE"]
["2014-01-17","NOM PRENOM 3173","TEL 99.99.99.99","99999999","Ok"]
["2014-01-17","NOM PRENOM 3174","TEL 99999999","99999999","Ok"]
["2014-01-17","NOM PRENOM 3175","CEL 99999999","99999999","Ok"]
["2014-01-17","NOM PRENOM 3176","TEL 99.99.99.99","99999999","Ok"]
["2014-01-17","NOM PRENOM 3177","CNI  C 9999999999 DU 99/99/9999 AU 99/99/9999","","VIDE"]
["2014-01-17","NOM PRENOM 3178","PASSPT N° 99 AC99999 AU 99 99 99","","VIDE"]
["2014-01-17","NOM PRENOM 3179","CEL 99.99.99.99","99999999","Ok"]
["2014-01-17","NOM PRENOM 3180","tel 99.99.99.99","99999999","Ok"]
["2014-01-17","NOM PRENOM 3181","DU 99.99.99","","VIDE"]
["2014-01-17","NOM PRENOM 3182","TEL 99.99.99.99","99999999","Ok"]
["2014-01-17","NOM PRENOM 3183",null,"","VIDE"]
["2014-01-17","NOM PRENOM 3184","CNI C 9999999999 DU 99/9/99 AU 99/9/99","","VIDE"]
["2014-01-17","NOM PRENOM 3185",99999999,"99999999","Ok"]
["2014-01-17","NOM PRENOM 3186",null,"","VIDE"]
["2014-01-17","NOM PRENOM 3187","CNI C 9999999999 DU 99/99/9999 AU 99/99/9999","","VIDE"]
["2014-01-17","NOM PRENOM 3188",null,"","VIDE"]
["2014-01-17","NOM PRENOM 3189","TEL 99.99.99.99","99999999","Ok"]
["2014-01-17","NOM PRENOM 3190","CNI C 9999999999 DU 99/99/99 AU 99/99/99","","VIDE"]
["2014-01-17","NOM PRENOM 3191",null,"","VIDE"]
["2014-01-17","NOM PRENOM 3192",null,"","VIDE"]
["2014-01-17","NOM PRENOM 3193","CNI C 9999999999","","VIDE"]
["2014-01-17","NOM PRENOM 3194","CNI C 9999999999 DU 99/99/99","","VIDE"]
["2014-01-17","NOM PRENOM 3195","TEL 99999999","99999999","Ok"]
["2014-01-17","NOM PRENOM 3196","TEL 99999999","99999999","Ok"]
["2014-01-17","NOM PRENOM 3197","TEL 99999999","99999999","Ok"]
["2014-01-17","NOM PRENOM 3198","TEL 99.99.99.99","99999999","Ok"]
["2014-01-17","NOM PRENOM 3199","VAL99/99/9999 FRANCE CEL99999999","99999999","Ok"]
["2014-01-17","NOM PRENOM 3200","CNI C9999.9999.99 DU 99/99/9999","","VIDE"]
["2014-01-17","NOM PRENOM 3201","CNI C 9999999999 DU 99/99/9999 AU 99/99/9999","","VIDE"]
["2014-01-17","NOM PRENOM 3202","CNI C9999.9999.99 DU 99.99.99",{"$f":"gettel(C3203)","v":""},{"$f":"IF(LEN(D3203)=0,\"VIDE\",IF(LEN(D3203)=8,\"Ok\",\"?\"))","v":"VIDE"}]
["2014-01-17","NOM PRENOM 3203","CNI C 9999999999 DU 99/9/99 AU 99/9/99","","VIDE"]
["2014-01-17","NOM PRENOM 3204","TEL 99.99.99.99","99999999","Ok"]
["2014-01-17","NOM PRENOM 3205","TEL 99999999","99999999","Ok"]
["2014-01-17","NOM PRENOM 3206",null,"","VIDE"]
["2014-01-17","NOM PRENOM 3207","TEL 99.99.99.99","99999999","Ok"]
["2014-01-17","NOM PRENOM 3208","CNI C 9999999999 DU 99/9/99 AU 99/9/99","","VIDE"]
["2014-01-17","NOM PRENOM 3209",null,"","VIDE"]
["2014-01-17","NOM PRENOM 3210","DU 99/99/9999","","VIDE"]
["2014-01-17","NOM PRENOM 3211",null,"","VIDE"]
["2014-01-17","NOM PRENOM 3212",null,"","VIDE"]
["2014-01-17","NOM PRENOM 3213","TEL 99999999//99999999",{"$f":"gettel(C3214)","v":"99999999/99999999"},"?"]
["2014-01-17","NOM PRENOM 3214","TEL:99-99-99-99","99999999","Ok"]
["2014-01-17","NOM PRENOM 3215","CNI C 9999999999 DU 99/9/99 AU 99/9/99","","VIDE"]
["2014-01-17","NOM PRENOM 3216",99999999,"99999999","Ok"]
["2014-01-17","NOM PRENOM 3217","CEL 99999999","99999999","Ok"]
["2014-01-17","NOM PRENOM 3218",null,"","VIDE"]
["2014-01-17","NOM PRENOM 3219","CEL 99999999","99999999","Ok"]
["2014-01-17","NOM PRENOM 3220","TEL 99999999","99999999","Ok"]
["2014-01-17","NOM PRENOM 3221",99999999,"99999999","Ok"]
["2014-01-17","NOM PRENOM 3222",null,"","VIDE"]
["2014-01-17","NOM PRENOM 3223","CNI C9999999999 DU 99/99/9999","","VIDE"]
["2014-01-17","NOM PRENOM 3224","TEL 99999999","99999999","Ok"]
["2014-01-17","NOM PRENOM 3225","TEL 99999999","99999999","Ok"]
["2014-01-17","NOM PRENOM 3226",null,"","VIDE"]
["2014-01-17","NOM PRENOM 3227",99999999,"99999999","Ok"]
["2014-01-17","NOM PRENOM 3228","CNI C 9999.9999.99 DU 99/99/9999","","VIDE"]
["2014-01-17","NOM PRENOM 3229","TEL99.99.99.99","99999999","Ok"]
["2014-01-17","NOM PRENOM 3230","TEL 99.99.99.99","99999999","Ok"]
["2014-01-17","NOM PRENOM 3231","CEL 99999999","99999999","Ok"]
["2014-01-17","NOM PRENOM 3232","CNI C 9999999999 DU 99/99/9999","","VIDE"]
["2014-01-17","NOM PRENOM 3233","CNI C 9999999999 DU 99/9/99 AU 99/9/99","","VIDE"]
["2014-01-17","NOM PRENOM 3234",null,"","VIDE"]
["2014-01-17","NOM PRENOM 3235","CEL 99.99.99.99","99999999","Ok"]
["2014-01-17","NOM PRENOM 3236","ANKE DOHON MARILA GUILLEN","","VIDE"]
["2014-01-17","NOM PRENOM 3237","TEL 99.99.99.99","99999999","Ok"]
["2014-01-17","NOM PRENOM 3238","CNIC 9999999999 DU 99/99/9999","","VIDE"]
["2014-01-17","NOM PRENOM 3239",null,"","VIDE"]
["2014-01-17","NOM PRENOM 3240",null,"","VIDE"]
["2014-01-17","NOM PRENOM 3241","tel  99999999","99999999","Ok"]
["2014-01-17","NOM PRENOM 3242","99/99/9999 AU 99/99/9999 +PC N°99-99-99999999 DU 99/99/9999","","VIDE"]
["2014-01-17","NOM PRENOM 3243",null,"","VIDE"]
["2014-01-17","NOM PRENOM 3244","TEL 99.99.99.99","99999999","Ok"]
["2014-01-17","NOM PRENOM 3245","TEL 99.99.99.99","99999999","Ok"]
["2014-01-17","NOM PRENOM 3246","TEL 99.99.99.99","99999999","Ok"]
["2014-01-17","NOM PRENOM 3247","TEL 99.99.99.99","99999999","Ok"]
["2014-01-17","NOM PRENOM 3248","TEL 99.99.99.99","99999999","Ok"]
["2014-01-17","NOM PRENOM 3249","TEL 99.99.99.99","99999999","Ok"]
["2014-01-17","NOM PRENOM 3250","TEL 99999999","99999999","Ok"]
["2014-01-17","NOM PRENOM 3251","CNI C9999999999 DU 99.99.9999","","VIDE"]
["2014-01-17","NOM PRENOM 3252","DU 99.99.99","","VIDE"]
["2014-01-17","NOM PRENOM 3253","DU 99/99/9999","","VIDE"]
["2014-01-17","NOM PRENOM 3254","cel 99999999","99999999","Ok"]
["2014-01-17","NOM PRENOM 3255",null,"","VIDE"]
["2014-01-17","NOM PRENOM 3256","CEL 99.99.99.99","99999999","Ok"]
["2014-01-17","NOM PRENOM 3257","CNI C9999999999 DU 99/99/9999 AU 99/99/9999","","VIDE"]
["2014-01-17","NOM PRENOM 3258",null,"","VIDE"]
["2014-01-17","NOM PRENOM 3259",null,"","VIDE"]
["2014-01-17","NOM PRENOM 3260","CNI C 9999999999","","VIDE"]
["2014-01-17","NOM PRENOM 3261","CEL 99999999","99999999","Ok"]
["2014-01-17","NOM PRENOM 3262","CELL 99999999","99999999","Ok"]
["2014-01-17","NOM PRENOM 3263","VALABLE AU 99.99.9999 ET PERMIS DE CONDUIRE N°99-99-99999999 DELIVRE","","VIDE"]
["2014-01-17","NOM PRENOM 3264","TEL 99999999","99999999","Ok"]
["2014-01-17","NOM PRENOM 3265","TEL 99999999","99999999","Ok"]
["2014-01-17","NOM PRENOM 3266","CEL 99.99.99.99",{"$f":"gettel(C3267)","v":"99999999"},{"$f":"IF(LEN(D3267)=0,\"VIDE\",IF(LEN(D3267)=8,\"Ok\",\"?\"))","v":"Ok"}]
["2014-01-17","NOM PRENOM 3267","TEL 99.99.99.99","99999999","Ok"]
["2014-01-17","NOM PRENOM 3268","TEL 99.99.99.99","99999999","Ok"]
["2014-01-17","NOM PRENOM 3269","TEL 99999999","99999999","Ok"]
["2014-01-17","NOM PRENOM 3270",null,"","VIDE"]
["2014-01-17","NOM PRENOM 3271",null,"","VIDE"]
["2014-01-17","NOM PRENOM 3272","TEL 99999999","99999999","Ok"]
["2014-01-17","NOM PRENOM 3273","CNI C 9999999999 DU 99/9/99 AU 99/9/99","","VIDE"]
["2014-01-17","NOM PRENOM 3274",null,"","VIDE"]
["2014-01-17","NOM PRENOM 3275",null,"","VIDE"]
["2014-01-17","NOM PRENOM 3276","DU 99/99/9999 AU 99/99/9999","","VIDE"]
["2014-01-17","NOM PRENOM 3277","CNI C9999.9999.99 DU 99/99/9999","","VIDE"]
["2014-01-17","NOM PRENOM 3278","CNI C9999999999 DU 99/99/9999","","VIDE"]
["2014-01-17","NOM PRENOM 3279",null,"","VIDE"]
["2014-01-17","NOM PRENOM 3280","CNI C 9999999999 DU 99/99/99","","VIDE"]
["2014-01-17","NOM PRENOM 3281","TEL 99999999","99999999","Ok"]
["2014-01-17","NOM PRENOM 3282",null,"","VIDE"]
["2014-01-17","NOM PRENOM 3283",null,"","VIDE"]
["2014-01-17","NOM PRENOM 3284","VAL99/99/9999 CEL99999999","99999999","Ok"]
["2014-01-17","NOM PRENOM 3285","CNI C 9999999999 DU 99/99/99","","VIDE"]
["2014-01-17","NOM PRENOM 3286","TEL 99.99.99.99","99999999","Ok"]
["2014-01-17","NOM PRENOM 3287","CEL 99.99.99.99","99999999","Ok"]
["2014-01-17","NOM PRENOM 3288",null,"","VIDE"]
["2014-01-17","NOM PRENOM 3289","TEL 99999999","99999999","Ok"]
["2014-01-17","NOM PRENOM 3290",null,"","VIDE"]
["2014-01-17","NOM PRENOM 3291",null,"","VIDE"]
["2014-01-17","NOM PRENOM 3292","CNI N°C 9999 9999 99 VAL99/99/9999 CEL99999999","99999999","Ok"]
["2014-01-17","NOM PRENOM 3293","CNI C 9999999999 DU 99/99/9999","","VIDE"]
["2014-01-17","NOM PRENOM 3294","CNI N 999999999999 DU 99/9/99 AU 99/99/99","","VIDE"]
["2014-01-17","NOM PRENOM 3295","CNI C9999.9999.99 DU 99/99/9999","","VIDE"]
["2014-01-17","NOM PRENOM 3296",null,"","VIDE"]
["2014-01-17","NOM PRENOM 3297",null,"","VIDE"]
["2014-01-17","NOM PRENOM 3298",null,"","VIDE"]
["2014-01-17","NOM PRENOM 3299",99999999,"99999999","Ok"]
["2014-01-17","NOM PRENOM 3300","CEL 99.99.99.99","99999999","Ok"]
["2014-01-17","NOM PRENOM 3301",99999999,"99999999","Ok"]
["2014-01-17","NOM PRENOM 3302","TEL 99999999","99999999","Ok"]
["2014-01-17","NOM PRENOM 3303","CNI SENEGAL 9999999999999 DU 99-99-9999","","VIDE"]
["2014-01-17","NOM PRENOM 3304","CNI C 9999999999 DU 99/9/99 AU 99/9/99","","VIDE"]
["2014-01-17","NOM PRENOM 3305","DU 99.99.99","","VIDE"]
["2014-01-17","NOM PRENOM 3306","CNI N° C9999999999 DU 99/99/9999","","VIDE"]
["2014-01-17","NOM PRENOM 3307","DU 99/99/9999 AU 99/99/9999","","VIDE"]
["2014-01-17","NOM PRENOM 3308","CEL 99999999","99999999","Ok"]
["2014-01-17","NOM PRENOM 3309","CNI C 9999999999","","VIDE"]
["2014-01-17","NOM PRENOM 3310","DU 99/99/9999","","VIDE"]
["2014-01-17","NOM PRENOM 3311","CNI C 9999 9999 99 9999 9999 99 DU 99/99/99 - TEL 99999999","99999999","Ok"]
["2014-01-17","NOM PRENOM 3312","TEL 99.99.99.99","99999999","Ok"]
["2014-01-17","NOM PRENOM 3313","DU 99.99.9999","","VIDE"]
["2014-01-17","NOM PRENOM 3314","TEL 99.99.99.99","99999999","Ok"]
["2014-01-17","NOM PRENOM 3315","CEL 99999999","99999999","Ok"]
["2014-01-17","NOM PRENOM 3316","DU 99.99.9999","","VIDE"]
["2014-01-17","NOM PRENOM 3317",null,"","VIDE"]
["2014-01-17","NOM PRENOM 3318","TEL 99.99.99.99","99999999","Ok"]
["2014-01-17","NOM PRENOM 3319","ATI 999/999/99-99/MI/PU-99 DU 99/99/*99 AU 99/99/99","","VIDE"]
["2014-01-17","NOM PRENOM 3320","CIC BENIN N°9999/99 DU 99/99/9999 + PASS N°B9999999 DU 99/99/99","","VIDE"]
["2014-01-17","NOM PRENOM 3321","CNI N° C9999999999 DU 99/99/9999","","VIDE"]
["2014-01-17","NOM PRENOM 3322","TEL 99999999","99999999","Ok"]
["2014-01-17","NOM PRENOM 3323","CNI C9999999999 DU 99/99/9999 AU 99/99/9999","","VIDE"]
["2014-01-17","NOM PRENOM 3324","DU 99/99/9999 AU 99/99/9999","","VIDE"]
["2014-01-17","NOM PRENOM 3325","CELL 99999999","99999999","Ok"]
["2014-01-17","NOM PRENOM 3326","CNI C9999999999 DU 99/99/9999 AU 99/99/9999","","VIDE"]
["2014-01-17","NOM PRENOM 3327",null,"","VIDE"]
["2014-01-17","NOM PRENOM 3328","999999 99","","VIDE"]
["2014-01-17","NOM PRENOM 3329","AU 99/99/99","","VIDE"]
["2014-01-17","NOM PRENOM 3330","ET PC IV NO 99-99-99999999 DU 99/99/99",{"$f":"gettel(C3331)","v":""},{"$f":"IF(LEN(D3331)=0,\"VIDE\",IF(LEN(D3331)=8,\"Ok\",\"?\"))","v":"VIDE"}]
["2014-01-17","NOM PRENOM 3331",null,"","VIDE"]
["2014-01-17","NOM PRENOM 3332","TEL 99999999","99999999","Ok"]
["2014-01-17","NOM PRENOM 3333",99999999,"99999999","Ok"]
["2014-01-17","NOM PRENOM 3334","PC N° 99-99-99999999 DU 99.99.9999","","VIDE"]
["2014-01-17","NOM PRENOM 3335","TEL 99.99.99.99","99999999","Ok"]
["2014-01-17","NOM PRENOM 3336",null,"","VIDE"]
["2014-01-17","NOM PRENOM 3337","TEL 99.99.99.99","99999999","Ok"]
["2014-01-17","NOM PRENOM 3338","CNI N 9C 9999.9999.99 DU 99.99.9999","","VIDE"]
["2014-01-17","NOM PRENOM 3339",null,"","VIDE"]
["2014-01-17","NOM PRENOM 3340","TEL 99.99.99.99","99999999","Ok"]
["2014-01-17","NOM PRENOM 3341","ATTEST N 999/9999/99/99/PU-9 DU 99/99/99 AU 99/99/99","","VIDE"]
["2014-01-17","NOM PRENOM 3342","TEL 99999999","99999999","Ok"]
["2014-01-17","NOM PRENOM 3343","ATTEST V9999/9999/99-99/PU-OUME PC 99-99-99999999","","VIDE"]
["2014-01-17","NOM PRENOM 3344","CEL 99.99.99.99","99999999","Ok"]
["2014-01-17","NOM PRENOM 3345","CNI C 9999.9999.99 DU 99/99/9999","","VIDE"]
["2014-01-17","NOM PRENOM 3346",null,"","VIDE"]
["2014-01-17","NOM PRENOM 3347",null,"","VIDE"]
["2014-01-17","NOM PRENOM 3348","TEL 99.99.99.99","99999999","Ok"]
["2014-01-17","NOM PRENOM 3349","TEL 99999999","99999999","Ok"]
["2014-01-17","NOM PRENOM 3350","AKOUEBA CIC N°9999/99 DU 99.99.9999 ET","","VIDE"]
["2014-01-17","NOM PRENOM 3351","CNI N° C9999999999 DU 99/99/9999","","VIDE"]
["2014-01-17","NOM PRENOM 3352","CNI C9999.9999.99 DU 99/99/9999","","VIDE"]
["2014-01-17","NOM PRENOM 3353","AKOUEBA CIC N°9999/99 DU 99.99.9999 ET","","VIDE"]
["2014-01-17","NOM PRENOM 3354","CNI C9999999999 DU 99/99/9999 AU 99/99/9999","","VIDE"]
["2014-01-17","NOM PRENOM 3355","TEL 99.99.99.99","99999999","Ok"]
["2014-01-17","NOM PRENOM 3356","CNI N° C9999999999 DU 99/99/9999","","VIDE"]
["2014-01-17","NOM PRENOM 3357","AKOUEBA CIC N°9999/99 DU 99.99.9999 ET","","VIDE"]
["2014-01-17","NOM PRENOM 3358","CNI C 9999999999 DU 99/99/99","","VIDE"]
["2014-01-17","NOM PRENOM 3359",null,"","VIDE"]
["2014-01-17","NOM PRENOM 3360",null,"","VIDE"]
["2014-01-17","NOM PRENOM 3361","TEL 99.99.99.99","99999999","Ok"]
["2014-01-17","NOM PRENOM 3362","TEL 99999999","99999999","Ok"]
["2014-01-17","NOM PRENOM 3363","DU 99/99/9999","","VIDE"]
["2014-01-17","NOM PRENOM 3364","TEL 99.99.99.99","99999999","Ok"]
["2014-01-17","NOM PRENOM 3365","CNI C9999999999 DU 99/99/99","","VIDE"]
["2014-01-17","NOM PRENOM 3366","CNI C9999.9999.99 DU 99/99/9999","","VIDE"]
["2014-01-17","NOM PRENOM 3367","MARCELLE CNI C9999.9999.99 DU 99.99.99",{"$f":"gettel(C3368)","v":"ECNIC9999999999DU999999"},"?"]
["2014-01-17","NOM PRENOM 3368","CNI C9999.9999.99 DU 99.99.99","","VIDE"]
["2014-01-17","NOM PRENOM 3369","TEL:99-99-99-99","99999999","Ok"]
["2014-01-17","NOM PRENOM 3370",null,"","VIDE"]
["2014-01-17","NOM PRENOM 3371",null,"","VIDE"]
["2014-01-17","NOM PRENOM 3372",null,"","VIDE"]
["2014-01-17","NOM PRENOM 3373",null,"","VIDE"]
["2014-01-17","NOM PRENOM 3374",null,"","VIDE"]
["2014-01-17","NOM PRENOM 3375",null,"","VIDE"]
["2014-01-17","NOM PRENOM 3376","TEL 99999999","99999999","Ok"]
["2014-01-17","NOM PRENOM 3377",null,"","VIDE"]
["2014-01-17","NOM PRENOM 3378","KAMISSOKO MINANKOUROU","","VIDE"]
["2014-01-17","NOM PRENOM 3379",null,"","VIDE"]
["2014-01-17","NOM PRENOM 3380","CNI C9999999999 DU 99/99/9999","","VIDE"]
["2014-01-17","NOM PRENOM 3381",99999999,"99999999","Ok"]
["2014-01-17","NOM PRENOM 3382",null,"","VIDE"]
["2014-01-17","NOM PRENOM 3383",null,"","VIDE"]
["2014-01-17","NOM PRENOM 3384","CISSE ALASSANE","","VIDE"]
["2014-01-17","NOM PRENOM 3385","CNI C9999999999 DU 99/99/9999","","VIDE"]
["2014-01-17","NOM PRENOM 3386",null,"","VIDE"]
["2014-01-17","NOM PRENOM 3387","TEL 99999999","99999999","Ok"]
["2014-01-17","NOM PRENOM 3388","TEL 99.99.99.99","99999999","Ok"]
["2014-01-17","NOM PRENOM 3389",null,"","VIDE"]
["2014-01-17","NOM PRENOM 3390",null,"","VIDE"]
["2014-01-17","NOM PRENOM 3391",null,"","VIDE"]
["2014-01-17","NOM PRENOM 3392",null,"","VIDE"]
["2014-01-17","NOM PRENOM 3393",null,"","VIDE"]
["2014-01-17","NOM PRENOM 3394",null,{"$f":"gettel(C3395)","v":""},{"$f":"IF(LEN(D3395)=0,\"VIDE\",IF(LEN(D3395)=8,\"Ok\",\"?\"))","v":"VIDE"}]
["2014-01-17","NOM PRENOM 3395",99999999,"99999999","Ok"]
["2014-01-17","NOM PRENOM 3396",99999999,"99999999","Ok"]
["2014-01-17","NOM PRENOM 3397","TEL 99.99.99.99","99999999","Ok"]
["2014-01-17","NOM PRENOM 3398",null,"","VIDE"]
["2014-01-17","NOM PRENOM 3399",null,"","VIDE"]
["2014-01-17","NOM PRENOM 3400",99999999,"99999999","Ok"]
["2014-01-17","NOM PRENOM 3401","TEL 99.99.99.99","99999999","Ok"]
["2014-01-17","NOM PRENOM 3402","DU 99.99.9999","","VIDE"]
["2014-01-17","NOM PRENOM 3403",null,"","VIDE"]
["2014-01-17","NOM PRENOM 3404","TEL.99999999","99999999","Ok"]
["2014-01-17","NOM PRENOM 3405","TEL 99.99.99.99","99999999","Ok"]
["2014-01-17","NOM PRENOM 3406",null,"","VIDE"]
["2014-01-17","NOM PRENOM 3407","TEL 99.99.99.99","99999999","Ok"]
["2014-01-17","NOM PRENOM 3408","TEL 99999999","99999999","Ok"]
["2014-01-17","NOM PRENOM 3409",null,"","VIDE"]
["2014-01-17","NOM PRENOM 3410",null,"","VIDE"]
["2014-01-17","NOM PRENOM 3411","TEL 99999999","99999999","Ok"]
["2014-01-17","NOM PRENOM 3412","TPS 9999999/99-9999/MI/ONI/DIE99 DU 99/99/99","","VIDE"]
["2014-01-17","NOM PRENOM 3413",null,"","VIDE"]
["2014-01-17","NOM PRENOM 3414",null,"","VIDE"]
["2014-01-17","NOM PRENOM 3415",null,"","VIDE"]
["2014-01-20","NOM PRENOM 3416","TEL:99-99-99-99","99999999","Ok"]
["2014-01-20","NOM PRENOM 3417","TEL:99-99-99-99","99999999","Ok"]
["2014-01-20","NOM PRENOM 3418","TEL:99-99-99-99","99999999","Ok"]
["2014-01-20","NOM PRENOM 3419","TEL:99-99-99-99","99999999","Ok"]
["2014-01-20","NOM PRENOM 3420","TEL:99-99-99-99","99999999","Ok"]
["2014-01-20","NOM PRENOM 3421","TEL 99.99.99.99","99999999","Ok"]
["2014-01-20","NOM PRENOM 3422","TEL 99.99.99.99","99999999","Ok"]
["2014-01-20","NOM PRENOM 3423","PASS N°99AD99999 DU 99/99/99  + AI N°999-9999/99-99 DU 99/99/9999","","VIDE"]
["2014-01-20","NOM PRENOM 3424","TEL 999999999",{"$f":"gettel(C3425)","v":"999999999"},"?"]
["2014-01-20","NOM PRENOM 3425","CNI C9999999999 DU 99/99/9999 AU 99/99/9999 A SOUBRE","","VIDE"]
["2014-01-20","NOM PRENOM 3426","DU 99.99.9999","","VIDE"]
["2014-01-20","NOM PRENOM 3427","CNI N9 C 9999.9999.99 DU 99.99.9999","","VIDE"]
["2014-01-20","NOM PRENOM 3428","CNI C9999999999 DU 99/99/99","","VIDE"]
["2014-01-20","NOM PRENOM 3429","TEL 99999999","99999999","Ok"]
["2014-01-20","NOM PRENOM 3430","CNI N 9C 9999.9999.99 DU 99.99.9999","","VIDE"]
["2014-01-20","NOM PRENOM 3431","TEL 99.99.99.99","99999999","Ok"]
["2014-01-20","NOM PRENOM 3432",null,"","VIDE"]
["2014-01-20","NOM PRENOM 3433","TEL 99.99.99.99","99999999","Ok"]
["2014-01-20","NOM PRENOM 3434","TEL 99999999","99999999","Ok"]
["2014-01-20","NOM PRENOM 3435","TEL 99.99.99.99","99999999","Ok"]
["2014-01-20","NOM PRENOM 3436","CNI C 9999999999 DU 99/99/9999 A OUME","","VIDE"]
["2014-01-20","NOM PRENOM 3437","TEL 99999999","99999999","Ok"]
["2014-01-20","NOM PRENOM 3438",null,"","VIDE"]
["2014-01-20","NOM PRENOM 3439","TEL 99999999","99999999","Ok"]
["2014-01-20","NOM PRENOM 3440","TEL 99.99.99.99","99999999","Ok"]
["2014-01-20","NOM PRENOM 3441",null,"","VIDE"]
["2014-01-20","NOM PRENOM 3442","CNI 999999999999 DU 99.99.99 AU 99.99.99","","VIDE"]
["2014-01-20","NOM PRENOM 3443","TEL 99.99.99.99","99999999","Ok"]
["2014-01-20","NOM PRENOM 3444","TEL:99-99-99-99","99999999","Ok"]
["2014-01-20","NOM PRENOM 3445","tel 99999999","99999999","Ok"]
["2014-01-20","NOM PRENOM 3446","TEL 99999999","99999999","Ok"]
["2014-01-20","NOM PRENOM 3447","CNI C9999999999 DU 99/99/9999 AU 99/99/9999","","VIDE"]
["2014-01-20","NOM PRENOM 3448","TEL 99.99.99.99","99999999","Ok"]
["2014-01-20","NOM PRENOM 3449","TEL 99.99.99.99","99999999","Ok"]
["2014-01-20","NOM PRENOM 3450","val 99/99/9999 celb 99999999",{"$f":"gettel(C3451)","v":"b99999999"},"?"]
["2014-01-20","NOM PRENOM 3451",null,"","VIDE"]
["2014-01-20","NOM PRENOM 3452","PASS 99AD99999 DU 99.99.99 AU 99.99.99","","VIDE"]
["2014-01-20","NOM PRENOM 3453","TEL 99999999","99999999","Ok"]
["2014-01-20","NOM PRENOM 3454",null,"","VIDE"]
["2014-01-20","NOM PRENOM 3455","CNI N 999999999999 DU 99/9/99 AU 99/9/99","","VIDE"]
["2014-01-20","NOM PRENOM 3456",null,"","VIDE"]
["2014-01-20","NOM PRENOM 3457","TEL 99999999","99999999","Ok"]
["2014-01-20","NOM PRENOM 3458","CNI C 9999 9999 99 DU 99/99/9999 AU 99/99/9999",{"$f":"gettel(C3459)","v":""},{"$f":"IF(LEN(D3459)=0,\"VIDE\",IF(LEN(D3459)=8,\"Ok\",\"?\"))","v":"VIDE"}]
["2014-01-20","NOM PRENOM 3459",null,"","VIDE"]
["2014-01-20","NOM PRENOM 3460","AUTH 99999","","VIDE"]
["2014-01-20","NOM PRENOM 3461","TEL 99999999","99999999","Ok"]
["2014-01-20","NOM PRENOM 3462",null,"","VIDE"]
["2014-01-20","NOM PRENOM 3463",null,"","VIDE"]
["2014-01-20","NOM PRENOM 3464","TEL 99999999","99999999","Ok"]
["2014-01-20","NOM PRENOM 3465","CEL 99999999","99999999","Ok"]
["2014-01-20","NOM PRENOM 3466","PASS N°99AB9.9999 DU 99.99.99","","VIDE"]
["2014-01-20","NOM PRENOM 3467",null,"","VIDE"]
["2014-01-20","NOM PRENOM 3468","TEL 99.99.99.99","99999999","Ok"]
["2014-01-20","NOM PRENOM 3469","TEL:99-99-99-99","99999999","Ok"]
["2014-01-20","NOM PRENOM 3470",null,"","VIDE"]
["2014-01-20","NOM PRENOM 3471","TEL 99.99.99.99","99999999","Ok"]
["2014-01-20","NOM PRENOM 3472","CNI C 9999 9999 99 DU 99/99/9999 AU 99/99/9999","","VIDE"]
["2014-01-20","NOM PRENOM 3473","tel 99999999","99999999","Ok"]
["2014-01-20","NOM PRENOM 3474","TEL 99999999","99999999","Ok"]
["2014-01-20","NOM PRENOM 3475","CNI C 9999 9999 99 DU 99/99/99 - TEL 99999999","99999999","Ok"]
["2014-01-20","NOM PRENOM 3476","TEL:99-99-99-99","99999999","Ok"]
["2014-01-20","NOM PRENOM 3477",null,"","VIDE"]
["2014-01-20","NOM PRENOM 3478",null,"","VIDE"]
["2014-01-20","NOM PRENOM 3479","TEL99.99.99.99","99999999","Ok"]
["2014-01-20","NOM PRENOM 3480","TEL 99999999","99999999","Ok"]
["2014-01-20","NOM PRENOM 3481","TEL 99999999","99999999","Ok"]
["2014-01-20","NOM PRENOM 3482","TEL 99999999","99999999","Ok"]
["2014-01-20","NOM PRENOM 3483",null,"","VIDE"]
["2014-01-20","NOM PRENOM 3484","TEL 99999999","99999999","Ok"]
["2014-01-20","NOM PRENOM 3485","TEL 99999999","99999999","Ok"]
["2014-01-20","NOM PRENOM 3486",null,"","VIDE"]
["2014-01-20","NOM PRENOM 3487",null,"","VIDE"]
["2014-01-20","NOM PRENOM 3488","TEL 99.99.99.99","99999999","Ok"]
["2014-01-20","NOM PRENOM 3489","CNI N9 C 9999.9999.99 DU 99.99.9999 DABOU","","VIDE"]
["2014-01-20","NOM PRENOM 3490","TEL:99-99-99-99","99999999","Ok"]
["2014-01-20","NOM PRENOM 3491","TEL 99999999","99999999","Ok"]
["2014-01-20","NOM PRENOM 3492",null,"","VIDE"]
["2014-01-20","NOM PRENOM 3493","TEL 99.99.99.99","99999999","Ok"]
["2014-01-20","NOM PRENOM 3494","TEL 99999999","99999999","Ok"]
["2014-01-20","NOM PRENOM 3495",null,"","VIDE"]
["2014-01-20","NOM PRENOM 3496","TEL:99-99-99-99","99999999","Ok"]
["2014-01-20","NOM PRENOM 3497",null,"","VIDE"]
["2014-01-20","NOM PRENOM 3498",null,"","VIDE"]
["2014-01-20","NOM PRENOM 3499","CNI C 999999999 DU 99-99-99","","VIDE"]
["2014-01-20","NOM PRENOM 3500","TEL 99999999","99999999","Ok"]
["2014-01-20","NOM PRENOM 3501","TEL 99999999","99999999","Ok"]
["2014-01-20","NOM PRENOM 3502","CNI N 9C 9999.9999.99 DU 99.99.9999 ORESS-KROBOU","","VIDE"]
["2014-01-20","NOM PRENOM 3503","TEL:99-99-99-99","99999999","Ok"]
["2014-01-20","NOM PRENOM 3504",null,"","VIDE"]
["2014-01-20","NOM PRENOM 3505",null,"","VIDE"]
["2014-01-20","NOM PRENOM 3506","PASS N°E9999999 DU 99/99/9999","","VIDE"]
["2014-01-20","NOM PRENOM 3507",null,"","VIDE"]
["2014-01-20","NOM PRENOM 3508","TEL 99999999","99999999","Ok"]
["2014-01-20","NOM PRENOM 3509",null,"","VIDE"]
["2014-01-20","NOM PRENOM 3510",null,"","VIDE"]
["2014-01-20","NOM PRENOM 3511","AKOUEBA CIC N°9999/99 DU 99.99.9999","","VIDE"]
["2014-01-20","NOM PRENOM 3512","TEL 99.99.99.99","99999999","Ok"]
["2014-01-20","NOM PRENOM 3513","PASS N 99AD99999 DU 99/99/99 AU 99/99/99","","VIDE"]
["2014-01-20","NOM PRENOM 3514","TEL 99999999","99999999","Ok"]
["2014-01-20","NOM PRENOM 3515","CNI C9999999999 DU 99/99/9999 AU 99/99/9999 A GRD ZATTRY","","VIDE"]
["2014-01-20","NOM PRENOM 3516","CNI  C9999 9999 99 DU 99/99/9999 AU 99/99/9999","","VIDE"]
["2014-01-20","NOM PRENOM 3517","CNI C9999999999 DU 99/99/9999 AU 99/99/9999","","VIDE"]
["2014-01-20","NOM PRENOM 3518","CNI C 9999999999 DU 99/99/9999 A OUME","","VIDE"]
["2014-01-20","NOM PRENOM 3519",null,"","VIDE"]
["2014-01-20","NOM PRENOM 3520","CNI C 9999 9999 99 DU 99/99/9999 AU 99/99/9999","","VIDE"]
["2014-01-20","NOM PRENOM 3521",null,"","VIDE"]
["2014-01-20","NOM PRENOM 3522","CNI C 9999 9999 99 DU 99 99 9999 AU 99 99 9999",{"$f":"gettel(C3523)","v":""},{"$f":"IF(LEN(D3523)=0,\"VIDE\",IF(LEN(D3523)=8,\"Ok\",\"?\"))","v":"VIDE"}]
["2014-01-20","NOM PRENOM 3523",null,"","VIDE"]
["2014-01-20","NOM PRENOM 3524","CNI C 9999999999 DU 99/99/99 AU 99/99/99","","VIDE"]
["2014-01-20","NOM PRENOM 3525","TEL 99.99.99.99","99999999","Ok"]
["2014-01-20","NOM PRENOM 3526","TEL 99.99.99.99","99999999","Ok"]
["2014-01-20","NOM PRENOM 3527","cel 99999999","99999999","Ok"]
["2014-01-20","NOM PRENOM 3528","MARCELLE CNI C9999.9999.99 DU 99.99.99",{"$f":"gettel(C3529)","v":"ECNIC9999999999DU999999"},"?"]
["2014-01-20","NOM PRENOM 3529","CNI C 9999 9999 99 DU 99/99/9999 AU 99/99/9999","","VIDE"]
["2014-01-20","NOM PRENOM 3530","CNI N° C9999999999 DU 99/99/9999","","VIDE"]
["2014-01-20","NOM PRENOM 3531",null,"","VIDE"]
["2014-01-20","NOM PRENOM 3532","ONI 999-999/99-99/PU-9 DU 99/99/99","","VIDE"]
["2014-01-20","NOM PRENOM 3533","CNI C 9999999999 DU 99/9/99 AU 99/9/99","","VIDE"]
["2014-01-20","NOM PRENOM 3534","cel 99999999","99999999","Ok"]
["2014-01-20","NOM PRENOM 3535","CNI N 9999999999 DU 99/99/9999","","VIDE"]
["2014-01-20","NOM PRENOM 3536","CELL 99999999","99999999","Ok"]
["2014-01-20","NOM PRENOM 3537","TEL 99999999","99999999","Ok"]
["2014-01-20","NOM PRENOM 3538",null,"","VIDE"]
["2014-01-20","NOM PRENOM 3539","CIC NIG N 99999999NG DU 99/99/9999 AU 99/99/9999","","VIDE"]
["2014-01-20","NOM PRENOM 3540","TEL 99.99.99.99","99999999","Ok"]
["2014-01-20","NOM PRENOM 3541","DU 99.99.99","","VIDE"]
["2014-01-20","NOM PRENOM 3542","CEL 99999999","99999999","Ok"]
["2014-01-20","NOM PRENOM 3543","CNI C 9999 9999 99 DU 99/99/9999 AU 99/99/9999","","VIDE"]
["2014-01-20","NOM PRENOM 3544","CNI N° C9999999999 DU 99/99/9999","","VIDE"]
["2014-01-20","NOM PRENOM 3545","PC N 999999999999 DU 99/99/9999","","VIDE"]
["2014-01-20","NOM PRENOM 3546","PASSPORT 99AD99999 DU 99/99/99 AU 99/99/99","","VIDE"]
["2014-01-20","NOM PRENOM 3547","cel 99999999","99999999","Ok"]
["2014-01-20","NOM PRENOM 3548","CIC N° 999/99 DU 99/99/9999","","VIDE"]
["2014-01-20","NOM PRENOM 3549","val 99/99/9999 cel 99999999","99999999","Ok"]
["2014-01-20","NOM PRENOM 3550","CEL 99.99.99.99","99999999","Ok"]
["2014-01-20","NOM PRENOM 3551","TEL 99.99.99.99","99999999","Ok"]
["2014-01-20","NOM PRENOM 3552","CNI N° 999999999999 DU 99/99/9999","","VIDE"]
["2014-01-20","NOM PRENOM 3553","CEL 99.99.99.99","99999999","Ok"]
["2014-01-20","NOM PRENOM 3554","CEL 99999999","99999999","Ok"]
["2014-01-20","NOM PRENOM 3555","CELL 99999999","99999999","Ok"]
["2014-01-20","NOM PRENOM 3556","CEL 99.99.99.99","99999999","Ok"]
["2014-01-20","NOM PRENOM 3557","TEL 99.99.99.99","99999999","Ok"]
["2014-01-20","NOM PRENOM 3558","CEL 99999999","99999999","Ok"]
["2014-01-20","NOM PRENOM 3559","CNI C9999999999 DU 99/99/9999 AU 99/99/9999","","VIDE"]
["2014-01-20","NOM PRENOM 3560","CEL 99999999","99999999","Ok"]
["2014-01-20","NOM PRENOM 3561",null,"","VIDE"]
["2014-01-20","NOM PRENOM 3562","CNI C 9999999999 DU 99/99/99","","VIDE"]
["2014-01-20","NOM PRENOM 3563","tel 99.99.99.99","99999999","Ok"]
["2014-01-20","NOM PRENOM 3564","TEL 99.99.99.99","99999999","Ok"]
["2014-01-20","NOM PRENOM 3565","ET PC IV NO 99-99-99999999 DU 99/99/99","","VIDE"]
["2014-01-20","NOM PRENOM 3566","TEL.99.99.99.99","99999999","Ok"]
["2014-01-20","NOM PRENOM 3567",null,"","VIDE"]
["2014-01-20","NOM PRENOM 3568",null,"","VIDE"]
["2014-01-20","NOM PRENOM 3569","CNI N° C9999999999 DU 99/99/9999","","VIDE"]
["2014-01-20","NOM PRENOM 3570","TEL.99.99.99.99","99999999","Ok"]
["2014-01-20","NOM PRENOM 3571","TEL:99-99-99-99","99999999","Ok"]
["2014-01-20","NOM PRENOM 3572","TEL.99999999","99999999","Ok"]
["2014-01-20","NOM PRENOM 3573",null,"","VIDE"]
["2014-01-20","NOM PRENOM 3574",null,"","VIDE"]
["2014-01-20","NOM PRENOM 3575",null,"","VIDE"]
["2014-01-20","NOM PRENOM 3576","TEL.99999999","99999999","Ok"]
["2014-01-20","NOM PRENOM 3577","CNI C 9999999999 DU 99/99/9999 A BKE","","VIDE"]
["2014-01-20","NOM PRENOM 3578",null,"","VIDE"]
["2014-01-20","NOM PRENOM 3579","TEL99.99.99.99","99999999","Ok"]
["2014-01-20","NOM PRENOM 3580",99999999,"99999999","Ok"]
["2014-01-20","NOM PRENOM 3581","TEL.99.99.99.99","99999999","Ok"]
["2014-01-20","NOM PRENOM 3582","pc n 99-99-99999999 etablie le 99/99/9999","","VIDE"]
["2014-01-20","NOM PRENOM 3583","TEL 99999999","99999999","Ok"]
["2014-01-20","NOM PRENOM 3584","ATD N° 999.999.99.99.MI.PU.9 DU 99.99.99","","VIDE"]
["2014-01-20","NOM PRENOM 3585","TEL99.99.99.99","99999999","Ok"]
["2014-01-20","NOM PRENOM 3586","TEL 99.99.99.99",{"$f":"gettel(C3587)","v":"99999999"},{"$f":"IF(LEN(D3587)=0,\"VIDE\",IF(LEN(D3587)=8,\"Ok\",\"?\"))","v":"Ok"}]
["2014-01-20","NOM PRENOM 3587","PASSPORT 99AB99999 DU 99/99/99 AU 99/99/99","","VIDE"]
["2014-01-20","NOM PRENOM 3588","TEL.99.99.99.99","99999999","Ok"]
["2014-01-20","NOM PRENOM 3589","CNI C9999.9999.99 DU 99/99/9999","","VIDE"]
["2014-01-20","NOM PRENOM 3590",null,"","VIDE"]
["2014-01-20","NOM PRENOM 3591","CIC NIGERIA 9999999999999 DU 99/99/99","","VIDE"]
["2014-01-20","NOM PRENOM 3592","TEL 99999999//99999999",{"$f":"gettel(C3593)","v":"99999999/99999999"},"?"]
["2014-01-20","NOM PRENOM 3593","TEL 99.99.99.99","99999999","Ok"]
["2014-01-20","NOM PRENOM 3594","val 99/99/9999 cel 99999999","99999999","Ok"]
["2014-01-20","NOM PRENOM 3595","CNI C 9999999999 DU 99/99/9999","","VIDE"]
["2014-01-20","NOM PRENOM 3596","CNI C 9999 9999 99 DU 99/99/99 - TEL 99999999","99999999","Ok"]
["2014-01-20","NOM PRENOM 3597",null,"","VIDE"]
["2014-01-20","NOM PRENOM 3598","TEL 99999999","99999999","Ok"]
["2014-01-20","NOM PRENOM 3599","val 99/99/9999 cel 99999999","99999999","Ok"]
["2014-01-20","NOM PRENOM 3600",null,"","VIDE"]
["2014-01-20","NOM PRENOM 3601","CNI C9999.9999.99 DU 99.99.99","","VIDE"]
["2014-01-20","NOM PRENOM 3602",null,"","VIDE"]
["2014-01-20","NOM PRENOM 3603","CEL 99999999","99999999","Ok"]
["2014-01-20","NOM PRENOM 3604",null,"","VIDE"]
["2014-01-20","NOM PRENOM 3605",null,"","VIDE"]
["2014-01-20","NOM PRENOM 3606","cel 99999999","99999999","Ok"]
["2014-01-20","NOM PRENOM 3607","TEL 99.99.99.99","99999999","Ok"]
["2014-01-20","NOM PRENOM 3608","TEL 99999999","99999999","Ok"]
["2014-01-20","NOM PRENOM 3609","TEL 99999999","99999999","Ok"]
["2014-01-20","NOM PRENOM 3610","CEL 99.99.99.99","99999999","Ok"]
["2014-01-20","NOM PRENOM 3611","TEL:99-99-99-99","99999999","Ok"]
["2014-01-20","NOM PRENOM 3612","CNI N° C9999999999 DU 99/99/9999","","VIDE"]
["2014-01-20","NOM PRENOM 3613",null,"","VIDE"]
["2014-01-20","NOM PRENOM 3614","TEL 99999999","99999999","Ok"]
["2014-01-20","NOM PRENOM 3615","CONSUL AB/9999/AGCI/99/99","","VIDE"]
["2014-01-20","NOM PRENOM 3616","TEL 99999999","99999999","Ok"]
["2014-01-20","NOM PRENOM 3617","TEL 99.99.99.99","99999999","Ok"]
["2014-01-20","NOM PRENOM 3618",null,"","VIDE"]
["2014-01-20","NOM PRENOM 3619",99999999,"99999999","Ok"]
["2014-01-20","NOM PRENOM 3620","TEL 99999999","99999999","Ok"]
["2014-01-20","NOM PRENOM 3621","CNI C 9999999999 DU 99-99-99","","VIDE"]
["2014-01-20","NOM PRENOM 3622","PASS VIET N°B9999999 DU 99.99.99","","VIDE"]
["2014-01-20","NOM PRENOM 3623","TEL 99999999","99999999","Ok"]
["2014-01-20","NOM PRENOM 3624","CNI C9999.9999.99 DU 99/99/9999","","VIDE"]
["2014-01-20","NOM PRENOM 3625","TEL 99999999","99999999","Ok"]
["2014-01-20","NOM PRENOM 3626","TEL 99999999","99999999","Ok"]
["2014-01-20","NOM PRENOM 3627","TEL 99999999","99999999","Ok"]
["2014-01-20","NOM PRENOM 3628",null,"","VIDE"]
["2014-01-20","NOM PRENOM 3629","TEL 99999999","99999999","Ok"]
["2014-01-20","NOM PRENOM 3630","ATT 999-9999/99-99/PU99 DU 99/99/99 - TEL 99999999","99999999","Ok"]
["2014-01-20","NOM PRENOM 3631",null,"","VIDE"]
["2014-01-20","NOM PRENOM 3632","TEL99.99.99.99","99999999","Ok"]
["2014-01-20","NOM PRENOM 3633",null,"","VIDE"]
["2014-01-20","NOM PRENOM 3634","CNI C 9999999999 DU 99-99-99","","VIDE"]
["2014-01-20","NOM PRENOM 3635",null,"","VIDE"]
["2014-01-20","NOM PRENOM 3636","CEL 99.99.99.99","99999999","Ok"]
["2014-01-20","NOM PRENOM 3637","CNI C9999.9999.99 DU 99.99.99","","VIDE"]
["2014-01-20","NOM PRENOM 3638","VAL99/99/9999 CEL99999999","99999999","Ok"]
["2014-01-20","NOM PRENOM 3639",null,"","VIDE"]
["2014-01-20","NOM PRENOM 3640",null,"","VIDE"]
["2014-01-20","NOM PRENOM 3641","DU 99/99/9999","","VIDE"]
["2014-01-20","NOM PRENOM 3642","TEL 99999999","99999999","Ok"]
["2014-01-20","NOM PRENOM 3643",null,"","VIDE"]
["2014-01-20","NOM PRENOM 3644",null,"","VIDE"]
["2014-01-20","NOM PRENOM 3645","TEL:99-99-99-99","99999999","Ok"]
["2014-01-20","NOM PRENOM 3646","TEL 99999999","99999999","Ok"]
["2014-01-20","NOM PRENOM 3647","VAL99.99.9999 CEL99999999","99999999","Ok"]
["2014-01-20","NOM PRENOM 3648","cel 99999999","99999999","Ok"]
["2014-01-20","NOM PRENOM 3649",null,"","VIDE"]
["2014-01-20","NOM PRENOM 3650","DU 99/99/9999",{"$f":"gettel(C3651)","v":""},{"$f":"IF(LEN(D3651)=0,\"VIDE\",IF(LEN(D3651)=8,\"Ok\",\"?\"))","v":"VIDE"}]
["2014-01-20","NOM PRENOM 3651",null,"","VIDE"]
["2014-01-20","NOM PRENOM 3652",99999999,"99999999","Ok"]
["2014-01-20","NOM PRENOM 3653",null,"","VIDE"]
["2014-01-20","NOM PRENOM 3654","CEL 99999999","99999999","Ok"]
["2014-01-20","NOM PRENOM 3655","CNI C9999999999 DU 99/99/9999","","VIDE"]
["2014-01-20","NOM PRENOM 3656","TEL 99999999","99999999","Ok"]
["2014-01-20","NOM PRENOM 3657","TEL 99.99.99.99","99999999","Ok"]
["2014-01-20","NOM PRENOM 3658","CIC SENEGAL 999/9999 DU 99/99/9999","","VIDE"]
["2014-01-20","NOM PRENOM 3659","CNI C9999.9999.99 DU 99/99/9999","","VIDE"]
["2014-01-20","NOM PRENOM 3660","TEL 99999999","99999999","Ok"]
["2014-01-20","NOM PRENOM 3661",null,"","VIDE"]
["2014-01-20","NOM PRENOM 3662",null,"","VIDE"]
["2014-01-20","NOM PRENOM 3663","CNI N° C9999999999 DU 99/99/9999","","VIDE"]
["2014-01-20","NOM PRENOM 3664","TEL:99-99-99-99","99999999","Ok"]
["2014-01-20","NOM PRENOM 3665","TEL 99999999","99999999","Ok"]
["2014-01-20","NOM PRENOM 3666",null,"","VIDE"]
["2014-01-20","NOM PRENOM 3667","CNI C 9999999999 DU 99/99/9999","","VIDE"]
["2014-01-20","NOM PRENOM 3668","CEL 99999999","99999999","Ok"]
["2014-01-20","NOM PRENOM 3669",null,"","VIDE"]
["2014-01-20","NOM PRENOM 3670","TEL 99.99.99.99","99999999","Ok"]
["2014-01-20","NOM PRENOM 3671","CNI C9999.9999.99 DU 99/99/9999","","VIDE"]
["2014-01-20","NOM PRENOM 3672","CNI C9999999999 DU 99/99/9999","","VIDE"]
["2014-01-20","NOM PRENOM 3673",null,"","VIDE"]
["2014-01-20","NOM PRENOM 3674",null,"","VIDE"]
["2014-01-20","NOM PRENOM 3675","TEL 99.99.99.99","99999999","Ok"]
["2014-01-20","NOM PRENOM 3676",null,"","VIDE"]
["2014-01-20","NOM PRENOM 3677","CEL 99.99.99.99","99999999","Ok"]
["2014-01-20","NOM PRENOM 3678","9999 9999 99 DU 99.99.99 AU 99.99.99","","VIDE"]
["2014-01-20","NOM PRENOM 3679","CNI N° C9999999999 DU 99/99/9999","","VIDE"]
["2014-01-20","NOM PRENOM 3680","CNI N° C9999 9999 99 DU 99/99/9999 AU 99/99/9999","","VIDE"]
["2014-01-20","NOM PRENOM 3681","CELL 99999999","99999999","Ok"]
["2014-01-20","NOM PRENOM 3682",null,"","VIDE"]
["2014-01-20","NOM PRENOM 3683","TEL 99.99.99.99","99999999","Ok"]
["2014-01-20","NOM PRENOM 3684",null,"","VIDE"]
["2014-01-20","NOM PRENOM 3685","TEL 99.99.99.99","99999999","Ok"]
["2014-01-20","NOM PRENOM 3686",null,"","VIDE"]
["2014-01-20","NOM PRENOM 3687","TEL 99.99.99.99","99999999","Ok"]
["2014-01-20","NOM PRENOM 3688","TEL 99.99.99.99","99999999","Ok"]
["2014-01-20","NOM PRENOM 3689","CNI C9999.9999.99 DU 99/99/9999","","VIDE"]
["2014-01-20","NOM PRENOM 3690","TEL 99999999","99999999","Ok"]
["2014-01-20","NOM PRENOM 3691","TEL 99.99.99.99","99999999","Ok"]
["2014-01-20","NOM PRENOM 3692","TEL:99-99-99-99","99999999","Ok"]
["2014-01-20","NOM PRENOM 3693",null,"","VIDE"]
["2014-01-20","NOM PRENOM 3694",null,"","VIDE"]
["2014-01-20","NOM PRENOM 3695",null,"","VIDE"]
["2014-01-20","NOM PRENOM 3696","CEL 99999999","99999999","Ok"]
["2014-01-20","NOM PRENOM 3697","DU 99.99.9999","","VIDE"]
["2014-01-20","NOM PRENOM 3698","CISSE MAHAMAR","","VIDE"]
["2014-01-20","NOM PRENOM 3699","MBAYE ABDOU KARIM","","VIDE"]
["2014-01-20","NOM PRENOM 3700",null,"","VIDE"]
["2014-01-20","NOM PRENOM 3701",null,"","VIDE"]
["2014-01-20","NOM PRENOM 3702",null,"","VIDE"]
["2014-01-20","NOM PRENOM 3703",null,"","VIDE"]
["2014-01-20","NOM PRENOM 3704",null,"","VIDE"]
["2014-01-20","NOM PRENOM 3705","TRAORE MAMADOU","","VIDE"]
["2014-01-20","NOM PRENOM 3706","CEL 99999999","99999999","Ok"]
["2014-01-20","NOM PRENOM 3707",null,"","VIDE"]
["2014-01-20","NOM PRENOM 3708","TEL 99999999","99999999","Ok"]
["2014-01-20","NOM PRENOM 3709",null,"","VIDE"]
["2014-01-20","NOM PRENOM 3710","DU 99.99.9999","","VIDE"]
["2014-01-20","NOM PRENOM 3711",null,"","VIDE"]
["2014-01-20","NOM PRENOM 3712","TEL 99.99.99.99","99999999","Ok"]
["2014-01-20","NOM PRENOM 3713","TEL 99.99.99.99","99999999","Ok"]
["2014-01-20","NOM PRENOM 3714","CEL 99999999",{"$f":"gettel(C3715)","v":"99999999"},{"$f":"IF(LEN(D3715)=0,\"VIDE\",IF(LEN(D3715)=8,\"Ok\",\"?\"))","v":"Ok"}]
["2014-01-20","NOM PRENOM 3715",null,"","VIDE"]
["2014-01-20","NOM PRENOM 3716","TEL 99.99.99.99","99999999","Ok"]
["2014-01-20","NOM PRENOM 3717",null,"","VIDE"]
["2014-01-20","NOM PRENOM 3718","TEL 99999999","99999999","Ok"]
["2014-01-20","NOM PRENOM 3719","TEL 99999999","99999999","Ok"]
["2014-01-20","NOM PRENOM 3720",99999999,"99999999","Ok"]
["2014-01-20","NOM PRENOM 3721",null,"","VIDE"]
["2014-01-20","NOM PRENOM 3722","TEL 99.99.99.99","99999999","Ok"]
["2014-01-20","NOM PRENOM 3723",null,"","VIDE"]
["2014-01-20","NOM PRENOM 3724","MLE 9999","","VIDE"]
["2014-01-20","NOM PRENOM 3725","cel 99999999","99999999","Ok"]
["2014-01-20","NOM PRENOM 3726","TEL 99999999","99999999","Ok"]
["2014-01-20","NOM PRENOM 3727","TEL 99999999","99999999","Ok"]
["2014-01-20","NOM PRENOM 3728",null,"","VIDE"]
["2014-01-20","NOM PRENOM 3729",null,"","VIDE"]
["2014-01-20","NOM PRENOM 3730","BOLY DEMBA","","VIDE"]
["2014-01-20","NOM PRENOM 3731",null,"","VIDE"]
["2014-01-20","NOM PRENOM 3732",null,"","VIDE"]
["2014-01-20","NOM PRENOM 3733","TEL 99.99.99.99","99999999","Ok"]
["2014-01-20","NOM PRENOM 3734",null,"","VIDE"]
["2014-01-20","NOM PRENOM 3735",null,"","VIDE"]
["2014-01-20","NOM PRENOM 3736","TEL 99999999","99999999","Ok"]
["2014-01-20","NOM PRENOM 3737","ABDOULAYE DIALLO","","VIDE"]
["2014-01-20","NOM PRENOM 3738",null,"","VIDE"]
["2014-01-20","NOM PRENOM 3739",null,"","VIDE"]
["2014-01-20","NOM PRENOM 3740","DICKO OUMAR","","VIDE"]
["2014-01-20","NOM PRENOM 3741",null,"","VIDE"]
["2014-01-20","NOM PRENOM 3742",null,"","VIDE"]
["2014-01-20","NOM PRENOM 3743",99999999,"99999999","Ok"]
["2014-01-20","NOM PRENOM 3744","BABY LI MAN","","VIDE"]
["2014-01-20","NOM PRENOM 3745",99999999,"99999999","Ok"]
["2014-01-20","NOM PRENOM 3746",null,"","VIDE"]
["2014-01-20","NOM PRENOM 3747",null,"","VIDE"]
["2014-01-20","NOM PRENOM 3748","diagayete mamadoun","","VIDE"]
["2014-01-21","NOM PRENOM 3749","CNI C 9999999999 DU 99-99-99","","VIDE"]
["2014-01-21","NOM PRENOM 3750","CNI C 9999999999 DU 99/99/9999 A OUME","","VIDE"]
["2014-01-21","NOM PRENOM 3751","CNI C9999999999 DU 99/99/9999 AU 99/99/9999 A ABJ","","VIDE"]
["2014-01-21","NOM PRENOM 3752",null,"","VIDE"]
["2014-01-21","NOM PRENOM 3753",null,"","VIDE"]
["2014-01-21","NOM PRENOM 3754","VAL99/99/9999 CEL99999999","99999999","Ok"]
["2014-01-21","NOM PRENOM 3755","TEL 99999999","99999999","Ok"]
["2014-01-21","NOM PRENOM 3756","val 99/99/9999 cel 99999999","99999999","Ok"]
["2014-01-21","NOM PRENOM 3757","CEL:99999999","99999999","Ok"]
["2014-01-21","NOM PRENOM 3758","CEL 99999999","99999999","Ok"]
["2014-01-21","NOM PRENOM 3759",null,"","VIDE"]
["2014-01-21","NOM PRENOM 3760","CEL:99999999","99999999","Ok"]
["2014-01-21","NOM PRENOM 3761","CNI C9999999999 DU 99/99/9999","","VIDE"]
["2014-01-21","NOM PRENOM 3762",null,"","VIDE"]
["2014-01-21","NOM PRENOM 3763","CNI N° C9999999999 DU 99/99/9999","","VIDE"]
["2014-01-21","NOM PRENOM 3764","TEL 99.99.99.99","99999999","Ok"]
["2014-01-21","NOM PRENOM 3765","CNI C 9999999999 DU 99 99 9999 AU 99 99 9999","","VIDE"]
["2014-01-21","NOM PRENOM 3766","TEL 99.99.99.99","99999999","Ok"]
["2014-01-21","NOM PRENOM 3767","CNI 999999999999 DU 99/99/9999 AU 99/99/9999","","VIDE"]
["2014-01-21","NOM PRENOM 3768","CNI C 9999 9999 99 DU 99/99/99 - TEL 99999999","99999999","Ok"]
["2014-01-21","NOM PRENOM 3769","PASSEPORT 99AA99999 DU 99/99/99","","VIDE"]
["2014-01-21","NOM PRENOM 3770","CELL 99999999","99999999","Ok"]
["2014-01-21","NOM PRENOM 3771","CNI C 9999 9999 99 DU 99/99/99 - TEL 99999999","99999999","Ok"]
["2014-01-21","NOM PRENOM 3772","TEL 99.99.99.99","99999999","Ok"]
["2014-01-21","NOM PRENOM 3773","tel 99999999","99999999","Ok"]
["2014-01-21","NOM PRENOM 3774","TEL 99999999","99999999","Ok"]
["2014-01-21","NOM PRENOM 3775","CNI C 9999999999 DU 99-99-99","","VIDE"]
["2014-01-21","NOM PRENOM 3776","TEL 99.99.99.99","99999999","Ok"]
["2014-01-21","NOM PRENOM 3777","TEL 99999999","99999999","Ok"]
["2014-01-21","NOM PRENOM 3778","VAL 99/99/9999 PC N 99-99-99999999",{"$f":"gettel(C3779)","v":""},{"$f":"IF(LEN(D3779)=0,\"VIDE\",IF(LEN(D3779)=8,\"Ok\",\"?\"))","v":"VIDE"}]
["2014-01-21","NOM PRENOM 3779","TEL 99.99.99.99","99999999","Ok"]
["2014-01-21","NOM PRENOM 3780","TEL 99999999","99999999","Ok"]
["2014-01-21","NOM PRENOM 3781","TEL 99999999","99999999","Ok"]
["2014-01-21","NOM PRENOM 3782","TEL 99999999","99999999","Ok"]
["2014-01-21","NOM PRENOM 3783","VAL 99/99/9999 CEL 99999999","99999999","Ok"]
["2014-01-21","NOM PRENOM 3784","CNI 999999999999","","VIDE"]
["2014-01-21","NOM PRENOM 3785","cel 99999999","99999999","Ok"]
["2014-01-21","NOM PRENOM 3786","CNI N9 C 9999.9999.99 DU 99.99.9999","","VIDE"]
["2014-01-21","NOM PRENOM 3787",null,"","VIDE"]
["2014-01-21","NOM PRENOM 3788","TEL 99.99.99.99","99999999","Ok"]
["2014-01-21","NOM PRENOM 3789","val 99/99/9999 cel 99999999","99999999","Ok"]
["2014-01-21","NOM PRENOM 3790","TEL:99-99-99-99","99999999","Ok"]
["2014-01-21","NOM PRENOM 3791","CIC GUINEE N AB/99/9999/AGCI/99/99 DU 99/99/99","","VIDE"]
["2014-01-21","NOM PRENOM 3792",null,"","VIDE"]
["2014-01-21","NOM PRENOM 3793","DU 99/99/9999","","VIDE"]
["2014-01-21","NOM PRENOM 3794","CNI N 9C 9999.9999.99 DU 99.99.9999","","VIDE"]
["2014-01-21","NOM PRENOM 3795","TEL 99999999","99999999","Ok"]
["2014-01-21","NOM PRENOM 3796","TEL:99-99-99-99","99999999","Ok"]
["2014-01-21","NOM PRENOM 3797","CEL 99.99.99.99","99999999","Ok"]
["2014-01-21","NOM PRENOM 3798","CNI N° C9999999999 DU 99/99/9999","","VIDE"]
["2014-01-21","NOM PRENOM 3799","TEL 99999999","99999999","Ok"]
["2014-01-21","NOM PRENOM 3800",null,"","VIDE"]
["2014-01-21","NOM PRENOM 3801","CIC MALI 999999/CGMA/CI DU 99-99-9999","","VIDE"]
["2014-01-21","NOM PRENOM 3802","CEL:99999999","99999999","Ok"]
["2014-01-21","NOM PRENOM 3803","VAL 99/99/9999 CEL 99999999","99999999","Ok"]
["2014-01-21","NOM PRENOM 3804","CNI C9999999999 DU 99/99/9999 AU 99/99/9999 A SOUBRE","","VIDE"]
["2014-01-21","NOM PRENOM 3805","tel 99999999","99999999","Ok"]
["2014-01-21","NOM PRENOM 3806","TEL 99999999","99999999","Ok"]
["2014-01-21","NOM PRENOM 3807","CNI C9999.9999.99 DU 99/99/9999","","VIDE"]
["2014-01-21","NOM PRENOM 3808",null,"","VIDE"]
["2014-01-21","NOM PRENOM 3809","ATT 999-9999/99-99/PU9 DU 99/99/99 - TEL 99999999","99999999","Ok"]
["2014-01-21","NOM PRENOM 3810","CNI N° C9999999999 DU 99/99/9999","","VIDE"]
["2014-01-21","NOM PRENOM 3811","AI N°999999999999F/99-999 DU 99/99/9999 + PASS N°99AD99999 DU 99/99/99","","VIDE"]
["2014-01-21","NOM PRENOM 3812","CNI C9999999999 DU 99/99/9999 AU 99/99/9999 A SOUBRE","","VIDE"]
["2014-01-21","NOM PRENOM 3813","TEL.99.99.99.99","99999999","Ok"]
["2014-01-21","NOM PRENOM 3814","TEL:99-99-99-99","99999999","Ok"]
["2014-01-21","NOM PRENOM 3815","PASS IVOIR N 99AB99999 DU 99/99/99 AU 99/99/99","","VIDE"]
["2014-01-21","NOM PRENOM 3816","CNI C9999999999 DU 99/99/9999","","VIDE"]
["2014-01-21","NOM PRENOM 3817","PASS 99AA99999 AU 99.99.99","","VIDE"]
["2014-01-21","NOM PRENOM 3818","99 CARTE DE POLICE 99999/MEMI/DGPN DU 99/99/99","","VIDE"]
["2014-01-21","NOM PRENOM 3819","TEL 99.99.99.99","99999999","Ok"]
["2014-01-21","NOM PRENOM 3820","PASS B9999999 DU 99/99/9999 AU 99/99/9999","","VIDE"]
["2014-01-21","NOM PRENOM 3821","TEL:99-99-99-99","99999999","Ok"]
["2014-01-21","NOM PRENOM 3822","TEL 99999999","99999999","Ok"]
["2014-01-21","NOM PRENOM 3823","TEL 99.99.99.99","99999999","Ok"]
["2014-01-21","NOM PRENOM 3824","CNI C9999999999 DU 99/99/9999 AU 99/99/9999","","VIDE"]
["2014-01-21","NOM PRENOM 3825","CNI N9 999999999999 DU 99.99.9999","","VIDE"]
["2014-01-21","NOM PRENOM 3826","TEL 99999999","99999999","Ok"]
["2014-01-21","NOM PRENOM 3827","CNI N9 C 9999.9999.99 DU 99.99.9999","","VIDE"]
["2014-01-21","NOM PRENOM 3828","val 99/99/9999 cel 99999999/99999999",{"$f":"gettel(C3829)","v":"99999999/99999999"},"?"]
["2014-01-21","NOM PRENOM 3829",null,"","VIDE"]
["2014-01-21","NOM PRENOM 3830","TEL 99999999","99999999","Ok"]
["2014-01-21","NOM PRENOM 3831","CNI N9 C 9999.9999.99 DU 99.99.9999","","VIDE"]
["2014-01-21","NOM PRENOM 3832","CNI C 9999 9999 99 DU 99/99/9999 AU 99/99/9999","","VIDE"]
["2014-01-21","NOM PRENOM 3833","val 99/99/9999 cel 99999999","99999999","Ok"]
["2014-01-21","NOM PRENOM 3834","TEL 99999999","99999999","Ok"]
["2014-01-21","NOM PRENOM 3835","TEL 99999999","99999999","Ok"]
["2014-01-21","NOM PRENOM 3836","TEL 99999999","99999999","Ok"]
["2014-01-21","NOM PRENOM 3837","TEL99.99.99.99","99999999","Ok"]
["2014-01-21","NOM PRENOM 3838","TEL 99999999","99999999","Ok"]
["2014-01-21","NOM PRENOM 3839","val 99/99/9999 cel 99999999","99999999","Ok"]
["2014-01-21","NOM PRENOM 3840","DU 99.99.9999 ET ATT N°999-99999/99-99/MI/PU-99","","VIDE"]
["2014-01-21","NOM PRENOM 3841",null,"","VIDE"]
["2014-01-21","NOM PRENOM 3842","cni c 9999999999 du 99-99-99",{"$f":"gettel(C3843)","v":""},{"$f":"IF(LEN(D3843)=0,\"VIDE\",IF(LEN(D3843)=8,\"Ok\",\"?\"))","v":"VIDE"}]
["2014-01-21","NOM PRENOM 3843",null,"","VIDE"]
["2014-01-21","NOM PRENOM 3844","ATTES N 9999-99-99-9999-PUD DU 99/9/99 AU 99/9/99 + PC N 99-99-9999999","","VIDE"]
["2014-01-21","NOM PRENOM 3845","CNI C 9999999999 DU 99/9/99 AU 99/9/99","","VIDE"]
["2014-01-21","NOM PRENOM 3846","CEL 99999999","99999999","Ok"]
["2014-01-21","NOM PRENOM 3847",null,"","VIDE"]
["2014-01-21","NOM PRENOM 3848","cel 99999999","99999999","Ok"]
["2014-01-21","NOM PRENOM 3849",null,"","VIDE"]
["2014-01-21","NOM PRENOM 3850","CNI C 9999999999 DU 99/9/99 AU 99/9/99","","VIDE"]
["2014-01-21","NOM PRENOM 3851","CNI C9999999999 DU 99/99/9999","","VIDE"]
["2014-01-21","NOM PRENOM 3852","CNI C 9999999999 DU 99/9/99 AU 99/9/99","","VIDE"]
["2014-01-21","NOM PRENOM 3853","TEL 99999999","99999999","Ok"]
["2014-01-21","NOM PRENOM 3854","TEL 99.99.99.99","99999999","Ok"]
["2014-01-21","NOM PRENOM 3855","CNI C 9999999999 DU 99/9/99 AU 99/9/99","","VIDE"]
["2014-01-21","NOM PRENOM 3856","TEL.99999999","99999999","Ok"]
["2014-01-21","NOM PRENOM 3857","CEL:99999999","99999999","Ok"]
["2014-01-21","NOM PRENOM 3858","TEL 99999999","99999999","Ok"]
["2014-01-21","NOM PRENOM 3859","TEL.99.99.99.99","99999999","Ok"]
["2014-01-21","NOM PRENOM 3860","TEL 99.99.99.99","99999999","Ok"]
["2014-01-21","NOM PRENOM 3861","ATT N°999-999/99-99/MI/PU-99 AU 99/99/9999","","VIDE"]
["2014-01-21","NOM PRENOM 3862","CNI C9999.9999.99 DU 99.99.99","","VIDE"]
["2014-01-21","NOM PRENOM 3863","TEL 99999999","99999999","Ok"]
["2014-01-21","NOM PRENOM 3864","CNI C 9999999999 DU 99/99/9999 A ABJ","","VIDE"]
["2014-01-21","NOM PRENOM 3865","TEL 99999999","99999999","Ok"]
["2014-01-21","NOM PRENOM 3866",null,"","VIDE"]
["2014-01-21","NOM PRENOM 3867","CNI N 9C 9999.9999.99 DU 99.99.9999","","VIDE"]
["2014-01-21","NOM PRENOM 3868","CNI C 9999 9999 99 DU 99/99/9999 AU 99/99/9999","","VIDE"]
["2014-01-21","NOM PRENOM 3869","CNI N9 C 9999.9999.99 DU 99.99.9999","","VIDE"]
["2014-01-21","NOM PRENOM 3870",null,"","VIDE"]
["2014-01-21","NOM PRENOM 3871","VAL99/99/9999 CEL99999999","99999999","Ok"]
["2014-01-21","NOM PRENOM 3872","CNI C 9999999999 DU 99/99/99","","VIDE"]
["2014-01-21","NOM PRENOM 3873","CNI 999999999999","","VIDE"]
["2014-01-21","NOM PRENOM 3874","TEL 99.99.99.99","99999999","Ok"]
["2014-01-21","NOM PRENOM 3875",null,"","VIDE"]
["2014-01-21","NOM PRENOM 3876","ONI 999/99999/99-99/MEMIS/PU-99 DU 99/99/99","","VIDE"]
["2014-01-21","NOM PRENOM 3877",null,"","VIDE"]
["2014-01-21","NOM PRENOM 3878","CNI N9 C 9999.9999.99 DU 99.99.9999","","VIDE"]
["2014-01-21","NOM PRENOM 3879","CNI N9 C 9999.9999.99 DU 99.99.9999","","VIDE"]
["2014-01-21","NOM PRENOM 3880","DU 99/99/9999 AU 99/99/9999","","VIDE"]
["2014-01-21","NOM PRENOM 3881",null,"","VIDE"]
["2014-01-21","NOM PRENOM 3882","CNI C 9999999999 DU 99/99/9999 AU 99/99/9999 A ABJ","","VIDE"]
["2014-01-21","NOM PRENOM 3883","TEL.99.99.9999","99999999","Ok"]
["2014-01-21","NOM PRENOM 3884",null,"","VIDE"]
["2014-01-21","NOM PRENOM 3885",null,"","VIDE"]
["2014-01-21","NOM PRENOM 3886","TEL99.99.99.99","99999999","Ok"]
["2014-01-21","NOM PRENOM 3887","CNI C 9999999999 DU 99/99/9999 A DIEGO","","VIDE"]
["2014-01-21","NOM PRENOM 3888",null,"","VIDE"]
["2014-01-21","NOM PRENOM 3889","TEL 99999999","99999999","Ok"]
["2014-01-21","NOM PRENOM 3890","TEL 99.99.99.99","99999999","Ok"]
["2014-01-21","NOM PRENOM 3891","PC N°999999999999 DU 99/99/9999   + AI N°999-9999/99-99 DU 99/99/9999","","VIDE"]
["2014-01-21","NOM PRENOM 3892","TEL 99.99.99.99","99999999","Ok"]
["2014-01-21","NOM PRENOM 3893","DU 99/99/99 AU 99/99/99 PC N 99-99-99999999 DU 99/99/99","","VIDE"]
["2014-01-21","NOM PRENOM 3894","cel  99999999","99999999","Ok"]
["2014-01-21","NOM PRENOM 3895","TEL:99-99-99-99","99999999","Ok"]
["2014-01-21","NOM PRENOM 3896",null,"","VIDE"]
["2014-01-21","NOM PRENOM 3897",null,"","VIDE"]
["2014-01-21","NOM PRENOM 3898","val 99/99/9999 cel 99999999","99999999","Ok"]
["2014-01-21","NOM PRENOM 3899",null,"","VIDE"]
["2014-01-21","NOM PRENOM 3900","CNI C 9999999999 DU 99/9/99 AU 99/9/99","","VIDE"]
["2014-01-21","NOM PRENOM 3901","TEL:99-99-99-99","99999999","Ok"]
["2014-01-21","NOM PRENOM 3902",null,"","VIDE"]
["2014-01-21","NOM PRENOM 3903","CNI C 9999999999 DU 99-99-99","","VIDE"]
["2014-01-21","NOM PRENOM 3904","val 99/99/9999  pc n 99-99-99999999","","VIDE"]
["2014-01-21","NOM PRENOM 3905","TEL:99-99-99-99","99999999","Ok"]
["2014-01-21","NOM PRENOM 3906","CNI C9999999999 DU 99/9/99 AU 99/9/99",{"$f":"gettel(C3907)","v":""},{"$f":"IF(LEN(D3907)=0,\"VIDE\",IF(LEN(D3907)=8,\"Ok\",\"?\"))","v":"VIDE"}]
["2014-01-21","NOM PRENOM 3907","TEL 99.99.99.99","99999999","Ok"]
["2014-01-21","NOM PRENOM 3908","cel  99999999","99999999","Ok"]
["2014-01-21","NOM PRENOM 3909","CNI N9 C 9999.9999.99 DU 99.99.9999","","VIDE"]
["2014-01-21","NOM PRENOM 3910","val 99/99/9999 cel 99999999","99999999","Ok"]
["2014-01-21","NOM PRENOM 3911",null,"","VIDE"]
["2014-01-21","NOM PRENOM 3912","ATT N 999-9999/99-99/PU-99 DU 99/99/9999","","VIDE"]
["2014-01-21","NOM PRENOM 3913",null,"","VIDE"]
["2014-01-21","NOM PRENOM 3914","TEL 99999999","99999999","Ok"]
["2014-01-21","NOM PRENOM 3915","TEL:99-99-99-99","99999999","Ok"]
["2014-01-21","NOM PRENOM 3916",null,"","VIDE"]
["2014-01-21","NOM PRENOM 3917","TEL 99.99.99.99","99999999","Ok"]
["2014-01-21","NOM PRENOM 3918","CNI C 9999 9999 99 DU 99/99/9999 AU 99/99/9999","","VIDE"]
["2014-01-21","NOM PRENOM 3919","CNI C9999.9999.99 DU 99/99/9999","","VIDE"]
["2014-01-21","NOM PRENOM 3920","CNI C 9999999999 DU 99/9/99 AU 99/9/99","","VIDE"]
["2014-01-21","NOM PRENOM 3921",null,"","VIDE"]
["2014-01-21","NOM PRENOM 3922","PC N°99-99-99999999 DU 99.99.9999 ET","","VIDE"]
["2014-01-21","NOM PRENOM 3923",null,"","VIDE"]
["2014-01-21","NOM PRENOM 3924","TEL 99999999","99999999","Ok"]
["2014-01-21","NOM PRENOM 3925","DU 99.99.9999 ET PASS TEL 99.99.99.999",{"$f":"gettel(C3926)","v":"999999999"},"?"]
["2014-01-21","NOM PRENOM 3926",null,"","VIDE"]
["2014-01-21","NOM PRENOM 3927","cel 99999999","99999999","Ok"]
["2014-01-21","NOM PRENOM 3928","TEL 99999999","99999999","Ok"]
["2014-01-21","NOM PRENOM 3929","TEL 99999999","99999999","Ok"]
["2014-01-21","NOM PRENOM 3930",null,"","VIDE"]
["2014-01-21","NOM PRENOM 3931","TEL 99999999","99999999","Ok"]
["2014-01-21","NOM PRENOM 3932","passport n b9999999 val 99/99/9999","","VIDE"]
["2014-01-21","NOM PRENOM 3933","CNI C 9999999999 DU 99-99-99","","VIDE"]
["2014-01-21","NOM PRENOM 3934",null,"","VIDE"]
["2014-01-21","NOM PRENOM 3935",null,"","VIDE"]
["2014-01-21","NOM PRENOM 3936","DU 99/99/9999","","VIDE"]
["2014-01-21","NOM PRENOM 3937","CNI N9 C 9999.9999.99 DU 99.99.9999","","VIDE"]
["2014-01-21","NOM PRENOM 3938",99999999,"99999999","Ok"]
["2014-01-21","NOM PRENOM 3939",null,"","VIDE"]
["2014-01-21","NOM PRENOM 3940","CEL:99999999","99999999","Ok"]
["2014-01-21","NOM PRENOM 3941","cel 99999999","99999999","Ok"]
["2014-01-21","NOM PRENOM 3942","CNI C 9999999999 DU 99/99/99 AU 99/99/99","","VIDE"]
["2014-01-21","NOM PRENOM 3943","CONSUL 999999","","VIDE"]
["2014-01-21","NOM PRENOM 3944","MAMADOU DIALLO","","VIDE"]
["2014-01-21","NOM PRENOM 3945","CEL 99999999","99999999","Ok"]
["2014-01-21","NOM PRENOM 3946","TEL 99999999","99999999","Ok"]
["2014-01-21","NOM PRENOM 3947",null,"","VIDE"]
["2014-01-21","NOM PRENOM 3948",99999999,"99999999","Ok"]
["2014-01-21","NOM PRENOM 3949",99999999,"99999999","Ok"]
["2014-01-21","NOM PRENOM 3950","TEL:99-99-99-99","99999999","Ok"]
["2014-01-21","NOM PRENOM 3951",null,"","VIDE"]
["2014-01-21","NOM PRENOM 3952","SOGODOGO ABOUBACAR","","VIDE"]
["2014-01-21","NOM PRENOM 3953","amadou bamia","","VIDE"]
["2014-01-21","NOM PRENOM 3954","TEL 99999999","99999999","Ok"]
["2014-01-21","NOM PRENOM 3955","TEL 99999999","99999999","Ok"]
["2014-01-21","NOM PRENOM 3956","TEL:99-99-99-99","99999999","Ok"]
["2014-01-21","NOM PRENOM 3957",null,"","VIDE"]
["2014-01-21","NOM PRENOM 3958","TEL 99999999","99999999","Ok"]
["2014-01-21","NOM PRENOM 3959","CEL 99999999","99999999","Ok"]
["2014-01-21","NOM PRENOM 3960","TEL 99.99.99.99","99999999","Ok"]
["2014-01-21","NOM PRENOM 3961",null,"","VIDE"]
["2014-01-21","NOM PRENOM 3962","CEL 99999999","99999999","Ok"]
["2014-01-21","NOM PRENOM 3963","TEL 99999999","99999999","Ok"]
["2014-01-21","NOM PRENOM 3964","SOULEYMANE SOUNTOURA","","VIDE"]
["2014-01-21","NOM PRENOM 3965",null,"","VIDE"]
["2014-01-21","NOM PRENOM 3966",null,"","VIDE"]
["2014-01-21","NOM PRENOM 3967","TEL 99.99.99.99","99999999","Ok"]
["2014-01-21","NOM PRENOM 3968",null,"","VIDE"]
["2014-01-21","NOM PRENOM 3969","TEL 99.99.99.99","99999999","Ok"]
["2014-01-21","NOM PRENOM 3970","CNI C 9999999999 DU 99/99/99",{"$f":"gettel(C3971)","v":""},{"$f":"IF(LEN(D3971)=0,\"VIDE\",IF(LEN(D3971)=8,\"Ok\",\"?\"))","v":"VIDE"}]
["2014-01-21","NOM PRENOM 3971",null,"","VIDE"]
["2014-01-21","NOM PRENOM 3972",null,"","VIDE"]
["2014-01-21","NOM PRENOM 3973","CNI C 9999999999 DU 99/99/99","","VIDE"]
["2014-01-21","NOM PRENOM 3974","TEL:99-99-99-99","99999999","Ok"]
["2014-01-21","NOM PRENOM 3975","KANTE MAMADOU","","VIDE"]
["2014-01-21","NOM PRENOM 3976",null,"","VIDE"]
["2014-01-21","NOM PRENOM 3977",null,"","VIDE"]
["2014-01-22","NOM PRENOM 3978","CNI C9999999999 DU 99/99/9999","","VIDE"]
["2014-01-22","NOM PRENOM 3979","CNI C 9999999999","","VIDE"]
["2014-01-22","NOM PRENOM 3980",99999999,"99999999","Ok"]
["2014-01-22","NOM PRENOM 3981",null,"","VIDE"]
["2014-01-22","NOM PRENOM 3982","CP 99999","","VIDE"]
["2014-01-22","NOM PRENOM 3983",null,"","VIDE"]
["2014-01-22","NOM PRENOM 3984",null,"","VIDE"]
["2014-01-22","NOM PRENOM 3985",null,"","VIDE"]
["2014-01-22","NOM PRENOM 3986",null,"","VIDE"]
["2014-01-22","NOM PRENOM 3987","val 99/99/9999 cel 99999999","99999999","Ok"]
["2014-01-22","NOM PRENOM 3988","DU 99-99-9999 AU 99-99-9999","","VIDE"]
["2014-01-22","NOM PRENOM 3989","val 99/99/9999 cel 99999999","99999999","Ok"]
["2014-01-22","NOM PRENOM 3990","DU 99.99.99","","VIDE"]
["2014-01-22","NOM PRENOM 3991",null,"","VIDE"]
["2014-01-22","NOM PRENOM 3992",null,"","VIDE"]
["2014-01-22","NOM PRENOM 3993",99999999,"99999999","Ok"]
["2014-01-22","NOM PRENOM 3994","TEL:99-99-99-99","99999999","Ok"]
["2014-01-22","NOM PRENOM 3995",null,"","VIDE"]
["2014-01-22","NOM PRENOM 3996",null,"","VIDE"]
["2014-01-22","NOM PRENOM 3997",99999999,"99999999","Ok"]
["2014-01-22","NOM PRENOM 3998","CEL 99.99.99.99","99999999","Ok"]
["2014-01-22","NOM PRENOM 3999","TEL 99.99.99.99","99999999","Ok"]
["2014-01-22","NOM PRENOM 4000",null,"","VIDE"]
["2014-01-22","NOM PRENOM 4001","CIC MALI N 9999999/ABFA/99 DU 99/SEPT/99 AU 99/SEPT/9999","","VIDE"]
["2014-01-22","NOM PRENOM 4002","TEL 99.99.99.99","99999999","Ok"]
["2014-01-22","NOM PRENOM 4003","CNI C 9999999999 DU 99/99/9999","","VIDE"]
["2014-01-22","NOM PRENOM 4004",null,"","VIDE"]
["2014-01-22","NOM PRENOM 4005","AU 99/99/9999","","VIDE"]
["2014-01-22","NOM PRENOM 4006","TEL 99999999","99999999","Ok"]
["2014-01-22","NOM PRENOM 4007",null,"","VIDE"]
["2014-01-22","NOM PRENOM 4008","DU 99/99/9999","","VIDE"]
["2014-01-22","NOM PRENOM 4009","CEL 99999999","99999999","Ok"]
["2014-01-22","NOM PRENOM 4010",99999999,"99999999","Ok"]
["2014-01-22","NOM PRENOM 4011","TEL 99999999","99999999","Ok"]
["2014-01-22","NOM PRENOM 4012","CNI N 9C 9999.9999.99 DU 99.99.9999","","VIDE"]
["2014-01-22","NOM PRENOM 4013",null,"","VIDE"]
["2014-01-22","NOM PRENOM 4014","TEL 99999999","99999999","Ok"]
["2014-01-22","NOM PRENOM 4015","TEL 99999999","99999999","Ok"]
["2014-01-22","NOM PRENOM 4016","du 99/99/9999 au 99/99/9999","","VIDE"]
["2014-01-22","NOM PRENOM 4017","CEL 99999999","99999999","Ok"]
["2014-01-22","NOM PRENOM 4018","DU 99/99/9999 AU 99/99/9999","","VIDE"]
["2014-01-22","NOM PRENOM 4019","TEL 99.99.99.99","99999999","Ok"]
["2014-01-22","NOM PRENOM 4020","CNI C 9999999999 DU 99/9/99 AU 99/9/99","","VIDE"]
["2014-01-22","NOM PRENOM 4021","TEL 99999999","99999999","Ok"]
["2014-01-22","NOM PRENOM 4022","TEL 99999999","99999999","Ok"]
["2014-01-22","NOM PRENOM 4023","TEL 99999999","99999999","Ok"]
["2014-01-22","NOM PRENOM 4024","99.99.9999 ET PERMIS DE CONDUIRE N°99-99-99999999 DELIVRE LE","","VIDE"]
["2014-01-22","NOM PRENOM 4025","val 99/99/9999 cel 99999999","99999999","Ok"]
["2014-01-22","NOM PRENOM 4026","TEL 99.99.99.99","99999999","Ok"]
["2014-01-22","NOM PRENOM 4027","CNI N°999999999999 DU 99/99/9999","","VIDE"]
["2014-01-22","NOM PRENOM 4028","CNI N9 C 9999.9999.99 DU 99.99.9999","","VIDE"]
["2014-01-22","NOM PRENOM 4029","CNI C 9999999999 DU 99/99/9999","","VIDE"]
["2014-01-22","NOM PRENOM 4030","TPS 9999999/99-9999/MI/ONI/DIE/99 DU 99/99/99","","VIDE"]
["2014-01-22","NOM PRENOM 4031","CNI C 9999 9999 99 DU 99/99/9999 AU 99/99/9999","","VIDE"]
["2014-01-22","NOM PRENOM 4032","CNI C9999999999 DU 99/99/9999 AU 99/99/9999","","VIDE"]
["2014-01-22","NOM PRENOM 4033","CNI N° C9999 9999 99 DU 99/99/9999 AU 99/99/9999","","VIDE"]
["2014-01-22","NOM PRENOM 4034","CNI C9999.9999.99 DU 99.99.99",{"$f":"gettel(C4035)","v":""},{"$f":"IF(LEN(D4035)=0,\"VIDE\",IF(LEN(D4035)=8,\"Ok\",\"?\"))","v":"VIDE"}]
["2014-01-22","NOM PRENOM 4035","AU 99/99/99 CEL 99999999","99999999","Ok"]
["2014-01-22","NOM PRENOM 4036","CNI C9999999999 DU 99/99/9999 AU 99/99/9999","","VIDE"]
["2014-01-22","NOM PRENOM 4037",null,"","VIDE"]
["2014-01-22","NOM PRENOM 4038",99999999,"99999999","Ok"]
["2014-01-22","NOM PRENOM 4039",99999999,"99999999","Ok"]
["2014-01-22","NOM PRENOM 4040",null,"","VIDE"]
["2014-01-22","NOM PRENOM 4041","CNI C9999999999 DU 99/99/9999 AU 99/99/9999","","VIDE"]
["2014-01-22","NOM PRENOM 4042",null,"","VIDE"]
["2014-01-22","NOM PRENOM 4043","CEL 99999999","99999999","Ok"]
["2014-01-22","NOM PRENOM 4044",99999999,"99999999","Ok"]
["2014-01-22","NOM PRENOM 4045","CEL:99999999","99999999","Ok"]
["2014-01-22","NOM PRENOM 4046","cel 99999999","99999999","Ok"]
["2014-01-22","NOM PRENOM 4047","CNI  C9999 9999 99 DU 99/99/9999 AU 99/99/9999","","VIDE"]
["2014-01-22","NOM PRENOM 4048","cel 99999999","99999999","Ok"]
["2014-01-22","NOM PRENOM 4049","TEL 99.99.99.99","99999999","Ok"]
["2014-01-22","NOM PRENOM 4050","CNI C9999999999 DU 99/99/9999 AU 99/99/9999","","VIDE"]
["2014-01-22","NOM PRENOM 4051",null,"","VIDE"]
["2014-01-22","NOM PRENOM 4052",null,"","VIDE"]
["2014-01-22","NOM PRENOM 4053",null,"","VIDE"]
["2014-01-22","NOM PRENOM 4054","TEL 99.99.99.99","99999999","Ok"]
["2014-01-22","NOM PRENOM 4055","TEL 99999999","99999999","Ok"]
["2014-01-22","NOM PRENOM 4056",null,"","VIDE"]
["2014-01-22","NOM PRENOM 4057","TEL 99999999","99999999","Ok"]
["2014-01-22","NOM PRENOM 4058",null,"","VIDE"]
["2014-01-22","NOM PRENOM 4059","val 99/99/9999 cel 99999999","99999999","Ok"]
["2014-01-22","NOM PRENOM 4060","TEL:99-99-99-99","99999999","Ok"]
["2014-01-22","NOM PRENOM 4061","CEL:99999999","99999999","Ok"]
["2014-01-22","NOM PRENOM 4062","DU 99/99/9999 AU 99/99/9999","","VIDE"]
["2014-01-22","NOM PRENOM 4063","TEL 99999999","99999999","Ok"]
["2014-01-22","NOM PRENOM 4064","TEL 99999999","99999999","Ok"]
["2014-01-22","NOM PRENOM 4065","TEL:99-99-99-99","99999999","Ok"]
["2014-01-22","NOM PRENOM 4066","CEL 99999999","99999999","Ok"]
["2014-01-22","NOM PRENOM 4067","+PC N 99-99-99999999 DU 99/99/9999 A SOUBRE","","VIDE"]
["2014-01-22","NOM PRENOM 4068","TEL 99999999","99999999","Ok"]
["2014-01-22","NOM PRENOM 4069","CNI C 9999999999 DU 99/9/99 AU 99/9/99","","VIDE"]
["2014-01-22","NOM PRENOM 4070","val 99/99/9999 cel 99999999","99999999","Ok"]
["2014-01-22","NOM PRENOM 4071","ZEHIA CNI C9999.9999.99 DU 99.99.99","","VIDE"]
["2014-01-22","NOM PRENOM 4072","CNI N9 C 9999.9999.99 DU 99.99.9999","","VIDE"]
["2014-01-22","NOM PRENOM 4073","TEL 99999999","99999999","Ok"]
["2014-01-22","NOM PRENOM 4074","DU 99.99.99","","VIDE"]
["2014-01-22","NOM PRENOM 4075","TEL:99-99-99-99","99999999","Ok"]
["2014-01-22","NOM PRENOM 4076","CNI N9 9999.9999.99 DU 99.99.9999","","VIDE"]
["2014-01-22","NOM PRENOM 4077","TEL 99.99.99.99","99999999","Ok"]
["2014-01-22","NOM PRENOM 4078","TEL 99999999","99999999","Ok"]
["2014-01-22","NOM PRENOM 4079","TEL 99.99.99.99","99999999","Ok"]
["2014-01-22","NOM PRENOM 4080",null,"","VIDE"]
["2014-01-22","NOM PRENOM 4081",null,"","VIDE"]
["2014-01-22","NOM PRENOM 4082",null,"","VIDE"]
["2014-01-22","NOM PRENOM 4083","TEL 99999999","99999999","Ok"]
["2014-01-22","NOM PRENOM 4084",null,"","VIDE"]
["2014-01-22","NOM PRENOM 4085",null,"","VIDE"]
["2014-01-22","NOM PRENOM 4086","VAL 99/99/9999 CEL 99999999","99999999","Ok"]
["2014-01-22","NOM PRENOM 4087",null,"","VIDE"]
["2014-01-22","NOM PRENOM 4088","ATTEST 9999/99-99/PU-OUME PASSPORT 99AD99999","","VIDE"]
["2014-01-22","NOM PRENOM 4089","CNI C 9999999999 DU 99-99-99","","VIDE"]
["2014-01-22","NOM PRENOM 4090","TEL 99999999","99999999","Ok"]
["2014-01-22","NOM PRENOM 4091","CNI C9999999999 DU 99/99/9999","","VIDE"]
["2014-01-22","NOM PRENOM 4092","CEL 99999999","99999999","Ok"]
["2014-01-22","NOM PRENOM 4093","CNI C 9999999999","","VIDE"]
["2014-01-22","NOM PRENOM 4094","PC N°99.99.99999999 DU 99.99.99","","VIDE"]
["2014-01-22","NOM PRENOM 4095","CNI N9 C 9999.9999.99 DU 99.99.9999","","VIDE"]
["2014-01-22","NOM PRENOM 4096","AU 99/99/9999","","VIDE"]
["2014-01-22","NOM PRENOM 4097",null,"","VIDE"]
["2014-01-22","NOM PRENOM 4098",null,{"$f":"gettel(C4099)","v":""},{"$f":"IF(LEN(D4099)=0,\"VIDE\",IF(LEN(D4099)=8,\"Ok\",\"?\"))","v":"VIDE"}]
["2014-01-22","NOM PRENOM 4099",null,"","VIDE"]
["2014-01-22","NOM PRENOM 4100","CNI N° C9999999999 DU 99/99/9999","","VIDE"]
["2014-01-22","NOM PRENOM 4101","TEL 99999999","99999999","Ok"]
["2014-01-22","NOM PRENOM 4102","CNI 999999999999 DU 99/99/9999 AU 99/99/9999","","VIDE"]
["2014-01-22","NOM PRENOM 4103","TEL 99999999","99999999","Ok"]
["2014-01-22","NOM PRENOM 4104","CNI C9999.9999.99 DU 99/99/9999","","VIDE"]
["2014-01-22","NOM PRENOM 4105","TEL 99999999","99999999","Ok"]
["2014-01-22","NOM PRENOM 4106","99 CEL 99999999/99999999",{"$f":"gettel(C4107)","v":"99999999/99999999"},"?"]
["2014-01-22","NOM PRENOM 4107","TEL 99999999","99999999","Ok"]
["2014-01-22","NOM PRENOM 4108","val 99/99/9999 cel 99999999","99999999","Ok"]
["2014-01-22","NOM PRENOM 4109",null,"","VIDE"]
["2014-01-22","NOM PRENOM 4110","TEL 99999999","99999999","Ok"]
["2014-01-22","NOM PRENOM 4111","CNI C 9999999999 DU 99/99/99","","VIDE"]
["2014-01-22","NOM PRENOM 4112",null,"","VIDE"]
["2014-01-22","NOM PRENOM 4113",null,"","VIDE"]
["2014-01-22","NOM PRENOM 4114",null,"","VIDE"]
["2014-01-22","NOM PRENOM 4115","TEL:99-99-99-99","99999999","Ok"]
["2014-01-22","NOM PRENOM 4116","CEL 99999999","99999999","Ok"]
["2014-01-22","NOM PRENOM 4117","CNI N9 C 9999.9999.99 DU 99.99.9999","","VIDE"]
["2014-01-22","NOM PRENOM 4118","TEL 99999999","99999999","Ok"]
["2014-01-22","NOM PRENOM 4119","TEL 99.99.99.99","99999999","Ok"]
["2014-01-22","NOM PRENOM 4120","CONSUL BF 9999999","","VIDE"]
["2014-01-22","NOM PRENOM 4121","CNI C 9999999999 DU 99 99 9999 AU 99 99 9999","","VIDE"]
["2014-01-22","NOM PRENOM 4122","CNI C 9999999999 DU 99/9/99 AU 99/9/99","","VIDE"]
["2014-01-22","NOM PRENOM 4123","TEL 99.99.99.99","99999999","Ok"]
["2014-01-22","NOM PRENOM 4124",null,"","VIDE"]
["2014-01-22","NOM PRENOM 4125",null,"","VIDE"]
["2014-01-22","NOM PRENOM 4126","CEL 99999999","99999999","Ok"]
["2014-01-22","NOM PRENOM 4127","TEL 99.99.99.99","99999999","Ok"]
["2014-01-22","NOM PRENOM 4128",null,"","VIDE"]
["2014-01-22","NOM PRENOM 4129","CEL 99.99.99.99","99999999","Ok"]
["2014-01-22","NOM PRENOM 4130","CNI C 9999999999 DU 99 99 9999 AU 99 99 9999","","VIDE"]
["2014-01-22","NOM PRENOM 4131","DU 99/99/9999 AU 99/99/9999","","VIDE"]
["2014-01-22","NOM PRENOM 4132",null,"","VIDE"]
["2014-01-22","NOM PRENOM 4133","CIC GUINEE N AB/99999/AGCI/99/99 DU 99/99/9999+CARTE AMICALE RESSOR","","VIDE"]
["2014-01-22","NOM PRENOM 4134","C9999.9999.99 DU 99.99.99","","VIDE"]
["2014-01-22","NOM PRENOM 4135","TEL 99999999","99999999","Ok"]
["2014-01-22","NOM PRENOM 4136","val 99/99/9999","","VIDE"]
["2014-01-22","NOM PRENOM 4137","TEL:99-99-99-99","99999999","Ok"]
["2014-01-22","NOM PRENOM 4138","TEL 999999999",{"$f":"gettel(C4139)","v":"999999999"},"?"]
["2014-01-22","NOM PRENOM 4139","DU 99-99-9999 AU 99-99-9999","","VIDE"]
["2014-01-22","NOM PRENOM 4140","val 99/99/9999 cel 99999999","99999999","Ok"]
["2014-01-22","NOM PRENOM 4141","TEL 99999999","99999999","Ok"]
["2014-01-22","NOM PRENOM 4142","CNI C9999999999 DU 99/99/9999 AU 99/99/9999","","VIDE"]
["2014-01-22","NOM PRENOM 4143","CEL:99999999","99999999","Ok"]
["2014-01-22","NOM PRENOM 4144",null,"","VIDE"]
["2014-01-22","NOM PRENOM 4145","TEL 99999999","99999999","Ok"]
["2014-01-22","NOM PRENOM 4146","CEL99999999","99999999","Ok"]
["2014-01-22","NOM PRENOM 4147","CEL 99.99.99.99","99999999","Ok"]
["2014-01-22","NOM PRENOM 4148","CEL99999999","99999999","Ok"]
["2014-01-22","NOM PRENOM 4149","CNI C9999999999 DU 99/99/9999 AU 99/99/9999","","VIDE"]
["2014-01-22","NOM PRENOM 4150","PASSBFA A9999999 DU 99/99/9999","","VIDE"]
["2014-01-22","NOM PRENOM 4151",null,"","VIDE"]
["2014-01-22","NOM PRENOM 4152","TEL 99.99.99.99","99999999","Ok"]
["2014-01-22","NOM PRENOM 4153","TEL 99.99.99.99","99999999","Ok"]
["2014-01-22","NOM PRENOM 4154",null,"","VIDE"]
["2014-01-22","NOM PRENOM 4155",null,"","VIDE"]
["2014-01-22","NOM PRENOM 4156",null,"","VIDE"]
["2014-01-22","NOM PRENOM 4157","CNI NN9 9999.9999.99 DU 99.99.9999","","VIDE"]
["2014-01-22","NOM PRENOM 4158","CEL 99999999","99999999","Ok"]
["2014-01-22","NOM PRENOM 4159","PASS BENIN N B9999999 DU 99/9/99 AU 99/9/99","","VIDE"]
["2014-01-22","NOM PRENOM 4160","TEL 99999999","99999999","Ok"]
["2014-01-22","NOM PRENOM 4161","TEL 99999999","99999999","Ok"]
["2014-01-22","NOM PRENOM 4162","C9999.9999.99 DU 99.99.99",{"$f":"gettel(C4163)","v":""},{"$f":"IF(LEN(D4163)=0,\"VIDE\",IF(LEN(D4163)=8,\"Ok\",\"?\"))","v":"VIDE"}]
["2014-01-22","NOM PRENOM 4163","CNI N9 C9999.9999.99 DU 99.99.9999","","VIDE"]
["2014-01-22","NOM PRENOM 4164","CIC MLI 9999999.CGMA.CI DU 99/99/9999 AU 99/99/9999 A ABJ","","VIDE"]
["2014-01-22","NOM PRENOM 4165","VAL99/99/9999 CEL99999999","99999999","Ok"]
["2014-01-22","NOM PRENOM 4166","TEL 99.99.99.99","99999999","Ok"]
["2014-01-22","NOM PRENOM 4167","TEL 99.99.99.99","99999999","Ok"]
["2014-01-22","NOM PRENOM 4168","TEL:99-99-99-99","99999999","Ok"]
["2014-01-22","NOM PRENOM 4169","TEL 99999999","99999999","Ok"]
["2014-01-22","NOM PRENOM 4170","TEL 99999999","99999999","Ok"]
["2014-01-22","NOM PRENOM 4171","ZONGO JONAS","","VIDE"]
["2014-01-22","NOM PRENOM 4172","TEL 99999999","99999999","Ok"]
["2014-01-22","NOM PRENOM 4173",null,"","VIDE"]
["2014-01-22","NOM PRENOM 4174","TEL 99.99.99.99","99999999","Ok"]
["2014-01-22","NOM PRENOM 4175",null,"","VIDE"]
["2014-01-22","NOM PRENOM 4176","TEL 99999999","99999999","Ok"]
["2014-01-22","NOM PRENOM 4177",null,"","VIDE"]
["2014-01-22","NOM PRENOM 4178",null,"","VIDE"]
["2014-01-22","NOM PRENOM 4179",null,"","VIDE"]
["2014-01-22","NOM PRENOM 4180",99999999,"99999999","Ok"]
["2014-01-22","NOM PRENOM 4181","CNI N9 C 9999.9999.99 DU 99.99.99.99","","VIDE"]
["2014-01-22","NOM PRENOM 4182","BANDAOGO HAMADO","","VIDE"]
["2014-01-22","NOM PRENOM 4183","TEL 99.99.99.99","99999999","Ok"]
["2014-01-22","NOM PRENOM 4184",null,"","VIDE"]
["2014-01-22","NOM PRENOM 4185",null,"","VIDE"]
["2014-01-22","NOM PRENOM 4186","PASS N°EB999999 DU 99/99/9999","","VIDE"]
["2014-01-22","NOM PRENOM 4187",null,"","VIDE"]
["2014-01-22","NOM PRENOM 4188","TEL:99-99-99-99","99999999","Ok"]
["2014-01-22","NOM PRENOM 4189",null,"","VIDE"]
["2014-01-22","NOM PRENOM 4190",null,"","VIDE"]
["2014-01-22","NOM PRENOM 4191","TEL 99999999","99999999","Ok"]
["2014-01-22","NOM PRENOM 4192",null,"","VIDE"]
["2014-01-22","NOM PRENOM 4193",null,"","VIDE"]
["2014-01-22","NOM PRENOM 4194","BAMOGO NESTOR","","VIDE"]
["2014-01-22","NOM PRENOM 4195","etablie le 99/99/9999 cel 99999999","99999999","Ok"]
["2014-01-22","NOM PRENOM 4196","PC N 99-99-99999999 DU 99/99/99","","VIDE"]
["2014-01-22","NOM PRENOM 4197",null,"","VIDE"]
["2014-01-22","NOM PRENOM 4198","TEL 99999999","99999999","Ok"]
["2014-01-22","NOM PRENOM 4199",null,"","VIDE"]
["2014-01-22","NOM PRENOM 4200","TEL:99-99-99-99","99999999","Ok"]
["2014-01-22","NOM PRENOM 4201","TEL 99.99.99.99","99999999","Ok"]
["2014-01-22","NOM PRENOM 4202","VAL 99/99/9999 CEL 99999999","99999999","Ok"]
["2014-01-22","NOM PRENOM 4203","TEL 99999999","99999999","Ok"]
["2014-01-22","NOM PRENOM 4204","CIC BENIN N 999/99 DU 99/99/99 AU 99/99/99","","VIDE"]
["2014-01-22","NOM PRENOM 4205","sangare zoumana","","VIDE"]
["2014-01-22","NOM PRENOM 4206",99999999,"99999999","Ok"]
["2014-01-22","NOM PRENOM 4207","TEL:99-99-99-99","99999999","Ok"]
["2014-01-22","NOM PRENOM 4208",null,"","VIDE"]
["2014-01-22","NOM PRENOM 4209",null,"","VIDE"]
["2014-01-22","NOM PRENOM 4210","TEL 99999999","99999999","Ok"]
["2014-01-22","NOM PRENOM 4211","CNI BURKINA N° 99999999999999999 DU 99/99/999","","VIDE"]
["2014-01-22","NOM PRENOM 4212",null,"","VIDE"]
["2014-01-23","NOM PRENOM 4213",null,"","VIDE"]
["2014-01-23","NOM PRENOM 4214","TEL 99.99.99.99","99999999","Ok"]
["2014-01-23","NOM PRENOM 4215","TEL:99-99-99-99","99999999","Ok"]
["2014-01-23","NOM PRENOM 4216",null,"","VIDE"]
["2014-01-23","NOM PRENOM 4217","CNI C 9999999999 DU 99/9/99 AU 99/9/99","","VIDE"]
["2014-01-23","NOM PRENOM 4218","TEL 99999999","99999999","Ok"]
["2014-01-23","NOM PRENOM 4219","CNI N 9C 9999.99.99.99 DU 99.99.9999","","VIDE"]
["2014-01-23","NOM PRENOM 4220",null,"","VIDE"]
["2014-01-23","NOM PRENOM 4221","CNI C9999999999 DU 99/99/9999 AU 99/99/9999 A MAN","","VIDE"]
["2014-01-23","NOM PRENOM 4222","CNI C 9999999999 DU 99/99/99 AU 99/9/99","","VIDE"]
["2014-01-23","NOM PRENOM 4223","CNI N9 C 9999.9999.99 DU 99.99.9999 DIVO","","VIDE"]
["2014-01-23","NOM PRENOM 4224","EN FAVEUR DE AGNERO LORNG BENJAMIN CNI","","VIDE"]
["2014-01-23","NOM PRENOM 4225","CNI N° C 9999999999 DU 99/99/9999 AU 99/99/9999","","VIDE"]
["2014-01-23","NOM PRENOM 4226","CEL 99.99.99.99",{"$f":"gettel(C4227)","v":"99999999"},{"$f":"IF(LEN(D4227)=0,\"VIDE\",IF(LEN(D4227)=8,\"Ok\",\"?\"))","v":"Ok"}]
["2014-01-23","NOM PRENOM 4227",null,"","VIDE"]
["2014-01-23","NOM PRENOM 4228","cni c 9999999999 du 99-99-99","","VIDE"]
["2014-01-23","NOM PRENOM 4229","CNI C9999.9999.99 DU 99/99/9999","","VIDE"]
["2014-01-23","NOM PRENOM 4230",null,"","VIDE"]
["2014-01-23","NOM PRENOM 4231","VAL 99/99/9999  CEL 99999999","99999999","Ok"]
["2014-01-23","NOM PRENOM 4232","TEL 99.99.99.99","99999999","Ok"]
["2014-01-23","NOM PRENOM 4233","TEL 99999999","99999999","Ok"]
["2014-01-23","NOM PRENOM 4234",null,"","VIDE"]
["2014-01-23","NOM PRENOM 4235","CEL:99999999","99999999","Ok"]
["2014-01-23","NOM PRENOM 4236","TEL 99999999","99999999","Ok"]
["2014-01-23","NOM PRENOM 4237",null,"","VIDE"]
["2014-01-23","NOM PRENOM 4238","TEL 99999999","99999999","Ok"]
["2014-01-23","NOM PRENOM 4239",null,"","VIDE"]
["2014-01-23","NOM PRENOM 4240","CNI C9999.9999.99 DU 99/99/9999","","VIDE"]
["2014-01-23","NOM PRENOM 4241","TEL 99999999","99999999","Ok"]
["2014-01-23","NOM PRENOM 4242","TEL 99999999","99999999","Ok"]
["2014-01-23","NOM PRENOM 4243","CEL 99999999","99999999","Ok"]
["2014-01-23","NOM PRENOM 4244",null,"","VIDE"]
["2014-01-23","NOM PRENOM 4245","CNI C 9999999999 DU 99/9/99 AU 99/9/99","","VIDE"]
["2014-01-23","NOM PRENOM 4246",null,"","VIDE"]
["2014-01-23","NOM PRENOM 4247","TEL 99.99.99.99","99999999","Ok"]
["2014-01-23","NOM PRENOM 4248","DU 99/99/99 AU 99/99/99","","VIDE"]
["2014-01-23","NOM PRENOM 4249","TEL 99999999","99999999","Ok"]
["2014-01-23","NOM PRENOM 4250","TEL 99.99.99.99","99999999","Ok"]
["2014-01-23","NOM PRENOM 4251",null,"","VIDE"]
["2014-01-23","NOM PRENOM 4252","CEL 99999999","99999999","Ok"]
["2014-01-23","NOM PRENOM 4253",null,"","VIDE"]
["2014-01-23","NOM PRENOM 4254","TEL 99999999","99999999","Ok"]
["2014-01-23","NOM PRENOM 4255","AU 99/99/9999","","VIDE"]
["2014-01-23","NOM PRENOM 4256","CEL 99999999","99999999","Ok"]
["2014-01-23","NOM PRENOM 4257","CELL 99999999","99999999","Ok"]
["2014-01-23","NOM PRENOM 4258","TEL 99.99.99.99","99999999","Ok"]
["2014-01-23","NOM PRENOM 4259","CNI C9999.9999.99 DU 99/99/9999","","VIDE"]
["2014-01-23","NOM PRENOM 4260",99999999,"99999999","Ok"]
["2014-01-23","NOM PRENOM 4261","val 99/99/9999 passport n a9999999 val 99/99/9999","","VIDE"]
["2014-01-23","NOM PRENOM 4262","TEL 99999999","99999999","Ok"]
["2014-01-23","NOM PRENOM 4263","val 99/99/9999 cel 99999999","99999999","Ok"]
["2014-01-23","NOM PRENOM 4264","TEL 99999999","99999999","Ok"]
["2014-01-23","NOM PRENOM 4265","CNI C9999999999 DU 99/99/9999 AU 99/99/9999","","VIDE"]
["2014-01-23","NOM PRENOM 4266","TEL 99999999","99999999","Ok"]
["2014-01-23","NOM PRENOM 4267","PASS 999999999 DU 99/99/9999 AU 99/99/9999","","VIDE"]
["2014-01-23","NOM PRENOM 4268","TEL 99.99.99.99","99999999","Ok"]
["2014-01-23","NOM PRENOM 4269","CNI C9999999999 DU 99/99/9999 AU 99/99/9999","","VIDE"]
["2014-01-23","NOM PRENOM 4270","ATT N 999-99999.99-99.PU-99 DU 99/99/99 AU 99/99/99","","VIDE"]
["2014-01-23","NOM PRENOM 4271","TEL 99.99.99.99","99999999","Ok"]
["2014-01-23","NOM PRENOM 4272","TEL 99999999","99999999","Ok"]
["2014-01-23","NOM PRENOM 4273","C9999.9999.99 DU 99.99.99","","VIDE"]
["2014-01-23","NOM PRENOM 4274","CNI C9999999999 DU 99/99/9999 A MEAGUI","","VIDE"]
["2014-01-23","NOM PRENOM 4275",null,"","VIDE"]
["2014-01-23","NOM PRENOM 4276","CNI C 9999999999 DU 99/99/99 AU 99/99/99","","VIDE"]
["2014-01-23","NOM PRENOM 4277","CIC NIGER N°9999/99/CCN DU 99/99/9999","","VIDE"]
["2014-01-23","NOM PRENOM 4278","TEL 99999999","99999999","Ok"]
["2014-01-23","NOM PRENOM 4279","TEL 99.99.99.99","99999999","Ok"]
["2014-01-23","NOM PRENOM 4280",99999999,"99999999","Ok"]
["2014-01-23","NOM PRENOM 4281","CIC BF 9999999/ABFA/9999 DU 99/99/9999 AU 99/99/9999 A SOUBRE","","VIDE"]
["2014-01-23","NOM PRENOM 4282","CEL:99999999","99999999","Ok"]
["2014-01-23","NOM PRENOM 4283",null,"","VIDE"]
["2014-01-23","NOM PRENOM 4284","TEL:99-99-99-99","99999999","Ok"]
["2014-01-23","NOM PRENOM 4285","CNI C 9999999999 DU 99/99/9999","","VIDE"]
["2014-01-23","NOM PRENOM 4286","TEL:99-99-99-99","99999999","Ok"]
["2014-01-23","NOM PRENOM 4287","TEL 99.99.99.99","99999999","Ok"]
["2014-01-23","NOM PRENOM 4288","CEL 99.99.99.99","99999999","Ok"]
["2014-01-23","NOM PRENOM 4289","TEL 99.99.99.99","99999999","Ok"]
["2014-01-23","NOM PRENOM 4290",null,{"$f":"gettel(C4291)","v":""},{"$f":"IF(LEN(D4291)=0,\"VIDE\",IF(LEN(D4291)=8,\"Ok\",\"?\"))","v":"VIDE"}]
["2014-01-23","NOM PRENOM 4291",null,"","VIDE"]
["2014-01-23","NOM PRENOM 4292","TEL:99-99-99-99","99999999","Ok"]
["2014-01-23","NOM PRENOM 4293",null,"","VIDE"]
["2014-01-23","NOM PRENOM 4294","CNI N° C9999 9999 99 DU 99/99/9999 AU 99/99/9999","","VIDE"]
["2014-01-23","NOM PRENOM 4295","CNI N9 999999999999 DU 99.99.9999","","VIDE"]
["2014-01-23","NOM PRENOM 4296","VAL99/99/9999+PASSPORT N°E9999999 VAL99/99/9999","","VIDE"]
["2014-01-23","NOM PRENOM 4297",null,"","VIDE"]
["2014-01-23","NOM PRENOM 4298","CNI C 9999999999 DU 99/99/9999 AU 99/99/9999 A SONGON","","VIDE"]
["2014-01-23","NOM PRENOM 4299",null,"","VIDE"]
["2014-01-23","NOM PRENOM 4300",null,"","VIDE"]
["2014-01-23","NOM PRENOM 4301",null,"","VIDE"]
["2014-01-23","NOM PRENOM 4302",99999999,"99999999","Ok"]
["2014-01-23","NOM PRENOM 4303",null,"","VIDE"]
["2014-01-23","NOM PRENOM 4304","TEL 99.99.99.99","99999999","Ok"]
["2014-01-23","NOM PRENOM 4305","CEL:99999999","99999999","Ok"]
["2014-01-23","NOM PRENOM 4306","CNI C9999999999 DU 99/99/9999 AU 99/99/9999 A ABJ","","VIDE"]
["2014-01-23","NOM PRENOM 4307",null,"","VIDE"]
["2014-01-23","NOM PRENOM 4308","TEL 99999999","99999999","Ok"]
["2014-01-23","NOM PRENOM 4309","CNI C 9999999999 DU 99/99/9999","","VIDE"]
["2014-01-23","NOM PRENOM 4310","CNI C9999999999 DU 99/99/9999 AU 99/99/9999 A MEAGUI","","VIDE"]
["2014-01-23","NOM PRENOM 4311","CNI N° C9999999999 DU 99/99/9999","","VIDE"]
["2014-01-23","NOM PRENOM 4312","TEL 99999999","99999999","Ok"]
["2014-01-23","NOM PRENOM 4313","TEL 99999999","99999999","Ok"]
["2014-01-23","NOM PRENOM 4314",null,"","VIDE"]
["2014-01-23","NOM PRENOM 4315",null,"","VIDE"]
["2014-01-23","NOM PRENOM 4316","CNI C9999.9999.99 DU 99/99/9999","","VIDE"]
["2014-01-23","NOM PRENOM 4317",null,"","VIDE"]
["2014-01-23","NOM PRENOM 4318",99999999,"99999999","Ok"]
["2014-01-23","NOM PRENOM 4319","TEL 99999999","99999999","Ok"]
["2014-01-23","NOM PRENOM 4320","PAULINE/ITALIE","","VIDE"]
["2014-01-23","NOM PRENOM 4321","CNI N9 C 9999.9999.99 DU 99.99.9999","","VIDE"]
["2014-01-23","NOM PRENOM 4322",null,"","VIDE"]
["2014-01-23","NOM PRENOM 4323","CNI C9999999999 DU 99/99/9999 AU 99/99/9999","","VIDE"]
["2014-01-23","NOM PRENOM 4324","DU 99/99/9999 CE INPHB N° 99INP99999 DE 9999-9999","","VIDE"]
["2014-01-23","NOM PRENOM 4325","CNI C9999999999 DU 99/99/9999 AU 99/99/9999","","VIDE"]
["2014-01-23","NOM PRENOM 4326","TEL 99999999","99999999","Ok"]
["2014-01-23","NOM PRENOM 4327","CNI C9999999999 DU 99/99/9999 AU 99/99/9999","","VIDE"]
["2014-01-23","NOM PRENOM 4328","TEL 99.99.99.99","99999999","Ok"]
["2014-01-23","NOM PRENOM 4329","TEL 99.99.99.99","99999999","Ok"]
["2014-01-23","NOM PRENOM 4330",null,"","VIDE"]
["2014-01-23","NOM PRENOM 4331","CNI C9999999999 DU 99/99/9999 AU 99/99/9999","","VIDE"]
["2014-01-23","NOM PRENOM 4332","AU 99/99/99","","VIDE"]
["2014-01-23","NOM PRENOM 4333","TEL 99.99.99.99","99999999","Ok"]
["2014-01-23","NOM PRENOM 4334","CEL 99.99.99.99","99999999","Ok"]
["2014-01-23","NOM PRENOM 4335",null,"","VIDE"]
["2014-01-23","NOM PRENOM 4336",null,"","VIDE"]
["2014-01-23","NOM PRENOM 4337","TEL 99.99.99.99","99999999","Ok"]
["2014-01-23","NOM PRENOM 4338","cni c 9999 9999 99 val 99/99/9999","","VIDE"]
["2014-01-23","NOM PRENOM 4339","CNI C9999.9999.99 DU 99/99/9999","","VIDE"]
["2014-01-23","NOM PRENOM 4340","CEL 99999999","99999999","Ok"]
["2014-01-23","NOM PRENOM 4341","tel  99.99.99.99","99999999","Ok"]
["2014-01-23","NOM PRENOM 4342","TEL 99999999","99999999","Ok"]
["2014-01-23","NOM PRENOM 4343",null,"","VIDE"]
["2014-01-23","NOM PRENOM 4344","CNI C 99999999 99 DU 99/99/99 AU 99/99/99","","VIDE"]
["2014-01-23","NOM PRENOM 4345","CNI N° C 9999999999 DU 99/99/9999 AU 99/99/9999","","VIDE"]
["2014-01-23","NOM PRENOM 4346",null,"","VIDE"]
["2014-01-23","NOM PRENOM 4347","VAL 99/99/9999 PC N 99-99-99999999","","VIDE"]
["2014-01-23","NOM PRENOM 4348","TEL 99.99.99.99","99999999","Ok"]
["2014-01-23","NOM PRENOM 4349",null,"","VIDE"]
["2014-01-23","NOM PRENOM 4350","CEL 99999999","99999999","Ok"]
["2014-01-23","NOM PRENOM 4351",null,"","VIDE"]
["2014-01-23","NOM PRENOM 4352",null,"","VIDE"]
["2014-01-23","NOM PRENOM 4353",null,"","VIDE"]
["2014-01-23","NOM PRENOM 4354","TEL 99.99.99.99",{"$f":"gettel(C4355)","v":"99999999"},{"$f":"IF(LEN(D4355)=0,\"VIDE\",IF(LEN(D4355)=8,\"Ok\",\"?\"))","v":"Ok"}]
["2014-01-23","NOM PRENOM 4355",null,"","VIDE"]
["2014-01-23","NOM PRENOM 4356","CNI C 9999999999 DU 99/9/99 AU 99/9/99","","VIDE"]
["2014-01-23","NOM PRENOM 4357","CNI C 9999999999 DU 99/99/99","","VIDE"]
["2014-01-23","NOM PRENOM 4358","CNI N9 C 9999.9999.99 DU 99.99.9999","","VIDE"]
["2014-01-23","NOM PRENOM 4359","TEL 99.99.99.99","99999999","Ok"]
["2014-01-23","NOM PRENOM 4360","CNI N° C9999 9999 99 DU 99/99/9999 AU 99/99/9999","","VIDE"]
["2014-01-23","NOM PRENOM 4361","TEL 99999999","99999999","Ok"]
["2014-01-23","NOM PRENOM 4362","CNI C9999999999 DU 99/99/99","","VIDE"]
["2014-01-23","NOM PRENOM 4363",null,"","VIDE"]
["2014-01-23","NOM PRENOM 4364","CEL 99999999","99999999","Ok"]
["2014-01-23","NOM PRENOM 4365","val 99/99/9999 cel 99999999","99999999","Ok"]
["2014-01-23","NOM PRENOM 4366",null,"","VIDE"]
["2014-01-23","NOM PRENOM 4367","TEL:99-99-99-99","99999999","Ok"]
["2014-01-23","NOM PRENOM 4368",null,"","VIDE"]
["2014-01-23","NOM PRENOM 4369","CEL 99999999","99999999","Ok"]
["2014-01-23","NOM PRENOM 4370",null,"","VIDE"]
["2014-01-23","NOM PRENOM 4371","TEL 99999999","99999999","Ok"]
["2014-01-23","NOM PRENOM 4372",null,"","VIDE"]
["2014-01-23","NOM PRENOM 4373",null,"","VIDE"]
["2014-01-23","NOM PRENOM 4374","CEL 99999999","99999999","Ok"]
["2014-01-23","NOM PRENOM 4375","TEL 99.99.99.99","99999999","Ok"]
["2014-01-23","NOM PRENOM 4376",null,"","VIDE"]
["2014-01-23","NOM PRENOM 4377","val 99/99/9999 cel 99999999","99999999","Ok"]
["2014-01-23","NOM PRENOM 4378",null,"","VIDE"]
["2014-01-23","NOM PRENOM 4379","TEL:99-99-99-99","99999999","Ok"]
["2014-01-23","NOM PRENOM 4380","TEL 99.99.99.99","99999999","Ok"]
["2014-01-23","NOM PRENOM 4381","CEL 99999999","99999999","Ok"]
["2014-01-23","NOM PRENOM 4382","CEL 99.99.99.99","99999999","Ok"]
["2014-01-23","NOM PRENOM 4383","CNI C9999999999 DU 99.99.9999","","VIDE"]
["2014-01-23","NOM PRENOM 4384","TEL 99.99.99.99","99999999","Ok"]
["2014-01-23","NOM PRENOM 4385","CNI C9999999999 DU 99.99.9999","","VIDE"]
["2014-01-23","NOM PRENOM 4386","VAL99/99/9999 CEL99999999","99999999","Ok"]
["2014-01-23","NOM PRENOM 4387","CNI C 9999999999 DU 99/99/99 AU 99/99/99","","VIDE"]
["2014-01-23","NOM PRENOM 4388",null,"","VIDE"]
["2014-01-23","NOM PRENOM 4389",null,"","VIDE"]
["2014-01-23","NOM PRENOM 4390",null,"","VIDE"]
["2014-01-23","NOM PRENOM 4391",null,"","VIDE"]
["2014-01-23","NOM PRENOM 4392","TEL 99999999","99999999","Ok"]
["2014-01-23","NOM PRENOM 4393","CEL 99999999","99999999","Ok"]
["2014-01-23","NOM PRENOM 4394","TEL 99999999","99999999","Ok"]
["2014-01-23","NOM PRENOM 4395",null,"","VIDE"]
["2014-01-23","NOM PRENOM 4396",null,"","VIDE"]
["2014-01-23","NOM PRENOM 4397",null,"","VIDE"]
["2014-01-23","NOM PRENOM 4398",null,"","VIDE"]
["2014-01-23","NOM PRENOM 4399","TEL 99999999","99999999","Ok"]
["2014-01-23","NOM PRENOM 4400",null,"","VIDE"]
["2014-01-23","NOM PRENOM 4401","TEL 99.99.99.99","99999999","Ok"]
["2014-01-23","NOM PRENOM 4402",null,"","VIDE"]
["2014-01-23","NOM PRENOM 4403",null,"","VIDE"]
["2014-01-23","NOM PRENOM 4404",null,"","VIDE"]
["2014-01-23","NOM PRENOM 4405",null,"","VIDE"]
["2014-01-23","NOM PRENOM 4406","TEL 99999999","99999999","Ok"]
["2014-01-23","NOM PRENOM 4407","TEL 99999999","99999999","Ok"]
["2014-01-23","NOM PRENOM 4408",null,"","VIDE"]
["2014-01-23","NOM PRENOM 4409",null,"","VIDE"]
["2014-01-23","NOM PRENOM 4410","TEL 99999999","99999999","Ok"]
["2014-01-23","NOM PRENOM 4411","SENEGAL TEL 99999999","99999999","Ok"]
["2014-01-23","NOM PRENOM 4412","TEL 99999999","99999999","Ok"]
["2014-01-23","NOM PRENOM 4413","TEL 99999999","99999999","Ok"]
["2014-01-23","NOM PRENOM 4414","CNI C 9999999999 DU 99/99/99","","VIDE"]
["2014-01-23","NOM PRENOM 4415",null,"","VIDE"]
["2014-01-23","NOM PRENOM 4416","TEL 99999999","99999999","Ok"]
["2014-01-23","NOM PRENOM 4417",null,"","VIDE"]
["2014-01-23","NOM PRENOM 4418",null,{"$f":"gettel(C4419)","v":""},{"$f":"IF(LEN(D4419)=0,\"VIDE\",IF(LEN(D4419)=8,\"Ok\",\"?\"))","v":"VIDE"}]
["2014-01-23","NOM PRENOM 4419","TEL 99999999","99999999","Ok"]
["2014-01-23","NOM PRENOM 4420",null,"","VIDE"]
["2014-01-23","NOM PRENOM 4421",null,"","VIDE"]
["2014-01-23","NOM PRENOM 4422","KONE LACINA","","VIDE"]
["2014-01-23","NOM PRENOM 4423",null,"","VIDE"]
["2014-01-23","NOM PRENOM 4424",null,"","VIDE"]
["2014-01-23","NOM PRENOM 4425",null,"","VIDE"]
["2014-01-23","NOM PRENOM 4426","TEL 99999999","99999999","Ok"]
["2014-01-23","NOM PRENOM 4427","TEL 99999999","99999999","Ok"]
["2014-01-23","NOM PRENOM 4428","CNI N9 C 9999.9999.99 DU 99.99.9999","","VIDE"]
["2014-01-23","NOM PRENOM 4429","TEL 99999999","99999999","Ok"]
["2014-01-23","NOM PRENOM 4430","MALI","","VIDE"]
["2014-01-23","NOM PRENOM 4431","TEL 99999999","99999999","Ok"]
["2014-01-23","NOM PRENOM 4432","TEL 99999999","99999999","Ok"]
["2014-01-23","NOM PRENOM 4433","TEL 99999999","99999999","Ok"]
["2014-01-24","NOM PRENOM 4434","MLE 9999","","VIDE"]
["2014-01-24","NOM PRENOM 4435","TEL 99999999","99999999","Ok"]
["2014-01-24","NOM PRENOM 4436","CNI C9999999999 DU 99/99/9999 AU 99/99/9999 A SOUBRE","","VIDE"]
["2014-01-24","NOM PRENOM 4437",null,"","VIDE"]
["2014-01-24","NOM PRENOM 4438","CNI C 9999999999","","VIDE"]
["2014-01-24","NOM PRENOM 4439","CEL 99999999","99999999","Ok"]
["2014-01-24","NOM PRENOM 4440",null,"","VIDE"]
["2014-01-24","NOM PRENOM 4441","TEL 99999999","99999999","Ok"]
["2014-01-24","NOM PRENOM 4442","TEL 99.99.99.99","99999999","Ok"]
["2014-01-24","NOM PRENOM 4443",null,"","VIDE"]
["2014-01-24","NOM PRENOM 4444","CE:99999999","","VIDE"]
["2014-01-24","NOM PRENOM 4445","CELL 99999999","99999999","Ok"]
["2014-01-24","NOM PRENOM 4446",99999999,"99999999","Ok"]
["2014-01-24","NOM PRENOM 4447","TEL 99999999","99999999","Ok"]
["2014-01-24","NOM PRENOM 4448",null,"","VIDE"]
["2014-01-24","NOM PRENOM 4449","CNI C 9999999999 DU 99/99/9999 AU 99/99/9999 A ABJ","","VIDE"]
["2014-01-24","NOM PRENOM 4450","TEL 99999999","99999999","Ok"]
["2014-01-24","NOM PRENOM 4451","CNI C 9999999999 DU 99/9/99 AU 99/9/99","","VIDE"]
["2014-01-24","NOM PRENOM 4452","TEL 99999999","99999999","Ok"]
["2014-01-24","NOM PRENOM 4453","CNI C9999.9999.99 DU 99/99/9999","","VIDE"]
["2014-01-24","NOM PRENOM 4454","TEL 99.99.99.99","99999999","Ok"]
["2014-01-24","NOM PRENOM 4455","TEL 99999999","99999999","Ok"]
["2014-01-24","NOM PRENOM 4456","cel 99999999","99999999","Ok"]
["2014-01-24","NOM PRENOM 4457","PASS N° 99AD99999 DU 99/99/9999 AU 99/99/9999","","VIDE"]
["2014-01-24","NOM PRENOM 4458","TEL 99999999","99999999","Ok"]
["2014-01-24","NOM PRENOM 4459","TEL 99.99.99.99","99999999","Ok"]
["2014-01-24","NOM PRENOM 4460","TPS N°9999999/99-9999 DU 99/99/9999 + CNI CMR N°999999999 DU 99/99/99","","VIDE"]
["2014-01-24","NOM PRENOM 4461",null,"","VIDE"]
["2014-01-24","NOM PRENOM 4462","CNI N° C9999 9999 99 DU 99/99/9999 AU 99/99/9999","","VIDE"]
["2014-01-24","NOM PRENOM 4463","cel 99999999","99999999","Ok"]
["2014-01-24","NOM PRENOM 4464","CEL 99999999","99999999","Ok"]
["2014-01-24","NOM PRENOM 4465","TEL 99999999","99999999","Ok"]
["2014-01-24","NOM PRENOM 4466","TEL 99.99.99.99","99999999","Ok"]
["2014-01-24","NOM PRENOM 4467","CNI C9999.9999.99 DU 99.99.99","","VIDE"]
["2014-01-24","NOM PRENOM 4468",null,"","VIDE"]
["2014-01-24","NOM PRENOM 4469","TEL 99999999","99999999","Ok"]
["2014-01-24","NOM PRENOM 4470","CNI C 9999999999 DU 99/99/99 AU 99/99/99","","VIDE"]
["2014-01-24","NOM PRENOM 4471","TEL 99.99.99.99","99999999","Ok"]
["2014-01-24","NOM PRENOM 4472",null,"","VIDE"]
["2014-01-24","NOM PRENOM 4473","+ PC INTNLE","","VIDE"]
["2014-01-24","NOM PRENOM 4474","cel 99999999","99999999","Ok"]
["2014-01-24","NOM PRENOM 4475","TEL 99.99.99.99","99999999","Ok"]
["2014-01-24","NOM PRENOM 4476",null,"","VIDE"]
["2014-01-24","NOM PRENOM 4477","CNI C9999999999 DU 99/99/9999","","VIDE"]
["2014-01-24","NOM PRENOM 4478",null,"","VIDE"]
["2014-01-24","NOM PRENOM 4479","CNI C 9999999999 DU 99/99/99 AU 99/99/99","","VIDE"]
["2014-01-24","NOM PRENOM 4480","tel 99.99.99.99","99999999","Ok"]
["2014-01-24","NOM PRENOM 4481","CNI C9999999999 DU 99/99/9999 AU 99/99/9999","","VIDE"]
["2014-01-24","NOM PRENOM 4482","val 99/99/9999 cel 99999999",{"$f":"gettel(C4483)","v":"99999999"},{"$f":"IF(LEN(D4483)=0,\"VIDE\",IF(LEN(D4483)=8,\"Ok\",\"?\"))","v":"Ok"}]
["2014-01-24","NOM PRENOM 4483","VAL99/99/9999 CEL99999999","99999999","Ok"]
["2014-01-24","NOM PRENOM 4484","CEL 99999999","99999999","Ok"]
["2014-01-24","NOM PRENOM 4485","CNI C 9999 9999 99 DU 99/99/9999 AU 99/99/9999","","VIDE"]
["2014-01-24","NOM PRENOM 4486",null,"","VIDE"]
["2014-01-24","NOM PRENOM 4487","DU 99/99/9999","","VIDE"]
["2014-01-24","NOM PRENOM 4488","ATT 9999999/99/99/MEMI DU 99.99.9999","","VIDE"]
["2014-01-24","NOM PRENOM 4489","CNI C 9999 9999 99 DU 99/99/9999 AU 99/99/9999","","VIDE"]
["2014-01-24","NOM PRENOM 4490","CNI C9999999999 DU 99/99/9999","","VIDE"]
["2014-01-24","NOM PRENOM 4491",null,"","VIDE"]
["2014-01-24","NOM PRENOM 4492",null,"","VIDE"]
["2014-01-24","NOM PRENOM 4493",null,"","VIDE"]
["2014-01-24","NOM PRENOM 4494","CNI C9999.9999.99 DU 99/99/9999","","VIDE"]
["2014-01-24","NOM PRENOM 4495","C9999.9999.99 DU 99.99.99","","VIDE"]
["2014-01-24","NOM PRENOM 4496","CEL 99999999","99999999","Ok"]
["2014-01-24","NOM PRENOM 4497","TEL 99999999","99999999","Ok"]
["2014-01-24","NOM PRENOM 4498",null,"","VIDE"]
["2014-01-24","NOM PRENOM 4499","TEL 99999999","99999999","Ok"]
["2014-01-24","NOM PRENOM 4500","CNI C9999999999 DU 99/99/9999","","VIDE"]
["2014-01-24","NOM PRENOM 4501","DU 99-99-9999 AU 99-99-9999","","VIDE"]
["2014-01-24","NOM PRENOM 4502","TEL 99999999","99999999","Ok"]
["2014-01-24","NOM PRENOM 4503","CNI C 9999999999 DU 99-99-99","","VIDE"]
["2014-01-24","NOM PRENOM 4504",null,"","VIDE"]
["2014-01-24","NOM PRENOM 4505","TEL 99999999","99999999","Ok"]
["2014-01-24","NOM PRENOM 4506","CNI C 9999999999 DU 99/99/9999","","VIDE"]
["2014-01-24","NOM PRENOM 4507","TEL 99999999","99999999","Ok"]
["2014-01-24","NOM PRENOM 4508","99.99.99 AU 99.99.99","","VIDE"]
["2014-01-24","NOM PRENOM 4509","TEL 99.99.99.99","99999999","Ok"]
["2014-01-24","NOM PRENOM 4510",null,"","VIDE"]
["2014-01-24","NOM PRENOM 4511","tel 99999999","99999999","Ok"]
["2014-01-24","NOM PRENOM 4512",null,"","VIDE"]
["2014-01-24","NOM PRENOM 4513","CNI C 9999999999 DU 99/99/9999 AU 99/99/9999 A ABJ","","VIDE"]
["2014-01-24","NOM PRENOM 4514","CNI C9999.9999.99 DU 99/99/9999","","VIDE"]
["2014-01-24","NOM PRENOM 4515","TEL 99999999//99999999",{"$f":"gettel(C4516)","v":"99999999/99999999"},"?"]
["2014-01-24","NOM PRENOM 4516","ET PASSEPORT N°99AB99999 VALABLE AU 99.99.9999","","VIDE"]
["2014-01-24","NOM PRENOM 4517","CNI C 9999999999 DU 99/9/99 AU 99/9/99","","VIDE"]
["2014-01-24","NOM PRENOM 4518","CNI C 9999999999 DU 99/99/9999 AU 99/99/9999 A BOOKO","","VIDE"]
["2014-01-24","NOM PRENOM 4519","9999 99 DU 99.99.99 AU 99.99.99","","VIDE"]
["2014-01-24","NOM PRENOM 4520","TEL 99999999","99999999","Ok"]
["2014-01-24","NOM PRENOM 4521","CNI C 9999999999","","VIDE"]
["2014-01-24","NOM PRENOM 4522",null,"","VIDE"]
["2014-01-24","NOM PRENOM 4523","TEL 99999999","99999999","Ok"]
["2014-01-24","NOM PRENOM 4524",null,"","VIDE"]
["2014-01-24","NOM PRENOM 4525",99999999,"99999999","Ok"]
["2014-01-24","NOM PRENOM 4526","TEL 99999999","99999999","Ok"]
["2014-01-24","NOM PRENOM 4527",null,"","VIDE"]
["2014-01-24","NOM PRENOM 4528",null,"","VIDE"]
["2014-01-24","NOM PRENOM 4529","TEL 99.99.99.99","99999999","Ok"]
["2014-01-24","NOM PRENOM 4530","TEL 99.99.99.99","99999999","Ok"]
["2014-01-24","NOM PRENOM 4531",99999999,"99999999","Ok"]
["2014-01-24","NOM PRENOM 4532","CELL 99999999","99999999","Ok"]
["2014-01-24","NOM PRENOM 4533",null,"","VIDE"]
["2014-01-24","NOM PRENOM 4534",null,"","VIDE"]
["2014-01-24","NOM PRENOM 4535","TEL 99999999","99999999","Ok"]
["2014-01-24","NOM PRENOM 4536","TEL 99999999/99999999",{"$f":"gettel(C4537)","v":"99999999/99999999"},"?"]
["2014-01-24","NOM PRENOM 4537","TEL 99999999","99999999","Ok"]
["2014-01-24","NOM PRENOM 4538","DU 99.99.9999 ET ATT N°999/999/99/99/PU-I","","VIDE"]
["2014-01-24","NOM PRENOM 4539","CNI C 9999999999 DU 99/99/9999","","VIDE"]
["2014-01-24","NOM PRENOM 4540","CNI C9999.9999.99 DU 99/99/9999","","VIDE"]
["2014-01-24","NOM PRENOM 4541","CEL 99999999","99999999","Ok"]
["2014-01-24","NOM PRENOM 4542","CNI N9 C 9999.9999.99 DU 99.99.9999","","VIDE"]
["2014-01-24","NOM PRENOM 4543","DU 99-99-9999 AU 99-99-9999","","VIDE"]
["2014-01-24","NOM PRENOM 4544","TEL 99999999","99999999","Ok"]
["2014-01-24","NOM PRENOM 4545",null,"","VIDE"]
["2014-01-24","NOM PRENOM 4546","TEL 99.99.99.99",{"$f":"gettel(C4547)","v":"99999999"},{"$f":"IF(LEN(D4547)=0,\"VIDE\",IF(LEN(D4547)=8,\"Ok\",\"?\"))","v":"Ok"}]
["2014-01-24","NOM PRENOM 4547","TEL 99.99.99.99","99999999","Ok"]
["2014-01-24","NOM PRENOM 4548","cni 9999999999 a boussoue du 99 99 9999","","VIDE"]
["2014-01-24","NOM PRENOM 4549",null,"","VIDE"]
["2014-01-24","NOM PRENOM 4550",null,"","VIDE"]
["2014-01-24","NOM PRENOM 4551","TEL 99999999","99999999","Ok"]
["2014-01-24","NOM PRENOM 4552",null,"","VIDE"]
["2014-01-24","NOM PRENOM 4553","TEL 99999999","99999999","Ok"]
["2014-01-24","NOM PRENOM 4554","CNI C 9999 9999 99 DU 99/99/9999 AU 99/99/9999","","VIDE"]
["2014-01-24","NOM PRENOM 4555","+CN ITALIA N 9999999 DU 99/99/9999 A PARMA","","VIDE"]
["2014-01-24","NOM PRENOM 4556",null,"","VIDE"]
["2014-01-24","NOM PRENOM 4557","CNI N9 C 9999.9999.99 DU 99.99.9999","","VIDE"]
["2014-01-24","NOM PRENOM 4558","TEL 99999999","99999999","Ok"]
["2014-01-24","NOM PRENOM 4559","CNI C 9999999999 DU 99/99/99","","VIDE"]
["2014-01-24","NOM PRENOM 4560","** CNI N9 C 9999.9999.99 DU 99.99.9999 ** PASSEPORT N9 99AA99999","","VIDE"]
["2014-01-24","NOM PRENOM 4561","TEL 99.99.99.99","99999999","Ok"]
["2014-01-24","NOM PRENOM 4562","TEL 99999999","99999999","Ok"]
["2014-01-24","NOM PRENOM 4563",null,"","VIDE"]
["2014-01-24","NOM PRENOM 4564","CNI C9999.9999.99 DU 99.99.99","","VIDE"]
["2014-01-24","NOM PRENOM 4565",null,"","VIDE"]
["2014-01-24","NOM PRENOM 4566","CEL 99999999","99999999","Ok"]
["2014-01-24","NOM PRENOM 4567","CNI N 9C 9999.9999.99 DU 99.99.9999","","VIDE"]
["2014-01-24","NOM PRENOM 4568",null,"","VIDE"]
["2014-01-24","NOM PRENOM 4569","DU 99/99/9999","","VIDE"]
["2014-01-24","NOM PRENOM 4570","TEL 99.99.99.99","99999999","Ok"]
["2014-01-24","NOM PRENOM 4571","DU 99.99.99","","VIDE"]
["2014-01-24","NOM PRENOM 4572",null,"","VIDE"]
["2014-01-24","NOM PRENOM 4573","TEL 99.99.99.99","99999999","Ok"]
["2014-01-24","NOM PRENOM 4574","CNI N 9C 9999.9999.99 DU 99.99.9999","","VIDE"]
["2014-01-24","NOM PRENOM 4575","TEL 99.99.99.99","99999999","Ok"]
["2014-01-24","NOM PRENOM 4576",null,"","VIDE"]
["2014-01-24","NOM PRENOM 4577",null,"","VIDE"]
["2014-01-24","NOM PRENOM 4578","TEL 99.99.99.99","99999999","Ok"]
["2014-01-24","NOM PRENOM 4579",null,"","VIDE"]
["2014-01-24","NOM PRENOM 4580","CEL 99999999","99999999","Ok"]
["2014-01-24","NOM PRENOM 4581",null,"","VIDE"]
["2014-01-24","NOM PRENOM 4582","TEL 99999999","99999999","Ok"]
["2014-01-24","NOM PRENOM 4583",null,"","VIDE"]
["2014-01-24","NOM PRENOM 4584","TEL 99999999","99999999","Ok"]
["2014-01-24","NOM PRENOM 4585","TEL 99999999","99999999","Ok"]
["2014-01-24","NOM PRENOM 4586","CEL:99999999","99999999","Ok"]
["2014-01-24","NOM PRENOM 4587",null,"","VIDE"]
["2014-01-24","NOM PRENOM 4588",null,"","VIDE"]
["2014-01-24","NOM PRENOM 4589","val 99/99/9999 cel 99999999","99999999","Ok"]
["2014-01-24","NOM PRENOM 4590","TEL 99.99.99.99","99999999","Ok"]
["2014-01-24","NOM PRENOM 4591",null,"","VIDE"]
["2014-01-24","NOM PRENOM 4592","tel 99999999","99999999","Ok"]
["2014-01-24","NOM PRENOM 4593","TEL 99999999","99999999","Ok"]
["2014-01-24","NOM PRENOM 4594",null,"","VIDE"]
["2014-01-24","NOM PRENOM 4595","CEL 99999999","99999999","Ok"]
["2014-01-24","NOM PRENOM 4596",99999999,"99999999","Ok"]
["2014-01-24","NOM PRENOM 4597","TEL 99999999","99999999","Ok"]
["2014-01-24","NOM PRENOM 4598","TEL 99999999","99999999","Ok"]
["2014-01-24","NOM PRENOM 4599",null,"","VIDE"]
["2014-01-24","NOM PRENOM 4600",null,"","VIDE"]
["2014-01-24","NOM PRENOM 4601",null,"","VIDE"]
["2014-01-24","NOM PRENOM 4602",null,"","VIDE"]
["2014-01-24","NOM PRENOM 4603",null,"","VIDE"]
["2014-01-24","NOM PRENOM 4604","TEL 99999999","99999999","Ok"]
["2014-01-24","NOM PRENOM 4605",null,"","VIDE"]
["2014-01-24","NOM PRENOM 4606",null,"","VIDE"]
["2014-01-24","NOM PRENOM 4607",null,"","VIDE"]
["2014-01-24","NOM PRENOM 4608",null,"","VIDE"]
["2014-01-24","NOM PRENOM 4609",null,"","VIDE"]
["2014-01-24","NOM PRENOM 4610",null,{"$f":"gettel(C4611)","v":""},{"$f":"IF(LEN(D4611)=0,\"VIDE\",IF(LEN(D4611)=8,\"Ok\",\"?\"))","v":"VIDE"}]
["2014-01-24","NOM PRENOM 4611",null,"","VIDE"]
["2014-01-24","NOM PRENOM 4612",null,"","VIDE"]
["2014-01-24","NOM PRENOM 4613",null,"","VIDE"]
["2014-01-24","NOM PRENOM 4614",null,"","VIDE"]
["2014-01-27","NOM PRENOM 4615","TEL 99.99.99.99","99999999","Ok"]
["2014-01-27","NOM PRENOM 4616","TEL:99-99-99-99","99999999","Ok"]
["2014-01-27","NOM PRENOM 4617","TEL:99-99-99-99","99999999","Ok"]
["2014-01-27","NOM PRENOM 4618","TEL 99999999","99999999","Ok"]
["2014-01-27","NOM PRENOM 4619","CNI C9999999999 DU 99.99.9999","","VIDE"]
["2014-01-27","NOM PRENOM 4620","CNI C9999999999 DU 99.99.9999","","VIDE"]
["2014-01-27","NOM PRENOM 4621","CNI C9999999999 DU 99/99/99","","VIDE"]
["2014-01-27","NOM PRENOM 4622",null,"","VIDE"]
["2014-01-27","NOM PRENOM 4623","MLE 9999","","VIDE"]
["2014-01-27","NOM PRENOM 4624","9999.9999.99 DU 99.99.99","","VIDE"]
["2014-01-27","NOM PRENOM 4625",null,"","VIDE"]
["2014-01-27","NOM PRENOM 4626","TEL 99.99.99",{"$f":"gettel(C4627)","v":"999999"},"?"]
["2014-01-27","NOM PRENOM 4627","CNI C 9999999999 DU 99/99/99 AU 99/99/99µ","","VIDE"]
["2014-01-27","NOM PRENOM 4628",null,"","VIDE"]
["2014-01-27","NOM PRENOM 4629",null,"","VIDE"]
["2014-01-27","NOM PRENOM 4630","TEL 99.99.99.99","99999999","Ok"]
["2014-01-27","NOM PRENOM 4631","du 99/99/9999 et pc 999999999999 du permanent","","VIDE"]
["2014-01-27","NOM PRENOM 4632","TEL 99.99.99.99","99999999","Ok"]
["2014-01-27","NOM PRENOM 4633","CNI C 9999999999 DU 99/99/99 AU 99/99/99","","VIDE"]
["2014-01-27","NOM PRENOM 4634",null,"","VIDE"]
["2014-01-27","NOM PRENOM 4635","TEL 99999999","99999999","Ok"]
["2014-01-27","NOM PRENOM 4636","CEL 99999999","99999999","Ok"]
["2014-01-27","NOM PRENOM 4637",null,"","VIDE"]
["2014-01-27","NOM PRENOM 4638",null,"","VIDE"]
["2014-01-27","NOM PRENOM 4639","TEL 99999999","99999999","Ok"]
["2014-01-27","NOM PRENOM 4640","TEL 99999999","99999999","Ok"]
["2014-01-27","NOM PRENOM 4641","TEL99999999","99999999","Ok"]
["2014-01-27","NOM PRENOM 4642",null,"","VIDE"]
["2014-01-27","NOM PRENOM 4643","TEL 99.99.99.99","99999999","Ok"]
["2014-01-27","NOM PRENOM 4644","TEL 99999999","99999999","Ok"]
["2014-01-27","NOM PRENOM 4645","CEL 99999999","99999999","Ok"]
["2014-01-27","NOM PRENOM 4646",null,"","VIDE"]
["2014-01-27","NOM PRENOM 4647",null,"","VIDE"]
["2014-01-27","NOM PRENOM 4648","val 99/99/9999 cni du congo pn9999kw9w9cq","","VIDE"]
["2014-01-27","NOM PRENOM 4649","DU 99/99/9999 AU 99/99/9999","","VIDE"]
["2014-01-27","NOM PRENOM 4650",99999999,"99999999","Ok"]
["2014-01-27","NOM PRENOM 4651",99999999,"99999999","Ok"]
["2014-01-27","NOM PRENOM 4652",null,"","VIDE"]
["2014-01-27","NOM PRENOM 4653","CNI C9999.9999.99 DU 99/99/9999","","VIDE"]
["2014-01-27","NOM PRENOM 4654","DU 99/99/9999 AU 99/99/9999","","VIDE"]
["2014-01-27","NOM PRENOM 4655","CNI C 9999999999 DU 99/99/99","","VIDE"]
["2014-01-27","NOM PRENOM 4656","TEL 99999999","99999999","Ok"]
["2014-01-27","NOM PRENOM 4657","val 99/99/9999 cel 99999999","99999999","Ok"]
["2014-01-27","NOM PRENOM 4658","TEL 99.99.99.99","99999999","Ok"]
["2014-01-27","NOM PRENOM 4659","TEL 99999999","99999999","Ok"]
["2014-01-27","NOM PRENOM 4660","TEL 99.99.99.99","99999999","Ok"]
["2014-01-27","NOM PRENOM 4661","TEL 99999999","99999999","Ok"]
["2014-01-27","NOM PRENOM 4662","TEL 99.99.99.99","99999999","Ok"]
["2014-01-27","NOM PRENOM 4663","val 99/99/9999","","VIDE"]
["2014-01-27","NOM PRENOM 4664","cel 99999999","99999999","Ok"]
["2014-01-27","NOM PRENOM 4665","CNI  C 9999999999 DU 99/9/99 AU 99/9/99","","VIDE"]
["2014-01-27","NOM PRENOM 4666","TEL 99999999","99999999","Ok"]
["2014-01-27","NOM PRENOM 4667","CNI C 9999999999  DU 99/99/9999 AU 99/99/9999 A ABJ","","VIDE"]
["2014-01-27","NOM PRENOM 4668","CNI N° C9999 9999 99 DU 99/99/9999 AU 99/99/9999","","VIDE"]
["2014-01-27","NOM PRENOM 4669","du 99/99/9999 au 99/99/9999","","VIDE"]
["2014-01-27","NOM PRENOM 4670",null,"","VIDE"]
["2014-01-27","NOM PRENOM 4671","TEL 99.99.99.99","99999999","Ok"]
["2014-01-27","NOM PRENOM 4672","ATT N° 999.9999/99.99/PU.99 AU 99/99/9999","","VIDE"]
["2014-01-27","NOM PRENOM 4673",null,"","VIDE"]
["2014-01-27","NOM PRENOM 4674",null,{"$f":"gettel(C4675)","v":""},{"$f":"IF(LEN(D4675)=0,\"VIDE\",IF(LEN(D4675)=8,\"Ok\",\"?\"))","v":"VIDE"}]
["2014-01-27","NOM PRENOM 4675","TEL 99.99.99.99","99999999","Ok"]
["2014-01-27","NOM PRENOM 4676",null,"","VIDE"]
["2014-01-27","NOM PRENOM 4677","TEL 99.99.99.99","99999999","Ok"]
["2014-01-27","NOM PRENOM 4678","TEL 99999999","99999999","Ok"]
["2014-01-27","NOM PRENOM 4679",null,"","VIDE"]
["2014-01-27","NOM PRENOM 4680",null,"","VIDE"]
["2014-01-27","NOM PRENOM 4681","TEL.99.99.99.99","99999999","Ok"]
["2014-01-27","NOM PRENOM 4682","val 99/99/9999 cel 99999999","99999999","Ok"]
["2014-01-27","NOM PRENOM 4683","CNI C 9999999999 DU 99/99/99 AU 99/99/99","","VIDE"]
["2014-01-27","NOM PRENOM 4684","CEL 99.99.99.99","99999999","Ok"]
["2014-01-27","NOM PRENOM 4685","CNI N9 C 9999.9999.99 DU 99.99.9999","","VIDE"]
["2014-01-27","NOM PRENOM 4686","CNI N9 C 9999.9999.99 DU 99.99.9999","","VIDE"]
["2014-01-27","NOM PRENOM 4687","TEL 99.99.99.99","99999999","Ok"]
["2014-01-27","NOM PRENOM 4688","99/99/99","","VIDE"]
["2014-01-27","NOM PRENOM 4689","val 99/99/9999 cel 99999999","99999999","Ok"]
["2014-01-27","NOM PRENOM 4690","TEL 99999999","99999999","Ok"]
["2014-01-27","NOM PRENOM 4691",99999999,"99999999","Ok"]
["2014-01-27","NOM PRENOM 4692","TEL.99.99.99.99","99999999","Ok"]
["2014-01-27","NOM PRENOM 4693","TEL 99999999","99999999","Ok"]
["2014-01-27","NOM PRENOM 4694","VAL99/99/9999 CEL99999999","99999999","Ok"]
["2014-01-27","NOM PRENOM 4695","9999/CHCA DU 99.99.9999 ET PC N°99-99-99999999","","VIDE"]
["2014-01-27","NOM PRENOM 4696","TEL.99.99.99.99","99999999","Ok"]
["2014-01-27","NOM PRENOM 4697","TEL 99.99.99.99","99999999","Ok"]
["2014-01-27","NOM PRENOM 4698","TEL.99.99.99.99","99999999","Ok"]
["2014-01-27","NOM PRENOM 4699","TEL 99.99.99.99","99999999","Ok"]
["2014-01-27","NOM PRENOM 4700","CIC MALI N°99999/CGMA/CI DY 99/99/9999","","VIDE"]
["2014-01-27","NOM PRENOM 4701","TEL99.99.99.99","99999999","Ok"]
["2014-01-27","NOM PRENOM 4702",null,"","VIDE"]
["2014-01-27","NOM PRENOM 4703","TEL 99.99.99.99","99999999","Ok"]
["2014-01-27","NOM PRENOM 4704","TEL:99-99-99-99","99999999","Ok"]
["2014-01-27","NOM PRENOM 4705","DU 99/99/9999 AU 99/99/9999","","VIDE"]
["2014-01-27","NOM PRENOM 4706","TEL.99.99.99.99","99999999","Ok"]
["2014-01-27","NOM PRENOM 4707","TEL 99999999","99999999","Ok"]
["2014-01-27","NOM PRENOM 4708","TEL 99999999","99999999","Ok"]
["2014-01-27","NOM PRENOM 4709","TEL 99.99.99.99","99999999","Ok"]
["2014-01-27","NOM PRENOM 4710",99999999,"99999999","Ok"]
["2014-01-27","NOM PRENOM 4711","DU 99/99/9999 AU 99/99/9999","","VIDE"]
["2014-01-27","NOM PRENOM 4712","AI N° 9999-9999/99-99/PU-BONG DU 99/99/9999 AU 99/99/9999","","VIDE"]
["2014-01-27","NOM PRENOM 4713",null,"","VIDE"]
["2014-01-27","NOM PRENOM 4714","CEL 99999999","99999999","Ok"]
["2014-01-27","NOM PRENOM 4715","TEL 99999999","99999999","Ok"]
["2014-01-27","NOM PRENOM 4716",null,"","VIDE"]
["2014-01-27","NOM PRENOM 4717","TEL 99999999","99999999","Ok"]
["2014-01-27","NOM PRENOM 4718","TEL 99999999","99999999","Ok"]
["2014-01-27","NOM PRENOM 4719","TEL 99999999","99999999","Ok"]
["2014-01-27","NOM PRENOM 4720","CNI C 9999 9999 99 DU 99/99/9999 AU 99/99/9999","","VIDE"]
["2014-01-27","NOM PRENOM 4721","CNI 9999999999999 DU 99/99/9999 AU 99/99/9999 A SOUBRE","","VIDE"]
["2014-01-27","NOM PRENOM 4722","TEL 99999999","99999999","Ok"]
["2014-01-27","NOM PRENOM 4723","TEL 99.99.99.99","99999999","Ok"]
["2014-01-27","NOM PRENOM 4724","CEL 99999999","99999999","Ok"]
["2014-01-27","NOM PRENOM 4725","TEL 99.99.99.99","99999999","Ok"]
["2014-01-27","NOM PRENOM 4726","CNI C9999999999DU 99/99/9999 AU 99/99/9999","","VIDE"]
["2014-01-27","NOM PRENOM 4727","CEL 99999999","99999999","Ok"]
["2014-01-27","NOM PRENOM 4728",null,"","VIDE"]
["2014-01-27","NOM PRENOM 4729","CEL 99999999","99999999","Ok"]
["2014-01-27","NOM PRENOM 4730","VAL 99/99/9999 CEL 99999999","99999999","Ok"]
["2014-01-27","NOM PRENOM 4731","CNI C9999999999 DU 99/99/9999 AU 99/99/9999 A SOUBRE","","VIDE"]
["2014-01-27","NOM PRENOM 4732","VAL 99 AOUT 9999 CNI N B9999999","","VIDE"]
["2014-01-27","NOM PRENOM 4733",null,"","VIDE"]
["2014-01-27","NOM PRENOM 4734","val 99/99/9999 passport n 99ad99999","","VIDE"]
["2014-01-27","NOM PRENOM 4735","CEL 99999999","99999999","Ok"]
["2014-01-27","NOM PRENOM 4736","DU 99/99/9999","","VIDE"]
["2014-01-27","NOM PRENOM 4737","PASS N 99AA99999 DU 99/99/99 AU 99/99/99","","VIDE"]
["2014-01-27","NOM PRENOM 4738","CNI C 9999 9999 99 DU 99/99/9999 AU 99/99/9999",{"$f":"gettel(C4739)","v":""},{"$f":"IF(LEN(D4739)=0,\"VIDE\",IF(LEN(D4739)=8,\"Ok\",\"?\"))","v":"VIDE"}]
["2014-01-27","NOM PRENOM 4739","CNI C9999.9999.99 DU 99.99.99","","VIDE"]
["2014-01-27","NOM PRENOM 4740","ONI/DECI DU 99/99/9999  PC N°99-99-99999999 DU 99/99/99","","VIDE"]
["2014-01-27","NOM PRENOM 4741",null,"","VIDE"]
["2014-01-27","NOM PRENOM 4742","TEL 99.99.99.99","99999999","Ok"]
["2014-01-27","NOM PRENOM 4743",null,"","VIDE"]
["2014-01-27","NOM PRENOM 4744","DU 99/99/9999 + CE INP N° 99INP99999 DE 9999-9999","","VIDE"]
["2014-01-27","NOM PRENOM 4745","CIC BF N 9999999/ABFA/9999 DU 99/99/9999 AU 99/99/9999 A SOUBRE","","VIDE"]
["2014-01-27","NOM PRENOM 4746","PC 99-99-99999999 DU 99.99.9999","","VIDE"]
["2014-01-27","NOM PRENOM 4747","CNI C9999.9999.99 DU 99/99/9999","","VIDE"]
["2014-01-27","NOM PRENOM 4748","CNI C9999999999 DU 99/99/9999 AU 99/99/9999 A SOUBRE","","VIDE"]
["2014-01-27","NOM PRENOM 4749","CIC GHANA N°999999 DU 99/99/9999 + PC N°999999999999 DU 99/99/9999","","VIDE"]
["2014-01-27","NOM PRENOM 4750","CEL 99999999","99999999","Ok"]
["2014-01-27","NOM PRENOM 4751","CNI C9999999999 DU 99/99/9999 AU 99/99/9999","","VIDE"]
["2014-01-27","NOM PRENOM 4752","CNI C9999999999 DU 99/99/9999 AU 99/99/9999","","VIDE"]
["2014-01-27","NOM PRENOM 4753",null,"","VIDE"]
["2014-01-27","NOM PRENOM 4754","CEL 99999999","99999999","Ok"]
["2014-01-27","NOM PRENOM 4755","PASS N 99AB99999 DU 99/9/99 AU 99/9/99. + PC N 99-99-9999999 DU 99/9/9","","VIDE"]
["2014-01-27","NOM PRENOM 4756","cel 99999999","99999999","Ok"]
["2014-01-27","NOM PRENOM 4757","TEL 99.99.99.99","99999999","Ok"]
["2014-01-27","NOM PRENOM 4758","cel 99999999","99999999","Ok"]
["2014-01-27","NOM PRENOM 4759","CNI C9999999999 DU 99/99/9999 AU 99/99/9999 A SOUBRE","","VIDE"]
["2014-01-27","NOM PRENOM 4760","cel 99999999","99999999","Ok"]
["2014-01-27","NOM PRENOM 4761","CNI C 9999 9999 99 DU 99/99/9999 AU 99/99/9999","","VIDE"]
["2014-01-27","NOM PRENOM 4762",99999999,"99999999","Ok"]
["2014-01-27","NOM PRENOM 4763","CNI  C9999 9999 99 DU 99/99/9999 AU 99/99/9999","","VIDE"]
["2014-01-27","NOM PRENOM 4764","CIC N AB/I9/99999/AGCI/99/99 DU 99/99/99","","VIDE"]
["2014-01-27","NOM PRENOM 4765","TEL 99.99.99.99","99999999","Ok"]
["2014-01-27","NOM PRENOM 4766","CNI C9999999999 DU 99/99/9999 AU 99/99/9999","","VIDE"]
["2014-01-27","NOM PRENOM 4767","TEL 99.99.99.99","99999999","Ok"]
["2014-01-27","NOM PRENOM 4768",null,"","VIDE"]
["2014-01-27","NOM PRENOM 4769","TEL 99.99.99.99","99999999","Ok"]
["2014-01-27","NOM PRENOM 4770",null,"","VIDE"]
["2014-01-27","NOM PRENOM 4771","TEL 99.99.99.99","99999999","Ok"]
["2014-01-27","NOM PRENOM 4772","CNI N° C9999999999 DU 99/99/9999","","VIDE"]
["2014-01-27","NOM PRENOM 4773","TEL 99.99.99.99","99999999","Ok"]
["2014-01-27","NOM PRENOM 4774","CNI C9999.9999.99 DU 99/99/9999","","VIDE"]
["2014-01-27","NOM PRENOM 4775","val 99/99/9999 cel 99999999","99999999","Ok"]
["2014-01-27","NOM PRENOM 4776","DU 99.99.99","","VIDE"]
["2014-01-27","NOM PRENOM 4777","TEL:99-99-99-99","99999999","Ok"]
["2014-01-27","NOM PRENOM 4778","VAL 99/99/9999 PC N 99-99-99999999","","VIDE"]
["2014-01-27","NOM PRENOM 4779","CEL 99999999","99999999","Ok"]
["2014-01-27","NOM PRENOM 4780","CNI C 9999 9999 99 VAL 99/99/9999","","VIDE"]
["2014-01-27","NOM PRENOM 4781","TEL 99999999","99999999","Ok"]
["2014-01-27","NOM PRENOM 4782","TEL 99.99.99.99","99999999","Ok"]
["2014-01-27","NOM PRENOM 4783","TEL 99.99.99.99","99999999","Ok"]
["2014-01-27","NOM PRENOM 4784",null,"","VIDE"]
["2014-01-27","NOM PRENOM 4785","TEL 99.99.99.99","99999999","Ok"]
["2014-01-27","NOM PRENOM 4786",null,"","VIDE"]
["2014-01-27","NOM PRENOM 4787","TEL:99-99-99-99","99999999","Ok"]
["2014-01-27","NOM PRENOM 4788","CEL 99999999","99999999","Ok"]
["2014-01-27","NOM PRENOM 4789","TEL 99.99.99.99","99999999","Ok"]
["2014-01-27","NOM PRENOM 4790","CNI C9999999999 DU 99/99/9999 AU 99/99/9999 A SOUBRE","","VIDE"]
["2014-01-27","NOM PRENOM 4791","CNI C9999999999 DU 99/99/9999 AU 99/99/9999 A SOUBRE","","VIDE"]
["2014-01-27","NOM PRENOM 4792","TEL 99.99.99.9",{"$f":"gettel(C4793)","v":"9999999"},"?"]
["2014-01-27","NOM PRENOM 4793",99999999,"99999999","Ok"]
["2014-01-27","NOM PRENOM 4794","AI N° 999-9999/99-99/PU-9 DU 99.99.9999","","VIDE"]
["2014-01-27","NOM PRENOM 4795","CNI N° C 9999999999 DU 99/99/9999","","VIDE"]
["2014-01-27","NOM PRENOM 4796",null,"","VIDE"]
["2014-01-27","NOM PRENOM 4797","TEL 99999999","99999999","Ok"]
["2014-01-27","NOM PRENOM 4798",99999999,"99999999","Ok"]
["2014-01-27","NOM PRENOM 4799","CEL 99999999","99999999","Ok"]
["2014-01-27","NOM PRENOM 4800","DU 99.99.99.99","","VIDE"]
["2014-01-27","NOM PRENOM 4801",null,"","VIDE"]
["2014-01-27","NOM PRENOM 4802",null,{"$f":"gettel(C4803)","v":""},{"$f":"IF(LEN(D4803)=0,\"VIDE\",IF(LEN(D4803)=8,\"Ok\",\"?\"))","v":"VIDE"}]
["2014-01-27","NOM PRENOM 4803",null,"","VIDE"]
["2014-01-27","NOM PRENOM 4804","TEL 99.99.99.99","99999999","Ok"]
["2014-01-27","NOM PRENOM 4805","TEL 99999999","99999999","Ok"]
["2014-01-27","NOM PRENOM 4806",null,"","VIDE"]
["2014-01-27","NOM PRENOM 4807",null,"","VIDE"]
["2014-01-27","NOM PRENOM 4808","TEL 99999999","99999999","Ok"]
["2014-01-27","NOM PRENOM 4809",null,"","VIDE"]
["2014-01-27","NOM PRENOM 4810","TEL 99999999","99999999","Ok"]
["2014-01-27","NOM PRENOM 4811","AI N° 999-99999/99-99/MI/PU-99 DU 99.99.9999","","VIDE"]
["2014-01-27","NOM PRENOM 4812","99.99.99 AU 99.99.99","","VIDE"]
["2014-01-27","NOM PRENOM 4813","CNI 999999999999 DU 99/99/9999 AU 99/99/9999 A ODIENNE","","VIDE"]
["2014-01-27","NOM PRENOM 4814",null,"","VIDE"]
["2014-01-27","NOM PRENOM 4815",null,"","VIDE"]
["2014-01-27","NOM PRENOM 4816","TEL 99.99.99.99","99999999","Ok"]
["2014-01-27","NOM PRENOM 4817","TEL 99.99.99.99","99999999","Ok"]
["2014-01-27","NOM PRENOM 4818","CNI C9999999999 DU 99/99/9999 AU 99/99/9999 A ABJ","","VIDE"]
["2014-01-27","NOM PRENOM 4819","CNI C9999.9999.99 DU 99/99/9999","","VIDE"]
["2014-01-27","NOM PRENOM 4820","CEL:99999999","99999999","Ok"]
["2014-01-27","NOM PRENOM 4821","CIC MALI N°9999999 DU 99/99/9999","","VIDE"]
["2014-01-27","NOM PRENOM 4822","CNI C 9999999999 DU 99/99/99 AU 99/99/99","","VIDE"]
["2014-01-27","NOM PRENOM 4823",null,"","VIDE"]
["2014-01-27","NOM PRENOM 4824",null,"","VIDE"]
["2014-01-27","NOM PRENOM 4825","TEL 99999999","99999999","Ok"]
["2014-01-27","NOM PRENOM 4826","TEL:99-99-99-99","99999999","Ok"]
["2014-01-27","NOM PRENOM 4827","CEL:99999999","99999999","Ok"]
["2014-01-27","NOM PRENOM 4828",null,"","VIDE"]
["2014-01-27","NOM PRENOM 4829","KONE DJAKARIDJA","","VIDE"]
["2014-01-27","NOM PRENOM 4830","TEL 99.99.99.99","99999999","Ok"]
["2014-01-27","NOM PRENOM 4831","ouedraogo boukary","","VIDE"]
["2014-01-27","NOM PRENOM 4832",null,"","VIDE"]
["2014-01-27","NOM PRENOM 4833",null,"","VIDE"]
["2014-01-27","NOM PRENOM 4834","CNI N° C9999999999 DU 99/99/9999","","VIDE"]
["2014-01-27","NOM PRENOM 4835","TEL 99999999","99999999","Ok"]
["2014-01-27","NOM PRENOM 4836","CEL 99999999","99999999","Ok"]
["2014-01-27","NOM PRENOM 4837","CEL 99999999","99999999","Ok"]
["2014-01-27","NOM PRENOM 4838","TEL 99999999","99999999","Ok"]
["2014-01-27","NOM PRENOM 4839","ZI KOUDOUGOU","","VIDE"]
["2014-01-27","NOM PRENOM 4840",null,"","VIDE"]
["2014-01-27","NOM PRENOM 4841","TOGO","","VIDE"]
["2014-01-27","NOM PRENOM 4842","TEL 99999999","99999999","Ok"]
["2014-01-27","NOM PRENOM 4843",null,"","VIDE"]
["2014-01-27","NOM PRENOM 4844",null,"","VIDE"]
["2014-01-27","NOM PRENOM 4845","TEL 99999999","99999999","Ok"]
["2014-01-27","NOM PRENOM 4846","TAMBOURA ALEYDA","","VIDE"]
["2014-01-27","NOM PRENOM 4847",null,"","VIDE"]
["2014-01-27","NOM PRENOM 4848","TEL 99999999","99999999","Ok"]
["2014-01-27","NOM PRENOM 4849","TL 99999999","","VIDE"]
["2014-01-27","NOM PRENOM 4850","CNI C9999999999 DU 99/99/9999","","VIDE"]
["2014-01-27","NOM PRENOM 4851","TEL 99999999","99999999","Ok"]
["2014-01-27","NOM PRENOM 4852",null,"","VIDE"]
["2014-01-27","NOM PRENOM 4853",null,"","VIDE"]
["2014-01-27","NOM PRENOM 4854",null,"","VIDE"]
["2014-01-27","NOM PRENOM 4855",null,"","VIDE"]
["2014-01-27","NOM PRENOM 4856",99999999,"99999999","Ok"]
["2014-01-27","NOM PRENOM 4857","TEL 99999999","99999999","Ok"]
["2014-01-27","NOM PRENOM 4858",null,"","VIDE"]
["2014-01-27","NOM PRENOM 4859","TEL 99999999","99999999","Ok"]
["2014-01-27","NOM PRENOM 4860","TEL 99999999","99999999","Ok"]
["2014-01-27","NOM PRENOM 4861","TEL 99999999","99999999","Ok"]
["2014-01-27","NOM PRENOM 4862",null,"","VIDE"]
["2014-01-27","NOM PRENOM 4863","DU 99.99.9999","","VIDE"]
["2014-01-27","NOM PRENOM 4864",null,"","VIDE"]
["2014-01-27","NOM PRENOM 4865","TEL 99999999","99999999","Ok"]
["2014-01-27","NOM PRENOM 4866","TEL 99999999",{"$f":"gettel(C4867)","v":"99999999"},{"$f":"IF(LEN(D4867)=0,\"VIDE\",IF(LEN(D4867)=8,\"Ok\",\"?\"))","v":"Ok"}]
["2014-01-27","NOM PRENOM 4867",null,"","VIDE"]
["2014-01-27","NOM PRENOM 4868",null,"","VIDE"]
["2014-01-27","NOM PRENOM 4869","TEL 99.99.99.99","99999999","Ok"]
["2014-01-27","NOM PRENOM 4870","TEL 99.99.99.99","99999999","Ok"]
["2014-01-27","NOM PRENOM 4871",null,"","VIDE"]
["2014-01-28","NOM PRENOM 4872","CNI C9999999999 DU 99/99/9999","","VIDE"]
["2014-01-28","NOM PRENOM 4873","PASS N°99AA99999 DU 99/99/99   + AI N°999-999/99-99 DU 99/99/9999","","VIDE"]
["2014-01-28","NOM PRENOM 4874","TEL 99999999","99999999","Ok"]
["2014-01-28","NOM PRENOM 4875",null,"","VIDE"]
["2014-01-28","NOM PRENOM 4876","PASS IVOIR 99AD99999 DU 99/99/99 AU 99/99/99","","VIDE"]
["2014-01-28","NOM PRENOM 4877","TEL:99-99-99-99","99999999","Ok"]
["2014-01-28","NOM PRENOM 4878",null,"","VIDE"]
["2014-01-28","NOM PRENOM 4879","CNI N9 C 9999.9999.99 DU 99.99.9999","","VIDE"]
["2014-01-28","NOM PRENOM 4880",null,"","VIDE"]
["2014-01-28","NOM PRENOM 4881","cel 99999999","99999999","Ok"]
["2014-01-28","NOM PRENOM 4882","TEL 99.99.99.99","99999999","Ok"]
["2014-01-28","NOM PRENOM 4883","TEL 99999999","99999999","Ok"]
["2014-01-28","NOM PRENOM 4884","ATD N°999.9999.9.99.PU99 DU 99.99.99","","VIDE"]
["2014-01-28","NOM PRENOM 4885","TEL 99999999","99999999","Ok"]
["2014-01-28","NOM PRENOM 4886","TEL 99999999","99999999","Ok"]
["2014-01-28","NOM PRENOM 4887","DU 99-99-9999 AU 99-99-9999","","VIDE"]
["2014-01-28","NOM PRENOM 4888","TEL 99999999","99999999","Ok"]
["2014-01-28","NOM PRENOM 4889","CEL:99999999","99999999","Ok"]
["2014-01-28","NOM PRENOM 4890","TEL 99999999","99999999","Ok"]
["2014-01-28","NOM PRENOM 4891","TEL 99999999","99999999","Ok"]
["2014-01-28","NOM PRENOM 4892","cni c 9999999999 du 99-99-99","","VIDE"]
["2014-01-28","NOM PRENOM 4893","CEL 99999999","99999999","Ok"]
["2014-01-28","NOM PRENOM 4894","TEL 99999999","99999999","Ok"]
["2014-01-28","NOM PRENOM 4895","AU 99/99/99 PC 99-99-99999999 DU 99/99/9999","","VIDE"]
["2014-01-28","NOM PRENOM 4896","TEL:99-99-99-99","99999999","Ok"]
["2014-01-28","NOM PRENOM 4897","CNI c9999999999 DU 99-99-99","","VIDE"]
["2014-01-28","NOM PRENOM 4898","tel 99.99.99.99","99999999","Ok"]
["2014-01-28","NOM PRENOM 4899","CNI c9999999999 DU 99-99-99","","VIDE"]
["2014-01-28","NOM PRENOM 4900","TEL 99999999","99999999","Ok"]
["2014-01-28","NOM PRENOM 4901",null,"","VIDE"]
["2014-01-28","NOM PRENOM 4902","TEL:99-99-99-99","99999999","Ok"]
["2014-01-28","NOM PRENOM 4903","CEL 99999999","99999999","Ok"]
["2014-01-28","NOM PRENOM 4904","TEL 99.99.99.99","99999999","Ok"]
["2014-01-28","NOM PRENOM 4905","CNI C9999999999 DU 99/99/9999 AU 99/99/9999","","VIDE"]
["2014-01-28","NOM PRENOM 4906","TEL 99.99.99.99","99999999","Ok"]
["2014-01-28","NOM PRENOM 4907","TEL:99-99-99-99","99999999","Ok"]
["2014-01-28","NOM PRENOM 4908","CNI C9999999999 DU 99/99/9999 AU 99/99/9999","","VIDE"]
["2014-01-28","NOM PRENOM 4909","tel 99999999","99999999","Ok"]
["2014-01-28","NOM PRENOM 4910","DU 99/99/9999","","VIDE"]
["2014-01-28","NOM PRENOM 4911","CIC TOGO N 99999 DU 99/99/99 AU 99/99/99","","VIDE"]
["2014-01-28","NOM PRENOM 4912","TEL 99.99.99.99","99999999","Ok"]
["2014-01-28","NOM PRENOM 4913","TEL 99.99.99.99","99999999","Ok"]
["2014-01-28","NOM PRENOM 4914",99999999,"99999999","Ok"]
["2014-01-28","NOM PRENOM 4915","TEL 99.99.99.99","99999999","Ok"]
["2014-01-28","NOM PRENOM 4916","TEL 99999999","99999999","Ok"]
["2014-01-28","NOM PRENOM 4917","TEL 99.99.99.99","99999999","Ok"]
["2014-01-28","NOM PRENOM 4918","CNI C 9999999999 DU 99/9/99 AU 99/9/99","","VIDE"]
["2014-01-28","NOM PRENOM 4919","CEL 99999999","99999999","Ok"]
["2014-01-28","NOM PRENOM 4920","TEL 99.99.99.99","99999999","Ok"]
["2014-01-28","NOM PRENOM 4921","TEL 99.99.99.99","99999999","Ok"]
["2014-01-28","NOM PRENOM 4922",null,"","VIDE"]
["2014-01-28","NOM PRENOM 4923","CNI C 9999999999 DU 99/9/99 AU 99/9/99","","VIDE"]
["2014-01-28","NOM PRENOM 4924","ATT N°999-99999/99-99/MI/PU-99 DU","","VIDE"]
["2014-01-28","NOM PRENOM 4925","TEL 99.99.99.99","99999999","Ok"]
["2014-01-28","NOM PRENOM 4926","C9999.9999.99 DU 99.99.99","","VIDE"]
["2014-01-28","NOM PRENOM 4927","ai n 9/99/9999 pc n 99/99/9999 fait le 99/99/9999","","VIDE"]
["2014-01-28","NOM PRENOM 4928","TEL 99.99.99.99","99999999","Ok"]
["2014-01-28","NOM PRENOM 4929",null,"","VIDE"]
["2014-01-28","NOM PRENOM 4930","CEL 99999999",{"$f":"gettel(C4931)","v":"99999999"},{"$f":"IF(LEN(D4931)=0,\"VIDE\",IF(LEN(D4931)=8,\"Ok\",\"?\"))","v":"Ok"}]
["2014-01-28","NOM PRENOM 4931","AI N° 9999/99999/99-99/MI/SP-ADA DU 99-99-9999","","VIDE"]
["2014-01-28","NOM PRENOM 4932","TEL:99-99-99-99","99999999","Ok"]
["2014-01-28","NOM PRENOM 4933","DU 99-99-9999 AU 99-99-9999","","VIDE"]
["2014-01-28","NOM PRENOM 4934","TEL 99999999","99999999","Ok"]
["2014-01-28","NOM PRENOM 4935","CEL 99999999","99999999","Ok"]
["2014-01-28","NOM PRENOM 4936","CNI C9999.9999.99 DU 99/99/9999","","VIDE"]
["2014-01-28","NOM PRENOM 4937",null,"","VIDE"]
["2014-01-28","NOM PRENOM 4938","TEL 99.99.99.99","99999999","Ok"]
["2014-01-28","NOM PRENOM 4939",null,"","VIDE"]
["2014-01-28","NOM PRENOM 4940","CNI C 9999999999 DU 99/99/99 AU 99/99/99","","VIDE"]
["2014-01-28","NOM PRENOM 4941",null,"","VIDE"]
["2014-01-28","NOM PRENOM 4942","TEL 99999999","99999999","Ok"]
["2014-01-28","NOM PRENOM 4943","val 99/99/9999 cel 99999999","99999999","Ok"]
["2014-01-28","NOM PRENOM 4944",null,"","VIDE"]
["2014-01-28","NOM PRENOM 4945","TEL 99999999","99999999","Ok"]
["2014-01-28","NOM PRENOM 4946","CEL 99999999","99999999","Ok"]
["2014-01-28","NOM PRENOM 4947","CEL 99999999","99999999","Ok"]
["2014-01-28","NOM PRENOM 4948","PASS AM N 99999999 DU 99/99/99 AU 99/99/99","","VIDE"]
["2014-01-28","NOM PRENOM 4949","TEL 99999999","99999999","Ok"]
["2014-01-28","NOM PRENOM 4950","TEL 99999999","99999999","Ok"]
["2014-01-28","NOM PRENOM 4951","TEL 99.99.99.99","99999999","Ok"]
["2014-01-28","NOM PRENOM 4952","TEL 99999999","99999999","Ok"]
["2014-01-28","NOM PRENOM 4953",null,"","VIDE"]
["2014-01-28","NOM PRENOM 4954",null,"","VIDE"]
["2014-01-28","NOM PRENOM 4955",null,"","VIDE"]
["2014-01-28","NOM PRENOM 4956","CNI N° C9999999999 DU 99/99/9999","","VIDE"]
["2014-01-28","NOM PRENOM 4957",null,"","VIDE"]
["2014-01-28","NOM PRENOM 4958","DU 99/99/9999 AU 99/99/9999","","VIDE"]
["2014-01-28","NOM PRENOM 4959","CNI N 999999999999 DU 99/9/99 AU 99/9/99","","VIDE"]
["2014-01-28","NOM PRENOM 4960","DU 99/99/9999 AU 99/99/9999","","VIDE"]
["2014-01-28","NOM PRENOM 4961","l 99999999","","VIDE"]
["2014-01-28","NOM PRENOM 4962","DU 99.99.99","","VIDE"]
["2014-01-28","NOM PRENOM 4963","TEL 99.99.99.99","99999999","Ok"]
["2014-01-28","NOM PRENOM 4964","TEL 99999999","99999999","Ok"]
["2014-01-28","NOM PRENOM 4965","PASS 99AB99999 DU 99-99-9999 AU 99-99-9999","","VIDE"]
["2014-01-28","NOM PRENOM 4966","TEL 99999999","99999999","Ok"]
["2014-01-28","NOM PRENOM 4967",99999999,"99999999","Ok"]
["2014-01-28","NOM PRENOM 4968",null,"","VIDE"]
["2014-01-28","NOM PRENOM 4969","TEL:99-99-99-99","99999999","Ok"]
["2014-01-28","NOM PRENOM 4970","DU 99-99-9999 AU 99-99-9999","","VIDE"]
["2014-01-28","NOM PRENOM 4971",null,"","VIDE"]
["2014-01-28","NOM PRENOM 4972","AGCI/99/99 DU 99.99.9999 ET CERTIFICAT","","VIDE"]
["2014-01-28","NOM PRENOM 4973","val 99/99/9999 cel 99999999","99999999","Ok"]
["2014-01-28","NOM PRENOM 4974","du 99/ 99/ 9999 au 99/99/9999","","VIDE"]
["2014-01-28","NOM PRENOM 4975","CNI C9999999999 DU 99/99/9999","","VIDE"]
["2014-01-28","NOM PRENOM 4976",null,"","VIDE"]
["2014-01-28","NOM PRENOM 4977","TEL 99.99.99.99","99999999","Ok"]
["2014-01-28","NOM PRENOM 4978","TEL 99999999","99999999","Ok"]
["2014-01-28","NOM PRENOM 4979","CNI C 9999999999 DU 99/99/9999 AU 99/99/9999 A GAGNOA","","VIDE"]
["2014-01-28","NOM PRENOM 4980","CNI C 9999999999 DU 99/99/99","","VIDE"]
["2014-01-28","NOM PRENOM 4981","CNI C9999999999","","VIDE"]
["2014-01-28","NOM PRENOM 4982","TEL 99.99.99.99","99999999","Ok"]
["2014-01-28","NOM PRENOM 4983",null,"","VIDE"]
["2014-01-28","NOM PRENOM 4984","CNI C9999999999 DU 99.99.9999","","VIDE"]
["2014-01-28","NOM PRENOM 4985","DU 99/99/9999","","VIDE"]
["2014-01-28","NOM PRENOM 4986",null,"","VIDE"]
["2014-01-28","NOM PRENOM 4987","CNI C9999.9999.99 DU 99.99.99","","VIDE"]
["2014-01-28","NOM PRENOM 4988","CNI N° C9999999999 DU 99/99/9999","","VIDE"]
["2014-01-28","NOM PRENOM 4989",null,"","VIDE"]
["2014-01-28","NOM PRENOM 4990","CEL 99999999","99999999","Ok"]
["2014-01-28","NOM PRENOM 4991",null,"","VIDE"]
["2014-01-28","NOM PRENOM 4992","TEL 99999999","99999999","Ok"]
["2014-01-28","NOM PRENOM 4993","CNI N° C9999999999 DU 99/99/9999","","VIDE"]
["2014-01-28","NOM PRENOM 4994","TEL 99.99.99.99",{"$f":"gettel(C4995)","v":"99999999"},{"$f":"IF(LEN(D4995)=0,\"VIDE\",IF(LEN(D4995)=8,\"Ok\",\"?\"))","v":"Ok"}]
["2014-01-28","NOM PRENOM 4995",null,"","VIDE"]
["2014-01-28","NOM PRENOM 4996",null,"","VIDE"]
["2014-01-28","NOM PRENOM 4997","TEL 99999999","99999999","Ok"]
["2014-01-28","NOM PRENOM 4998","TEL 99.99.99.99","99999999","Ok"]
["2014-01-28","NOM PRENOM 4999","CNI N 9C 9999.9999.99 DU 99.99.9999","","VIDE"]
["2014-01-28","NOM PRENOM 5000","CNI C 9999999999 DU 99/9/99 AU 99/9/99","","VIDE"]
["2014-01-28","NOM PRENOM 5001",null,"","VIDE"]
["2014-01-28","NOM PRENOM 5002","CELL 99999999","99999999","Ok"]
["2014-01-28","NOM PRENOM 5003","CIC BF N 9999999/ABFA/9999 DU 99/99/9999 AU 99/99/9999 A SOUBRE","","VIDE"]
["2014-01-28","NOM PRENOM 5004",null,"","VIDE"]
["2014-01-28","NOM PRENOM 5005","CIC DU GHANA N° 999999 DU 99/99/9999 AU 99/99/9999","","VIDE"]
["2014-01-28","NOM PRENOM 5006","TEL 99999999","99999999","Ok"]
["2014-01-28","NOM PRENOM 5007","CNI N° C9999999999 DU 99/99/9999","","VIDE"]
["2014-01-28","NOM PRENOM 5008","TEL 99.99.99.99","99999999","Ok"]
["2014-01-28","NOM PRENOM 5009","TEL 99999999","99999999","Ok"]
["2014-01-28","NOM PRENOM 5010","val 99/99/9999 cel 99999999","99999999","Ok"]
["2014-01-28","NOM PRENOM 5011","TEL 99999999","99999999","Ok"]
["2014-01-28","NOM PRENOM 5012","CEL 99.99.99.99","99999999","Ok"]
["2014-01-28","NOM PRENOM 5013","TEL 99.99.99.99","99999999","Ok"]
["2014-01-28","NOM PRENOM 5014","TEL 99999999","99999999","Ok"]
["2014-01-28","NOM PRENOM 5015","TEL 99999999","99999999","Ok"]
["2014-01-28","NOM PRENOM 5016","VAL 99/99/9999 CEL 99999999","99999999","Ok"]
["2014-01-28","NOM PRENOM 5017",null,"","VIDE"]
["2014-01-28","NOM PRENOM 5018",null,"","VIDE"]
["2014-01-28","NOM PRENOM 5019","ATTEST N 999999999999E/99-99/MEMI/ONI/DECI DU 99/99/99 AU 99/99/99","","VIDE"]
["2014-01-28","NOM PRENOM 5020","TEL 99.99.99.99","99999999","Ok"]
["2014-01-28","NOM PRENOM 5021","CEL 99999999","99999999","Ok"]
["2014-01-28","NOM PRENOM 5022","DU 99.99.99","","VIDE"]
["2014-01-28","NOM PRENOM 5023","CEL 99999999 DOUKOUYA",{"$f":"gettel(C5024)","v":"99999999DOUKOUYA"},"?"]
["2014-01-28","NOM PRENOM 5024",null,"","VIDE"]
["2014-01-28","NOM PRENOM 5025","CNI N9 C 9999.9999.99 DU 99.99.9999 SIKENSI","","VIDE"]
["2014-01-28","NOM PRENOM 5026","CNI C9999999999 DU 99/99/9999 AU 99/99/9999","","VIDE"]
["2014-01-28","NOM PRENOM 5027","CEL 99.99.99.99","99999999","Ok"]
["2014-01-28","NOM PRENOM 5028",null,"","VIDE"]
["2014-01-28","NOM PRENOM 5029","TEL 99.99.99.99","99999999","Ok"]
["2014-01-28","NOM PRENOM 5030","TEL 99999999","99999999","Ok"]
["2014-01-28","NOM PRENOM 5031","TEL 99999999","99999999","Ok"]
["2014-01-28","NOM PRENOM 5032","CEL 99.99.99.99","99999999","Ok"]
["2014-01-28","NOM PRENOM 5033","DU 99/99/9999 + CARTE NINA 99999999999999X DU 99/99/9999","","VIDE"]
["2014-01-28","NOM PRENOM 5034","TEL 99999999","99999999","Ok"]
["2014-01-28","NOM PRENOM 5035","CEL:99999999","99999999","Ok"]
["2014-01-28","NOM PRENOM 5036",null,"","VIDE"]
["2014-01-28","NOM PRENOM 5037","CNI C9999999999 DU 99/99/9999 AU 99/99/9999 A SOUBRE","","VIDE"]
["2014-01-28","NOM PRENOM 5038",null,"","VIDE"]
["2014-01-28","NOM PRENOM 5039","TEL 99999999","99999999","Ok"]
["2014-01-28","NOM PRENOM 5040","TEL 99999999","99999999","Ok"]
["2014-01-28","NOM PRENOM 5041",null,"","VIDE"]
["2014-01-28","NOM PRENOM 5042",null,"","VIDE"]
["2014-01-28","NOM PRENOM 5043",null,"","VIDE"]
["2014-01-28","NOM PRENOM 5044",null,"","VIDE"]
["2014-01-28","NOM PRENOM 5045",null,"","VIDE"]
["2014-01-28","NOM PRENOM 5046",null,"","VIDE"]
["2014-01-28","NOM PRENOM 5047","OUSSENI KONDE","","VIDE"]
["2014-01-28","NOM PRENOM 5048",null,"","VIDE"]
["2014-01-28","NOM PRENOM 5049",null,"","VIDE"]
["2014-01-28","NOM PRENOM 5050",null,"","VIDE"]
["2014-01-28","NOM PRENOM 5051",null,"","VIDE"]
["2014-01-28","NOM PRENOM 5052","TEL 99999999","99999999","Ok"]
["2014-01-28","NOM PRENOM 5053","TEL.99.99.99.99","99999999","Ok"]
["2014-01-28","NOM PRENOM 5054",null,"","VIDE"]
["2014-01-28","NOM PRENOM 5055",99999999,"99999999","Ok"]
["2014-01-28","NOM PRENOM 5056","TEL 99999999","99999999","Ok"]
["2014-01-28","NOM PRENOM 5057","DU 99.99.9999","","VIDE"]
["2014-01-28","NOM PRENOM 5058",null,{"$f":"gettel(C5059)","v":""},{"$f":"IF(LEN(D5059)=0,\"VIDE\",IF(LEN(D5059)=8,\"Ok\",\"?\"))","v":"VIDE"}]
["2014-01-28","NOM PRENOM 5059","DIABATE AROUNA","","VIDE"]
["2014-01-28","NOM PRENOM 5060","CIC N° 999999/CGMA/CI VAL 99/99/9999","","VIDE"]
["2014-01-28","NOM PRENOM 5061",null,"","VIDE"]
["2014-01-28","NOM PRENOM 5062",null,"","VIDE"]
["2014-01-28","NOM PRENOM 5063",null,"","VIDE"]
["2014-01-28","NOM PRENOM 5064","YAMEOGO KAKIDOGO","","VIDE"]
["2014-01-28","NOM PRENOM 5065",null,"","VIDE"]
["2014-01-28","NOM PRENOM 5066",null,"","VIDE"]
["2014-01-28","NOM PRENOM 5067",null,"","VIDE"]
["2014-01-28","NOM PRENOM 5068","CEL 99999999","99999999","Ok"]
["2014-01-28","NOM PRENOM 5069",null,"","VIDE"]
["2014-01-28","NOM PRENOM 5070",null,"","VIDE"]
["2014-01-28","NOM PRENOM 5071",null,"","VIDE"]
["2014-01-28","NOM PRENOM 5072","SENEGAL","","VIDE"]
["2014-01-28","NOM PRENOM 5073",null,"","VIDE"]
["2014-01-28","NOM PRENOM 5074","SANGARE ZOUMANA","","VIDE"]
["2014-01-28","NOM PRENOM 5075","DIALLO MODIBO","","VIDE"]
["2014-01-28","NOM PRENOM 5076","TEL 99999999","99999999","Ok"]
["2014-01-28","NOM PRENOM 5077",null,"","VIDE"]
["2014-01-28","NOM PRENOM 5078","TEL 99999999","99999999","Ok"]
["2014-01-29","NOM PRENOM 5079","+ AT  9999-999999999999 AU 99/99/9999","","VIDE"]
["2014-01-29","NOM PRENOM 5080","val 99/99/9999 cel 99999999","99999999","Ok"]
["2014-01-29","NOM PRENOM 5081","TEL 99999999","99999999","Ok"]
["2014-01-29","NOM PRENOM 5082","CNI C9999.9999.99 DU 99/99/9999","","VIDE"]
["2014-01-29","NOM PRENOM 5083","TEL 99999999","99999999","Ok"]
["2014-01-29","NOM PRENOM 5084","MALI 999999 DU 99/99/99","","VIDE"]
["2014-01-29","NOM PRENOM 5085","TEL 99.99.99.99","99999999","Ok"]
["2014-01-29","NOM PRENOM 5086","val 99/99/9999 cel 99999999","99999999","Ok"]
["2014-01-29","NOM PRENOM 5087","TEL 99999999","99999999","Ok"]
["2014-01-29","NOM PRENOM 5088","val 99/99/9999 cel 99999999","99999999","Ok"]
["2014-01-29","NOM PRENOM 5089","PC 99-99-99999999 DU 99/99/9999","","VIDE"]
["2014-01-29","NOM PRENOM 5090","CNI N°999999999999 DU 99/99/9999","","VIDE"]
["2014-01-29","NOM PRENOM 5091",null,"","VIDE"]
["2014-01-29","NOM PRENOM 5092","CNI C9999999999 DU 99/99/9999","","VIDE"]
["2014-01-29","NOM PRENOM 5093",null,"","VIDE"]
["2014-01-29","NOM PRENOM 5094","CNI N° C9999999999 DU 99/99/9999","","VIDE"]
["2014-01-29","NOM PRENOM 5095","FRANCAIS N° 99AZ99999 DU 99/99/9999","","VIDE"]
["2014-01-29","NOM PRENOM 5096","CNI C 9999999999 DU 99/9/99 AU 99/9/99","","VIDE"]
["2014-01-29","NOM PRENOM 5097",null,"","VIDE"]
["2014-01-29","NOM PRENOM 5098","val 99/99/9999 cel 99999999","99999999","Ok"]
["2014-01-29","NOM PRENOM 5099","cel 99999999","99999999","Ok"]
["2014-01-29","NOM PRENOM 5100","CNI N9 C 9999.9999.99 DU 99.99.9999 TIASSALE","","VIDE"]
["2014-01-29","NOM PRENOM 5101","CNI C 9999999999 DU 99/9/99 AU 99/9/99","","VIDE"]
["2014-01-29","NOM PRENOM 5102","TEL 99.99.99.99","99999999","Ok"]
["2014-01-29","NOM PRENOM 5103","TEL 99999999","99999999","Ok"]
["2014-01-29","NOM PRENOM 5104","TEL 99999999","99999999","Ok"]
["2014-01-29","NOM PRENOM 5105","CNI C9999999999 DU 99/99/9999","","VIDE"]
["2014-01-29","NOM PRENOM 5106","CEL 99999999","99999999","Ok"]
["2014-01-29","NOM PRENOM 5107","CNI C 9999999999 DU 99/99/99 AU 99/99/99","","VIDE"]
["2014-01-29","NOM PRENOM 5108","CIC NIGERIA N° 99999999NG DU 99/99/9999 AU 99/99/9999","","VIDE"]
["2014-01-29","NOM PRENOM 5109","val 99/99/9999","","VIDE"]
["2014-01-29","NOM PRENOM 5110","CNI C 9999999999 DU 99/99/99 AU 99/99/99","","VIDE"]
["2014-01-29","NOM PRENOM 5111",null,"","VIDE"]
["2014-01-29","NOM PRENOM 5112","CNI N9 C 9999.9999.99 DU 99.99.9999 ANYAMA","","VIDE"]
["2014-01-29","NOM PRENOM 5113","DU 99.99.9999","","VIDE"]
["2014-01-29","NOM PRENOM 5114","CNI N9 C 9999.9999.99 DU 99.99.9999","","VIDE"]
["2014-01-29","NOM PRENOM 5115","VAL 99/99/9999 CEL 99999999","99999999","Ok"]
["2014-01-29","NOM PRENOM 5116","CNI N° C9999999999 DU 99/99/9999","","VIDE"]
["2014-01-29","NOM PRENOM 5117",null,"","VIDE"]
["2014-01-29","NOM PRENOM 5118","PASSEPORT N9 99AD99999 DU99.99.9999","","VIDE"]
["2014-01-29","NOM PRENOM 5119","TEL 99999999","99999999","Ok"]
["2014-01-29","NOM PRENOM 5120",null,"","VIDE"]
["2014-01-29","NOM PRENOM 5121","TEL 99.99.99.99","99999999","Ok"]
["2014-01-29","NOM PRENOM 5122",null,{"$f":"gettel(C5123)","v":""},{"$f":"IF(LEN(D5123)=0,\"VIDE\",IF(LEN(D5123)=8,\"Ok\",\"?\"))","v":"VIDE"}]
["2014-01-29","NOM PRENOM 5123","TEL 99999999","99999999","Ok"]
["2014-01-29","NOM PRENOM 5124",null,"","VIDE"]
["2014-01-29","NOM PRENOM 5125","CNI C9999999999 DU 99/99/9999 AU 99/99/9999","","VIDE"]
["2014-01-29","NOM PRENOM 5126",null,"","VIDE"]
["2014-01-29","NOM PRENOM 5127","TEL 99.99.99.99","99999999","Ok"]
["2014-01-29","NOM PRENOM 5128",null,"","VIDE"]
["2014-01-29","NOM PRENOM 5129","CNI C9999999999 DU 99/99/99","","VIDE"]
["2014-01-29","NOM PRENOM 5130","CNI C9999999999 DU 99.99.9999","","VIDE"]
["2014-01-29","NOM PRENOM 5131","PASS N° R9999999 DU 99/99/9999 AU 99/99/9999","","VIDE"]
["2014-01-29","NOM PRENOM 5132","TEL 99.99.99.99","99999999","Ok"]
["2014-01-29","NOM PRENOM 5133","CEL 99999999","99999999","Ok"]
["2014-01-29","NOM PRENOM 5134","CNI C9999999999 DU 99/99/9999 AU99/99/9999","","VIDE"]
["2014-01-29","NOM PRENOM 5135",null,"","VIDE"]
["2014-01-29","NOM PRENOM 5136","CEL 99999999","99999999","Ok"]
["2014-01-29","NOM PRENOM 5137","TEL 99.99.99.99","99999999","Ok"]
["2014-01-29","NOM PRENOM 5138","CNI C9999999999 DU 99/99/9999 AU 99/99/9999","","VIDE"]
["2014-01-29","NOM PRENOM 5139","CEL 99999999","99999999","Ok"]
["2014-01-29","NOM PRENOM 5140",null,"","VIDE"]
["2014-01-29","NOM PRENOM 5141","OPERATION EFFECTUER PAR MR NABAYAOGO OUSMANE","","VIDE"]
["2014-01-29","NOM PRENOM 5142","CEL 99.99.99.99","99999999","Ok"]
["2014-01-29","NOM PRENOM 5143","MLE 9999","","VIDE"]
["2014-01-29","NOM PRENOM 5144",null,"","VIDE"]
["2014-01-29","NOM PRENOM 5145","CEL 99999999","99999999","Ok"]
["2014-01-29","NOM PRENOM 5146","CNI N9 C 9999.9999.99 DU 99.99.9999","","VIDE"]
["2014-01-29","NOM PRENOM 5147","CNI C 9999999999 DU 99/9/99 AU 99/9/99","","VIDE"]
["2014-01-29","NOM PRENOM 5148","CNI C9999999999 DU 99.99.9999","","VIDE"]
["2014-01-29","NOM PRENOM 5149","TEL 99999999","99999999","Ok"]
["2014-01-29","NOM PRENOM 5150","CNI C9999999999 DU 99/99/9999","","VIDE"]
["2014-01-29","NOM PRENOM 5151","CNI C 9999999999 DU 99-99-99","","VIDE"]
["2014-01-29","NOM PRENOM 5152",null,"","VIDE"]
["2014-01-29","NOM PRENOM 5153","DU 99/99/9999","","VIDE"]
["2014-01-29","NOM PRENOM 5154","CNI N9 C 9999.9999.99 DU 99.99.9999 AFFERY","","VIDE"]
["2014-01-29","NOM PRENOM 5155","VAL99/99/9999 CEL99999999","99999999","Ok"]
["2014-01-29","NOM PRENOM 5156","TEL 99999999","99999999","Ok"]
["2014-01-29","NOM PRENOM 5157",null,"","VIDE"]
["2014-01-29","NOM PRENOM 5158","CNI N 999999999999 DU 99/9/99 AU 99/9/99","","VIDE"]
["2014-01-29","NOM PRENOM 5159","CNI C9999999999 DU 99/99/9999 AU 99/99/9999","","VIDE"]
["2014-01-29","NOM PRENOM 5160",null,"","VIDE"]
["2014-01-29","NOM PRENOM 5161","CEL99999999","99999999","Ok"]
["2014-01-29","NOM PRENOM 5162","DU 99/99/9999","","VIDE"]
["2014-01-29","NOM PRENOM 5163","AU 99/99/9999","","VIDE"]
["2014-01-29","NOM PRENOM 5164",null,"","VIDE"]
["2014-01-29","NOM PRENOM 5165","TEL 99999999","99999999","Ok"]
["2014-01-29","NOM PRENOM 5166",null,"","VIDE"]
["2014-01-29","NOM PRENOM 5167","TEL 99999999","99999999","Ok"]
["2014-01-29","NOM PRENOM 5168","TEL 99.99.99.99","99999999","Ok"]
["2014-01-29","NOM PRENOM 5169",null,"","VIDE"]
["2014-01-29","NOM PRENOM 5170",null,"","VIDE"]
["2014-01-29","NOM PRENOM 5171","99 AU 99/99/99 PC 99-99-99999999 DU 99/99/99","","VIDE"]
["2014-01-29","NOM PRENOM 5172",null,"","VIDE"]
["2014-01-29","NOM PRENOM 5173","CNI C9999999999 DU 99/99/9999 AU 99/99/9999","","VIDE"]
["2014-01-29","NOM PRENOM 5174","CEL 99999999","99999999","Ok"]
["2014-01-29","NOM PRENOM 5175","CNI C 9999 9999 99 DU 99/99/9999 AU 99/99/9999","","VIDE"]
["2014-01-29","NOM PRENOM 5176","CNI C 9999999999 DU 99/99/99 AU 99/99/99","","VIDE"]
["2014-01-29","NOM PRENOM 5177","TEL 99999999","99999999","Ok"]
["2014-01-29","NOM PRENOM 5178","CNI C9999999999 DU 99/99/9999 AU 99/99/9999 A SOUBRE","","VIDE"]
["2014-01-29","NOM PRENOM 5179",null,"","VIDE"]
["2014-01-29","NOM PRENOM 5180","ATTEST N 999/9999/99-99/PU9 DU 99/99/99 AU 99/99/99","","VIDE"]
["2014-01-29","NOM PRENOM 5181","TEL:99-99-99-99","99999999","Ok"]
["2014-01-29","NOM PRENOM 5182","TEL 99999999","99999999","Ok"]
["2014-01-29","NOM PRENOM 5183","CNI C 9999 9999 99 DU 99/99/9999 AU 99/99/9999","","VIDE"]
["2014-01-29","NOM PRENOM 5184","val 99/99/9999 cel 99999999","99999999","Ok"]
["2014-01-29","NOM PRENOM 5185","PASS IVOIR 99AA99999 DU 99/99/99 AU 99/99/99","","VIDE"]
["2014-01-29","NOM PRENOM 5186","TEL 99999999",{"$f":"gettel(C5187)","v":"99999999"},{"$f":"IF(LEN(D5187)=0,\"VIDE\",IF(LEN(D5187)=8,\"Ok\",\"?\"))","v":"Ok"}]
["2014-01-29","NOM PRENOM 5187","TEL 99999999","99999999","Ok"]
["2014-01-29","NOM PRENOM 5188",null,"","VIDE"]
["2014-01-29","NOM PRENOM 5189","CEL:99999999","99999999","Ok"]
["2014-01-29","NOM PRENOM 5190","TEL 99999999","99999999","Ok"]
["2014-01-29","NOM PRENOM 5191","CNI C 9999999999 DU 99/9/99 AU 99/9/99","","VIDE"]
["2014-01-29","NOM PRENOM 5192","CNI N C 9999 9999 99 DU 99.99.99 AU 99.99","","VIDE"]
["2014-01-29","NOM PRENOM 5193","CNI N C 99999 9999 99 DU 99.99.99 AU 99.99","","VIDE"]
["2014-01-29","NOM PRENOM 5194","CEL:99999999","99999999","Ok"]
["2014-01-29","NOM PRENOM 5195",null,"","VIDE"]
["2014-01-29","NOM PRENOM 5196","VAL99/99/9999 CEL99999999","99999999","Ok"]
["2014-01-29","NOM PRENOM 5197","CNI C 9999999999 DU 99/99/99 AU 99/99/99","","VIDE"]
["2014-01-29","NOM PRENOM 5198",null,"","VIDE"]
["2014-01-29","NOM PRENOM 5199","CNI C9999.9999.99 DU 99/99/9999","","VIDE"]
["2014-01-29","NOM PRENOM 5200",null,"","VIDE"]
["2014-01-29","NOM PRENOM 5201","CEL 99999999","99999999","Ok"]
["2014-01-29","NOM PRENOM 5202","cni du congo n ba9999kd9v999","","VIDE"]
["2014-01-29","NOM PRENOM 5203","CNI 999999999999 DU 99/99/9999 AU 99/99/9999","","VIDE"]
["2014-01-29","NOM PRENOM 5204",null,"","VIDE"]
["2014-01-29","NOM PRENOM 5205","CNI C 9999999999 DU 99/99/99 AU 99/99/99","","VIDE"]
["2014-01-29","NOM PRENOM 5206",null,"","VIDE"]
["2014-01-29","NOM PRENOM 5207",null,"","VIDE"]
["2014-01-29","NOM PRENOM 5208","VAL99/99/9999 CEL99999999","99999999","Ok"]
["2014-01-29","NOM PRENOM 5209","CNI C9999.9999.99 DU 99/99/9999","","VIDE"]
["2014-01-29","NOM PRENOM 5210",null,"","VIDE"]
["2014-01-29","NOM PRENOM 5211",null,"","VIDE"]
["2014-01-29","NOM PRENOM 5212","TEL 99999999","99999999","Ok"]
["2014-01-29","NOM PRENOM 5213",null,"","VIDE"]
["2014-01-29","NOM PRENOM 5214","TEL 99.99.99.99","99999999","Ok"]
["2014-01-29","NOM PRENOM 5215","CNI C9999.9999.99 DU 99/99/9999","","VIDE"]
["2014-01-29","NOM PRENOM 5216","+ TS 999999999","","VIDE"]
["2014-01-29","NOM PRENOM 5217","CNI C 9999999999 DU 99/99/99","","VIDE"]
["2014-01-29","NOM PRENOM 5218","TEL 99.99.99.99","99999999","Ok"]
["2014-01-29","NOM PRENOM 5219","CNI C 9999 9999 99 DU 99/99/9999 AU 99/99/9999","","VIDE"]
["2014-01-29","NOM PRENOM 5220","9999 9999 99 DU 99.99.99 AU 99.99.99","","VIDE"]
["2014-01-29","NOM PRENOM 5221","PASSEPORT IVOIRIEN N 99AB99999 DU","","VIDE"]
["2014-01-29","NOM PRENOM 5222","TEL 99999999","99999999","Ok"]
["2014-01-29","NOM PRENOM 5223","CNI C 9999 9999 99 DU 99/99/9999 AU 99/99/9999","","VIDE"]
["2014-01-29","NOM PRENOM 5224",null,"","VIDE"]
["2014-01-29","NOM PRENOM 5225","TEL 99999999","99999999","Ok"]
["2014-01-29","NOM PRENOM 5226","TEL 99.99.99.99","99999999","Ok"]
["2014-01-29","NOM PRENOM 5227","9999-999999999999 AU 99/99/9999","","VIDE"]
["2014-01-29","NOM PRENOM 5228","val 99/99/9999 cel 99999999","99999999","Ok"]
["2014-01-29","NOM PRENOM 5229","DU 99/99/9999","","VIDE"]
["2014-01-29","NOM PRENOM 5230",null,"","VIDE"]
["2014-01-29","NOM PRENOM 5231","SOGODOGO DJAKARIDJA","","VIDE"]
["2014-01-29","NOM PRENOM 5232",null,"","VIDE"]
["2014-01-29","NOM PRENOM 5233","TEL 99999999","99999999","Ok"]
["2014-01-29","NOM PRENOM 5234",null,"","VIDE"]
["2014-01-29","NOM PRENOM 5235",null,"","VIDE"]
["2014-01-29","NOM PRENOM 5236",null,"","VIDE"]
["2014-01-29","NOM PRENOM 5237",null,"","VIDE"]
["2014-01-29","NOM PRENOM 5238",null,"","VIDE"]
["2014-01-29","NOM PRENOM 5239",null,"","VIDE"]
["2014-01-29","NOM PRENOM 5240","TEL 99999999","99999999","Ok"]
["2014-01-29","NOM PRENOM 5241","TEL 99999999","99999999","Ok"]
["2014-01-29","NOM PRENOM 5242","TEL 99999999","99999999","Ok"]
["2014-01-29","NOM PRENOM 5243","PASSEPORT 99AA99999 DU 99/99/99","","VIDE"]
["2014-01-29","NOM PRENOM 5244",null,"","VIDE"]
["2014-01-29","NOM PRENOM 5245","TEL 99999999","99999999","Ok"]
["2014-01-29","NOM PRENOM 5246","TRAORE ARSIKE","","VIDE"]
["2014-01-29","NOM PRENOM 5247",null,"","VIDE"]
["2014-01-29","NOM PRENOM 5248","fait le 99/99/9999 cel 99999999","99999999","Ok"]
["2014-01-29","NOM PRENOM 5249","CEL:99999999","99999999","Ok"]
["2014-01-29","NOM PRENOM 5250","PASS N°99AD99999 DU 99/99/9999",{"$f":"gettel(C5251)","v":""},{"$f":"IF(LEN(D5251)=0,\"VIDE\",IF(LEN(D5251)=8,\"Ok\",\"?\"))","v":"VIDE"}]
["2014-01-29","NOM PRENOM 5251","FANNY ADAMA","","VIDE"]
["2014-01-29","NOM PRENOM 5252",null,"","VIDE"]
["2014-01-29","NOM PRENOM 5253",null,"","VIDE"]
["2014-01-29","NOM PRENOM 5254","TEL 99.99.99.99","99999999","Ok"]
["2014-01-29","NOM PRENOM 5255",null,"","VIDE"]
["2014-01-29","NOM PRENOM 5256","CIC MALI N° 999999/CGMA/CI DU 99/99/9999 AU 99/99/9999","","VIDE"]
["2014-01-29","NOM PRENOM 5257",null,"","VIDE"]
["2014-01-29","NOM PRENOM 5258","CNI MALI N9 9999999 DU 99.99.9999","","VIDE"]
["2014-01-29","NOM PRENOM 5259",null,"","VIDE"]
["2014-01-29","NOM PRENOM 5260",null,"","VIDE"]
["2014-01-29","NOM PRENOM 5261","AI N°999-999/99-99 DU 99/99/9999","","VIDE"]
["2014-01-29","NOM PRENOM 5262",null,"","VIDE"]
["2014-01-29","NOM PRENOM 5263","TEL 99.99.99.99","99999999","Ok"]
["2014-01-29","NOM PRENOM 5264","TEL 99.99.99.99","99999999","Ok"]
["2014-01-29","NOM PRENOM 5265","CEL:99999999","99999999","Ok"]
["2014-01-29","NOM PRENOM 5266",null,"","VIDE"]
["2014-01-29","NOM PRENOM 5267",null,"","VIDE"]
["2014-01-29","NOM PRENOM 5268",null,"","VIDE"]
["2014-01-29","NOM PRENOM 5269","CEL 99999999","99999999","Ok"]
["2014-01-29","NOM PRENOM 5270","FOFANA MAMADOU","","VIDE"]
["2014-01-29","NOM PRENOM 5271",null,"","VIDE"]
["2014-01-29","NOM PRENOM 5272","TEL 99999999","99999999","Ok"]
["2014-01-29","NOM PRENOM 5273","OUEDRAOGO HAROUNA","","VIDE"]
["2014-01-29","NOM PRENOM 5274",null,"","VIDE"]
["2014-01-29","NOM PRENOM 5275","KONATE NOUHOUM","","VIDE"]
["2014-01-29","NOM PRENOM 5276","CIC GUINEE N° B/9999/AGCI/99-99 DU 99/99/9999 AU 99/99/9999","","VIDE"]
["2014-01-29","NOM PRENOM 5277",null,"","VIDE"]
["2014-01-30","NOM PRENOM 5278","CNI C9999999999 DU 99.99.9999","","VIDE"]
["2014-01-30","NOM PRENOM 5279","cel 99999999","99999999","Ok"]
["2014-01-30","NOM PRENOM 5280","DU 99.99.99 AU 99.99.99","","VIDE"]
["2014-01-30","NOM PRENOM 5281","TEL 99999999","99999999","Ok"]
["2014-01-30","NOM PRENOM 5282","tel 99.99.99.99","99999999","Ok"]
["2014-01-30","NOM PRENOM 5283","AU 99.99.99","","VIDE"]
["2014-01-30","NOM PRENOM 5284","CEL 99999999","99999999","Ok"]
["2014-01-30","NOM PRENOM 5285",null,"","VIDE"]
["2014-01-30","NOM PRENOM 5286",null,"","VIDE"]
["2014-01-30","NOM PRENOM 5287",99999999,"99999999","Ok"]
["2014-01-30","NOM PRENOM 5288","CNI N° C9999 9999 99 DU 99/99/9999 AU 99/99/9999","","VIDE"]
["2014-01-30","NOM PRENOM 5289",null,"","VIDE"]
["2014-01-30","NOM PRENOM 5290","CNI C 9999999999 DU 99/99/99","","VIDE"]
["2014-01-30","NOM PRENOM 5291","CEL 99.99.99.99","99999999","Ok"]
["2014-01-30","NOM PRENOM 5292",null,"","VIDE"]
["2014-01-30","NOM PRENOM 5293","CNI N° C9999 9999 99 DU 99/99/9999 AU 99/99/9999","","VIDE"]
["2014-01-30","NOM PRENOM 5294",null,"","VIDE"]
["2014-01-30","NOM PRENOM 5295","TEL 99.99.99.99","99999999","Ok"]
["2014-01-30","NOM PRENOM 5296",null,"","VIDE"]
["2014-01-30","NOM PRENOM 5297",null,"","VIDE"]
["2014-01-30","NOM PRENOM 5298","TEL99.9999.99","99999999","Ok"]
["2014-01-30","NOM PRENOM 5299","CNI N 9999999999999 DU 99/99/99 AU 99/99/9999","","VIDE"]
["2014-01-30","NOM PRENOM 5300","CNI N° C9999 9999 99 DU 99/99/9999 AU 99/99/9999","","VIDE"]
["2014-01-30","NOM PRENOM 5301","val 99/99/9999 cel 99999999","99999999","Ok"]
["2014-01-30","NOM PRENOM 5302",null,"","VIDE"]
["2014-01-30","NOM PRENOM 5303","CNI C9999.999999 DU 99.99.99","","VIDE"]
["2014-01-30","NOM PRENOM 5304","TEL 99999999","99999999","Ok"]
["2014-01-30","NOM PRENOM 5305","val 99/99/9999 cel 99999999","99999999","Ok"]
["2014-01-30","NOM PRENOM 5306","PSP N° 99AA99999 DU 99-99-99","","VIDE"]
["2014-01-30","NOM PRENOM 5307","TEL 99999999","99999999","Ok"]
["2014-01-30","NOM PRENOM 5308","CEL 99999999","99999999","Ok"]
["2014-01-30","NOM PRENOM 5309","CVNI C 9999999999 DU 99/9/99 AU 99/9/99","","VIDE"]
["2014-01-30","NOM PRENOM 5310","CNI C9999.9999.99 DU 99/99/9999","","VIDE"]
["2014-01-30","NOM PRENOM 5311","TEL 99999999","99999999","Ok"]
["2014-01-30","NOM PRENOM 5312",null,"","VIDE"]
["2014-01-30","NOM PRENOM 5313","CNI C 9999999999 DU 99/99/99 AU 99/99/99","","VIDE"]
["2014-01-30","NOM PRENOM 5314","99AB99999 DU 99.99.9999 ET ATT N°9999-",{"$f":"gettel(C5315)","v":""},{"$f":"IF(LEN(D5315)=0,\"VIDE\",IF(LEN(D5315)=8,\"Ok\",\"?\"))","v":"VIDE"}]
["2014-01-30","NOM PRENOM 5315",null,"","VIDE"]
["2014-01-30","NOM PRENOM 5316",null,"","VIDE"]
["2014-01-30","NOM PRENOM 5317","TEL 99.99.99.99","99999999","Ok"]
["2014-01-30","NOM PRENOM 5318",null,"","VIDE"]
["2014-01-30","NOM PRENOM 5319","CNI N° C 9999999999 DU 99/99/9999 AU 99/99/9999","","VIDE"]
["2014-01-30","NOM PRENOM 5320","VAL 99/99/9999 CEL 99999999","99999999","Ok"]
["2014-01-30","NOM PRENOM 5321","val 99/99/9999 cel 99999999","99999999","Ok"]
["2014-01-30","NOM PRENOM 5322",null,"","VIDE"]
["2014-01-30","NOM PRENOM 5323","TEL 99999999","99999999","Ok"]
["2014-01-30","NOM PRENOM 5324",null,"","VIDE"]
["2014-01-30","NOM PRENOM 5325","CNI N° C9999999999 DU 99/99/9999","","VIDE"]
["2014-01-30","NOM PRENOM 5326",null,"","VIDE"]
["2014-01-30","NOM PRENOM 5327",99999999,"99999999","Ok"]
["2014-01-30","NOM PRENOM 5328","cni c 9999 9999 99","","VIDE"]
["2014-01-30","NOM PRENOM 5329","PASS N 99AB99999 DU 99/99/9999 AU 99/99/9999","","VIDE"]
["2014-01-30","NOM PRENOM 5330","TEL 99.999.99.99",{"$f":"gettel(C5331)","v":"999999999"},"?"]
["2014-01-30","NOM PRENOM 5331","CNI C 9999999999 DU 99/99/99","","VIDE"]
["2014-01-30","NOM PRENOM 5332",null,"","VIDE"]
["2014-01-30","NOM PRENOM 5333","TEL 99999999","99999999","Ok"]
["2014-01-30","NOM PRENOM 5334",null,"","VIDE"]
["2014-01-30","NOM PRENOM 5335","CNI N9 C 9999.9999.99 DU 99.99.9999 M'BAHIAKRO","","VIDE"]
["2014-01-30","NOM PRENOM 5336","cel 99999999","99999999","Ok"]
["2014-01-30","NOM PRENOM 5337","TEL 99999999","99999999","Ok"]
["2014-01-30","NOM PRENOM 5338","CNI C9999999999 DU 99/99/9999 AU 99/99/9999","","VIDE"]
["2014-01-30","NOM PRENOM 5339","TEL  99999999","99999999","Ok"]
["2014-01-30","NOM PRENOM 5340","TEL 99999999","99999999","Ok"]
["2014-01-30","NOM PRENOM 5341","val 99/99/9999 cel 99999999","99999999","Ok"]
["2014-01-30","NOM PRENOM 5342",null,"","VIDE"]
["2014-01-30","NOM PRENOM 5343","TEL99999999","99999999","Ok"]
["2014-01-30","NOM PRENOM 5344",null,"","VIDE"]
["2014-01-30","NOM PRENOM 5345",null,"","VIDE"]
["2014-01-30","NOM PRENOM 5346",null,"","VIDE"]
["2014-01-30","NOM PRENOM 5347","PC N° 99-99-99999999 DU 99.99.9999","","VIDE"]
["2014-01-30","NOM PRENOM 5348",null,"","VIDE"]
["2014-01-30","NOM PRENOM 5349",null,"","VIDE"]
["2014-01-30","NOM PRENOM 5350","ATD N°999.9999.99.99.PU.9 DU 99.99.9999","","VIDE"]
["2014-01-30","NOM PRENOM 5351",null,"","VIDE"]
["2014-01-30","NOM PRENOM 5352","TEL 99.99.99.99","99999999","Ok"]
["2014-01-30","NOM PRENOM 5353","CEL 99999999","99999999","Ok"]
["2014-01-30","NOM PRENOM 5354",null,"","VIDE"]
["2014-01-30","NOM PRENOM 5355","TEL 99.99.99.99","99999999","Ok"]
["2014-01-30","NOM PRENOM 5356","CIC NIGERIA N° 99999999NG DU 99/99/9999 AU 99/99/9999","","VIDE"]
["2014-01-30","NOM PRENOM 5357","TEL 99999999","99999999","Ok"]
["2014-01-30","NOM PRENOM 5358","TEL 99999999","99999999","Ok"]
["2014-01-30","NOM PRENOM 5359","TEL 99999999","99999999","Ok"]
["2014-01-30","NOM PRENOM 5360",null,"","VIDE"]
["2014-01-30","NOM PRENOM 5361","TEL 99.99.99.99","99999999","Ok"]
["2014-01-30","NOM PRENOM 5362",null,"","VIDE"]
["2014-01-30","NOM PRENOM 5363","TEL 99999999","99999999","Ok"]
["2014-01-30","NOM PRENOM 5364","val 99/99/9999 cel 99999999","99999999","Ok"]
["2014-01-30","NOM PRENOM 5365","TEL 99999999","99999999","Ok"]
["2014-01-30","NOM PRENOM 5366","TEL 99999999","99999999","Ok"]
["2014-01-30","NOM PRENOM 5367",null,"","VIDE"]
["2014-01-30","NOM PRENOM 5368","CNI C9999999999 DU 99/99/9999 AU 99/99/9999","","VIDE"]
["2014-01-30","NOM PRENOM 5369",null,"","VIDE"]
["2014-01-30","NOM PRENOM 5370",null,"","VIDE"]
["2014-01-30","NOM PRENOM 5371",null,"","VIDE"]
["2014-01-30","NOM PRENOM 5372",99999999,"99999999","Ok"]
["2014-01-30","NOM PRENOM 5373",null,"","VIDE"]
["2014-01-30","NOM PRENOM 5374","TEL 99999999","99999999","Ok"]
["2014-01-30","NOM PRENOM 5375","99.99.9999 TEL 99.99.99.99","99999999","Ok"]
["2014-01-30","NOM PRENOM 5376","VAL 99/99/9999 CEL 99999999","99999999","Ok"]
["2014-01-30","NOM PRENOM 5377",null,"","VIDE"]
["2014-01-30","NOM PRENOM 5378",null,{"$f":"gettel(C5379)","v":""},{"$f":"IF(LEN(D5379)=0,\"VIDE\",IF(LEN(D5379)=8,\"Ok\",\"?\"))","v":"VIDE"}]
["2014-01-30","NOM PRENOM 5379",null,"","VIDE"]
["2014-01-30","NOM PRENOM 5380","CNI C9999999999 DU 99/99/9999 AU 99/99/9999","","VIDE"]
["2014-01-30","NOM PRENOM 5381",99999999,"99999999","Ok"]
["2014-01-30","NOM PRENOM 5382","CNI C9999.9999.99 DU 99/99/9999","","VIDE"]
["2014-01-30","NOM PRENOM 5383","CNI N9 C 9999.9999.99 du 99.99.9999 ASSIKOI","","VIDE"]
["2014-01-30","NOM PRENOM 5384","CEL:99999999","99999999","Ok"]
["2014-01-30","NOM PRENOM 5385","CNI C 9999999999 DU 99/99/99","","VIDE"]
["2014-01-30","NOM PRENOM 5386","TEL 99.99.99.99","99999999","Ok"]
["2014-01-30","NOM PRENOM 5387","CIC N° 999999/CGMA/CI VAL 99/99/9999","","VIDE"]
["2014-01-30","NOM PRENOM 5388","CNI C9999999999 DU 99/99/9999 AU 99/99/9999","","VIDE"]
["2014-01-30","NOM PRENOM 5389",99999999,"99999999","Ok"]
["2014-01-30","NOM PRENOM 5390","CEL 99999999","99999999","Ok"]
["2014-01-30","NOM PRENOM 5391","CEL 99999999","99999999","Ok"]
["2014-01-30","NOM PRENOM 5392",null,"","VIDE"]
["2014-01-30","NOM PRENOM 5393","CEL 99999999","99999999","Ok"]
["2014-01-30","NOM PRENOM 5394","TEL 99.99.99.99","99999999","Ok"]
["2014-01-30","NOM PRENOM 5395","TEL 99999999","99999999","Ok"]
["2014-01-30","NOM PRENOM 5396","TEL 99999999","99999999","Ok"]
["2014-01-30","NOM PRENOM 5397","TEL 99999999","99999999","Ok"]
["2014-01-30","NOM PRENOM 5398",null,"","VIDE"]
["2014-01-30","NOM PRENOM 5399","tel 99999999","99999999","Ok"]
["2014-01-30","NOM PRENOM 5400",null,"","VIDE"]
["2014-01-30","NOM PRENOM 5401","CEL 99999999","99999999","Ok"]
["2014-01-30","NOM PRENOM 5402","CEL 99.99.99.99","99999999","Ok"]
["2014-01-30","NOM PRENOM 5403","TEL 99.99.99.99","99999999","Ok"]
["2014-01-30","NOM PRENOM 5404","TEL 99999999","99999999","Ok"]
["2014-01-30","NOM PRENOM 5405","TEL 99.99.99.99","99999999","Ok"]
["2014-01-30","NOM PRENOM 5406","CNI C9999999999 DU 99/99/9999 AU 99/99/9999 A ABJ","","VIDE"]
["2014-01-30","NOM PRENOM 5407","CEL:99999999","99999999","Ok"]
["2014-01-30","NOM PRENOM 5408","CIC 9999999 DU 99.99.9999","","VIDE"]
["2014-01-30","NOM PRENOM 5409",null,"","VIDE"]
["2014-01-30","NOM PRENOM 5410","TEL 99.99.99.99","99999999","Ok"]
["2014-01-30","NOM PRENOM 5411",99,"","VIDE"]
["2014-01-30","NOM PRENOM 5412","CNI N9 C 9999.9999.99 DU 99.99.9999","","VIDE"]
["2014-01-30","NOM PRENOM 5413",99999999,"99999999","Ok"]
["2014-01-30","NOM PRENOM 5414","ATTES N 9999(999)/99/99/PU-9 DU 99/9/99 AU 99/9/99","","VIDE"]
["2014-01-30","NOM PRENOM 5415","TEL 99.99.99.99","99999999","Ok"]
["2014-01-30","NOM PRENOM 5416",null,"","VIDE"]
["2014-01-30","NOM PRENOM 5417","CEL 99999999","99999999","Ok"]
["2014-01-30","NOM PRENOM 5418",null,"","VIDE"]
["2014-01-30","NOM PRENOM 5419",null,"","VIDE"]
["2014-01-30","NOM PRENOM 5420",null,"","VIDE"]
["2014-01-30","NOM PRENOM 5421",null,"","VIDE"]
["2014-01-30","NOM PRENOM 5422",null,"","VIDE"]
["2014-01-30","NOM PRENOM 5423",null,"","VIDE"]
["2014-01-30","NOM PRENOM 5424",99999999,"99999999","Ok"]
["2014-01-30","NOM PRENOM 5425",null,"","VIDE"]
["2014-01-30","NOM PRENOM 5426",null,"","VIDE"]
["2014-01-30","NOM PRENOM 5427",null,"","VIDE"]
["2014-01-30","NOM PRENOM 5428","TEL:99-99-99-99","99999999","Ok"]
["2014-01-30","NOM PRENOM 5429",null,"","VIDE"]
["2014-01-30","NOM PRENOM 5430",null,"","VIDE"]
["2014-01-30","NOM PRENOM 5431",null,"","VIDE"]
["2014-01-30","NOM PRENOM 5432","CEL 99.99.99.99","99999999","Ok"]
["2014-01-30","NOM PRENOM 5433","ASSIMI DENE","","VIDE"]
["2014-01-30","NOM PRENOM 5434","ARDJOUMA NADIE","","VIDE"]
["2014-01-30","NOM PRENOM 5435",null,"","VIDE"]
["2014-01-30","NOM PRENOM 5436",null,"","VIDE"]
["2014-01-30","NOM PRENOM 5437",99999999,"99999999","Ok"]
["2014-01-30","NOM PRENOM 5438",null,"","VIDE"]
["2014-01-30","NOM PRENOM 5439","DIALLO ABDOULAYE","","VIDE"]
["2014-01-30","NOM PRENOM 5440",null,"","VIDE"]
["2014-01-30","NOM PRENOM 5441","TEL 99999999","99999999","Ok"]
["2014-01-30","NOM PRENOM 5442",null,{"$f":"gettel(C5443)","v":""},{"$f":"IF(LEN(D5443)=0,\"VIDE\",IF(LEN(D5443)=8,\"Ok\",\"?\"))","v":"VIDE"}]
["2014-01-30","NOM PRENOM 5443","TEL 99999999","99999999","Ok"]
["2014-01-30","NOM PRENOM 5444",null,"","VIDE"]
["2014-01-30","NOM PRENOM 5445","TEL 99.99.99.99","99999999","Ok"]
["2014-01-30","NOM PRENOM 5446","TEL 99999999","99999999","Ok"]
["2014-01-30","NOM PRENOM 5447","TEL 99999999","99999999","Ok"]
["2014-01-30","NOM PRENOM 5448","CEL 99.99.99.99","99999999","Ok"]
["2014-01-30","NOM PRENOM 5449",null,"","VIDE"]
["2014-01-30","NOM PRENOM 5450",null,"","VIDE"]
["2014-01-30","NOM PRENOM 5451","TEL 99999999","99999999","Ok"]
["2014-01-31","NOM PRENOM 5452",null,"","VIDE"]
["2014-01-31","NOM PRENOM 5453",null,"","VIDE"]
["2014-01-31","NOM PRENOM 5454","TEL 99999999","99999999","Ok"]
["2014-01-31","NOM PRENOM 5455","DU 99/99/9999","","VIDE"]
["2014-01-31","NOM PRENOM 5456","VAL 99/99/9999 CEL 99999999","99999999","Ok"]
["2014-01-31","NOM PRENOM 5457","CNI N° C9999999999 DU 99/99/9999","","VIDE"]
["2014-01-31","NOM PRENOM 5458",null,"","VIDE"]
["2014-01-31","NOM PRENOM 5459","val 99/99/9999 cel 99999999","99999999","Ok"]
["2014-01-31","NOM PRENOM 5460","CNI N° C9999999999 DU 99/99/9999","","VIDE"]
["2014-01-31","NOM PRENOM 5461","TEL:99-99-99-99","99999999","Ok"]
["2014-01-31","NOM PRENOM 5462","TEL.99.99.99.99","99999999","Ok"]
["2014-01-31","NOM PRENOM 5463","CEL 99999999","99999999","Ok"]
["2014-01-31","NOM PRENOM 5464",null,"","VIDE"]
["2014-01-31","NOM PRENOM 5465","TEL 99.99.99.99","99999999","Ok"]
["2014-01-31","NOM PRENOM 5466","CNI N° C9999 9999 99 DU 99/99/9999 AU 99/99/9999","","VIDE"]
["2014-01-31","NOM PRENOM 5467",null,"","VIDE"]
["2014-01-31","NOM PRENOM 5468","CEL 99999999","99999999","Ok"]
["2014-01-31","NOM PRENOM 5469","TEL 99.99.99.99","99999999","Ok"]
["2014-01-31","NOM PRENOM 5470","tel 99999999","99999999","Ok"]
["2014-01-31","NOM PRENOM 5471",null,"","VIDE"]
["2014-01-31","NOM PRENOM 5472","CNI C 9999999999 DU 99/9/99 AU 99/9/99","","VIDE"]
["2014-01-31","NOM PRENOM 5473",null,"","VIDE"]
["2014-01-31","NOM PRENOM 5474",null,"","VIDE"]
["2014-01-31","NOM PRENOM 5475",null,"","VIDE"]
["2014-01-31","NOM PRENOM 5476","CNI N° C9999 9999 99 DU 99/99/9999 AU 99/99/9999","","VIDE"]
["2014-01-31","NOM PRENOM 5477","CNI C9999.9999.99 DU 99/99/9999","","VIDE"]
["2014-01-31","NOM PRENOM 5478",null,"","VIDE"]
["2014-01-31","NOM PRENOM 5479","CNI C9999.9999.99 DU 99/99/9999","","VIDE"]
["2014-01-31","NOM PRENOM 5480","DU 99.99.99","","VIDE"]
["2014-01-31","NOM PRENOM 5481","CNI C9999999999 DU 99/99/9999 AU 99/99/9999","","VIDE"]
["2014-01-31","NOM PRENOM 5482",null,"","VIDE"]
["2014-01-31","NOM PRENOM 5483",null,"","VIDE"]
["2014-01-31","NOM PRENOM 5484","TEL 99999999","99999999","Ok"]
["2014-01-31","NOM PRENOM 5485",null,"","VIDE"]
["2014-01-31","NOM PRENOM 5486",null,"","VIDE"]
["2014-01-31","NOM PRENOM 5487",null,"","VIDE"]
["2014-01-31","NOM PRENOM 5488","9999 99 DU 99.99.99 AU 99.99.99","","VIDE"]
["2014-01-31","NOM PRENOM 5489","TEL 99.99.99.99","99999999","Ok"]
["2014-01-31","NOM PRENOM 5490",null,"","VIDE"]
["2014-01-31","NOM PRENOM 5491","CNI N 9C 9999.9999.99 DU 99.99.9999 SONGON","","VIDE"]
["2014-01-31","NOM PRENOM 5492","CNI N 9C 9999.9999.99 DU 99.99.9999 SONGON","","VIDE"]
["2014-01-31","NOM PRENOM 5493",null,"","VIDE"]
["2014-01-31","NOM PRENOM 5494","TEL 99.99.99.99","99999999","Ok"]
["2014-01-31","NOM PRENOM 5495",null,"","VIDE"]
["2014-01-31","NOM PRENOM 5496","PASS ESPAGNE N AAG999999 DU 99/9/99 AU 9/9/99","","VIDE"]
["2014-01-31","NOM PRENOM 5497","CNI N° C9999999999 DU 99/99/9999","","VIDE"]
["2014-01-31","NOM PRENOM 5498","ATTEST N 999999999999E/99-99/MI/ONI/DECI DU 99/99/9999 AU 99/99/9999","","VIDE"]
["2014-01-31","NOM PRENOM 5499","CNI C 9999 9999 99 DU 99/99/9999 AU 99/99/9999","","VIDE"]
["2014-01-31","NOM PRENOM 5500","VAL 99/99/9999 CEL 99999999","99999999","Ok"]
["2014-01-31","NOM PRENOM 5501",null,"","VIDE"]
["2014-01-31","NOM PRENOM 5502","TEL 99999999","99999999","Ok"]
["2014-01-31","NOM PRENOM 5503","CNI C 9999999999 DU 99/9/99 AU 99/9/99","","VIDE"]
["2014-01-31","NOM PRENOM 5504",null,"","VIDE"]
["2014-01-31","NOM PRENOM 5505","CEL 99999999","99999999","Ok"]
["2014-01-31","NOM PRENOM 5506","TEL 99.99.99.99",{"$f":"gettel(C5507)","v":"99999999"},{"$f":"IF(LEN(D5507)=0,\"VIDE\",IF(LEN(D5507)=8,\"Ok\",\"?\"))","v":"Ok"}]
["2014-01-31","NOM PRENOM 5507","CNI C9999.9999.99 DU 99/99/9999","","VIDE"]
["2014-01-31","NOM PRENOM 5508",null,"","VIDE"]
["2014-01-31","NOM PRENOM 5509","TEL 99.99.99.99","99999999","Ok"]
["2014-01-31","NOM PRENOM 5510",null,"","VIDE"]
["2014-01-31","NOM PRENOM 5511","TEL 99999999","99999999","Ok"]
["2014-01-31","NOM PRENOM 5512","CNI C9999999999 DU 99/99/9999 AU 99/99/9999","","VIDE"]
["2014-01-31","NOM PRENOM 5513",null,"","VIDE"]
["2014-01-31","NOM PRENOM 5514",null,"","VIDE"]
["2014-01-31","NOM PRENOM 5515","CNI N9 C 9999.9999.99 DU 99.99.9999 ASSIKOI","","VIDE"]
["2014-01-31","NOM PRENOM 5516",null,"","VIDE"]
["2014-01-31","NOM PRENOM 5517","CNI N° C9999 9999 99 DU 99/99/9999","","VIDE"]
["2014-01-31","NOM PRENOM 5518",null,"","VIDE"]
["2014-01-31","NOM PRENOM 5519",null,"","VIDE"]
["2014-01-31","NOM PRENOM 5520","TEL 99.99.99.99","99999999","Ok"]
["2014-01-31","NOM PRENOM 5521","ATTEST N 999-9999-99-99-999/PU9 DU 99/99/99 AU 99/99/9999","","VIDE"]
["2014-01-31","NOM PRENOM 5522","CNI C9999.9999.99 DU 99/99/9999","","VIDE"]
["2014-01-31","NOM PRENOM 5523","CNI C9999999999 DU 99/99/9999 AU 99/99/9999 A SOUBRE","","VIDE"]
["2014-01-31","NOM PRENOM 5524","CEL 99999999","99999999","Ok"]
["2014-01-31","NOM PRENOM 5525",null,"","VIDE"]
["2014-01-31","NOM PRENOM 5526","TEL:99-99-99-99","99999999","Ok"]
["2014-01-31","NOM PRENOM 5527","TEL 99.99.99.99","99999999","Ok"]
["2014-01-31","NOM PRENOM 5528",null,"","VIDE"]
["2014-01-31","NOM PRENOM 5529",null,"","VIDE"]
["2014-01-31","NOM PRENOM 5530","CEL 99.99.99.99","99999999","Ok"]
["2014-01-31","NOM PRENOM 5531","CNI C9999.9999.99 DU 99/99/9999","","VIDE"]
["2014-01-31","NOM PRENOM 5532",null,"","VIDE"]
["2014-01-31","NOM PRENOM 5533",99999999,"99999999","Ok"]
["2014-01-31","NOM PRENOM 5534",null,"","VIDE"]
["2014-01-31","NOM PRENOM 5535","TEL.99.99.99.99","99999999","Ok"]
["2014-01-31","NOM PRENOM 5536","TEL.99.99.99.99","99999999","Ok"]
["2014-01-31","NOM PRENOM 5537","CNI N9 C 9999.9999.99 DU 99.99.9999","","VIDE"]
["2014-01-31","NOM PRENOM 5538","CNI N° C 9999999999 DU 99/99/9999 AU 99/99/9999","","VIDE"]
["2014-01-31","NOM PRENOM 5539","TEL 99999999","99999999","Ok"]
["2014-01-31","NOM PRENOM 5540","cel 99999999","99999999","Ok"]
["2014-01-31","NOM PRENOM 5541",null,"","VIDE"]
["2014-01-31","NOM PRENOM 5542","TEL 99.99.99.99","99999999","Ok"]
["2014-01-31","NOM PRENOM 5543","CNI CC 9999999999 DU 99/9/99 AU 99/9/99","","VIDE"]
["2014-01-31","NOM PRENOM 5544","CNI C 9999 9999 99 DU 99/99/99 - TEL 99999999","99999999","Ok"]
["2014-01-31","NOM PRENOM 5545","TEL 99.99.99.99","99999999","Ok"]
["2014-01-31","NOM PRENOM 5546",null,"","VIDE"]
["2014-01-31","NOM PRENOM 5547","val 99/99/9999 cel 99999999","99999999","Ok"]
["2014-01-31","NOM PRENOM 5548","CNI C 9999999999 DU 99/99/99 AU 99/99/99","","VIDE"]
["2014-01-31","NOM PRENOM 5549",null,"","VIDE"]
["2014-01-31","NOM PRENOM 5550","TEL 99999999","99999999","Ok"]
["2014-01-31","NOM PRENOM 5551","val 99/99/9999 cel 99999999","99999999","Ok"]
["2014-01-31","NOM PRENOM 5552",null,"","VIDE"]
["2014-01-31","NOM PRENOM 5553","CNI C9999999999 DU 99/99/9999 AU 99/99/9999","","VIDE"]
["2014-01-31","NOM PRENOM 5554","TEL 99999999","99999999","Ok"]
["2014-01-31","NOM PRENOM 5555","CNI C 9999 9999 99 DU 99/99/99 - TEL 99999999","99999999","Ok"]
["2014-01-31","NOM PRENOM 5556","TEL 99.99.99.99","99999999","Ok"]
["2014-01-31","NOM PRENOM 5557","CNI C 9999999999 DU 99/99/99","","VIDE"]
["2014-01-31","NOM PRENOM 5558","TEL 99.99.99.99","99999999","Ok"]
["2014-01-31","NOM PRENOM 5559","val 99/99/9999 cel 99999999","99999999","Ok"]
["2014-01-31","NOM PRENOM 5560","TEL 99999999","99999999","Ok"]
["2014-01-31","NOM PRENOM 5561","CEL 99999999","99999999","Ok"]
["2014-01-31","NOM PRENOM 5562","val 99/99/9999 cel 99999999","99999999","Ok"]
["2014-01-31","NOM PRENOM 5563","CNI C 9999999999 DU 99/9/99 A9U 99/9/99","","VIDE"]
["2014-01-31","NOM PRENOM 5564","TEL 99.99.99.99","99999999","Ok"]
["2014-01-31","NOM PRENOM 5565","TEL 99.99.99.99","99999999","Ok"]
["2014-01-31","NOM PRENOM 5566","CNI N° C9999 9999 99 DU 99/99/9999","","VIDE"]
["2014-01-31","NOM PRENOM 5567","TEL 99999999","99999999","Ok"]
["2014-01-31","NOM PRENOM 5568",null,"","VIDE"]
["2014-01-31","NOM PRENOM 5569","CNI C 9999999999 DU 99/9/99 AU 99/9/99","","VIDE"]
["2014-01-31","NOM PRENOM 5570",99999999,{"$f":"gettel(C5571)","v":"99999999"},{"$f":"IF(LEN(D5571)=0,\"VIDE\",IF(LEN(D5571)=8,\"Ok\",\"?\"))","v":"Ok"}]
["2014-01-31","NOM PRENOM 5571","TEL 99999999","99999999","Ok"]
["2014-01-31","NOM PRENOM 5572","val 99/99/9999","","VIDE"]
["2014-01-31","NOM PRENOM 5573","CNI C9999999999 DU 99/9/99 AU 99/9/99","","VIDE"]
["2014-01-31","NOM PRENOM 5574","TEL 99999999","99999999","Ok"]
["2014-01-31","NOM PRENOM 5575","CNI N9 C 9999.9999.99 DU 99.99.9999 GAGNOA","","VIDE"]
["2014-01-31","NOM PRENOM 5576","TEL 99999999","99999999","Ok"]
["2014-01-31","NOM PRENOM 5577","DU 99/99/9999 AU 99/99/9999","","VIDE"]
["2014-01-31","NOM PRENOM 5578","TEL 99999999","99999999","Ok"]
["2014-01-31","NOM PRENOM 5579","CNI C9999.9999.99 DU 99.99.99","","VIDE"]
["2014-01-31","NOM PRENOM 5580","DU 99/99/9999","","VIDE"]
["2014-01-31","NOM PRENOM 5581","AU 99/99/9999","","VIDE"]
["2014-01-31","NOM PRENOM 5582",null,"","VIDE"]
["2014-01-31","NOM PRENOM 5583",null,"","VIDE"]
["2014-01-31","NOM PRENOM 5584","CNI N° C9999 9999 999 DU 99/99/9999 AU 99/99/9999","","VIDE"]
["2014-01-31","NOM PRENOM 5585","CNI N° C9999 9999 99 DU 99/99/9999 AU 99/99/9999","","VIDE"]
["2014-01-31","NOM PRENOM 5586","TEL 99999999","99999999","Ok"]
["2014-01-31","NOM PRENOM 5587","CNI C 9999 9999 99 DU 99/99/9999 AU 99/99/9999","","VIDE"]
["2014-01-31","NOM PRENOM 5588",null,"","VIDE"]
["2014-01-31","NOM PRENOM 5589","CNI N° C9999 9999 99 DU 99/99/9999 AU 99/99/9999","","VIDE"]
["2014-01-31","NOM PRENOM 5590","DU 99/99/9999 AU 99/99/9999","","VIDE"]
["2014-01-31","NOM PRENOM 5591","CNI N9 C 9999.9999.99 DU 99.99.9999","","VIDE"]
["2014-01-31","NOM PRENOM 5592",null,"","VIDE"]
["2014-01-31","NOM PRENOM 5593","CNI N9 C 9999.9999.99 DU 99.99.9999","","VIDE"]
["2014-01-31","NOM PRENOM 5594","PAS N° A99999999 DU 99.99.9999","","VIDE"]
["2014-01-31","NOM PRENOM 5595",null,"","VIDE"]
["2014-01-31","NOM PRENOM 5596","CNI N9 C 9999.9999.99 DU 99.99.9999","","VIDE"]
["2014-01-31","NOM PRENOM 5597","TEL 99.99.99.99","99999999","Ok"]
["2014-01-31","NOM PRENOM 5598","CNI C9999999999 DU 99/99/9999 AU 99/99/9999","","VIDE"]
["2014-01-31","NOM PRENOM 5599",null,"","VIDE"]
["2014-01-31","NOM PRENOM 5600",null,"","VIDE"]
["2014-01-31","NOM PRENOM 5601","CNI C9999999999 DU 99/99/9999 AU 99/99/9999","","VIDE"]
["2014-01-31","NOM PRENOM 5602","TEL 9999999",{"$f":"gettel(C5603)","v":"9999999"},"?"]
["2014-01-31","NOM PRENOM 5603","CNI C 9999999999 DU 99/9/99 AU 99/9/99","","VIDE"]
["2014-01-31","NOM PRENOM 5604","CNI C9999999999 DU 99/99/9999 AU 99/99/9999","","VIDE"]
["2014-01-31","NOM PRENOM 5605",null,"","VIDE"]
["2014-01-31","NOM PRENOM 5606","CNI C 9999 9999 99 DU 99/99/9999 AU 99/99/9999","","VIDE"]
["2014-01-31","NOM PRENOM 5607","TEL 99999999","99999999","Ok"]
["2014-01-31","NOM PRENOM 5608","CNI N9 C 9999.9999.99 DU 99.99.9999","","VIDE"]
["2014-01-31","NOM PRENOM 5609","CNI N9 C 9999.9999.99 DU 99.99.9999","","VIDE"]
["2014-01-31","NOM PRENOM 5610","TEL 99.99.99.99","99999999","Ok"]
["2014-01-31","NOM PRENOM 5611","CNI N9 C 9999.9999.99 DU 99.99.9999","","VIDE"]
["2014-01-31","NOM PRENOM 5612","TEL 99999999","99999999","Ok"]
["2014-01-31","NOM PRENOM 5613","TEL 99.99.99.99","99999999","Ok"]
["2014-01-31","NOM PRENOM 5614","TEL 99999999","99999999","Ok"]
["2014-01-31","NOM PRENOM 5615","CNI C9999999999 DU 99/99/9999 AU 99/99/9999","","VIDE"]
["2014-01-31","NOM PRENOM 5616","TEL 99.99.99.99","99999999","Ok"]
["2014-01-31","NOM PRENOM 5617","DU 99.99.99","","VIDE"]
["2014-01-31","NOM PRENOM 5618","TEL 99.99.99.99","99999999","Ok"]
["2014-01-31","NOM PRENOM 5619","VAL99/99/9999 CEL99999999","99999999","Ok"]
["2014-01-31","NOM PRENOM 5620","TEL 99999999","99999999","Ok"]
["2014-01-31","NOM PRENOM 5621","TEL 99999999","99999999","Ok"]
["2014-01-31","NOM PRENOM 5622",null,"","VIDE"]
["2014-01-31","NOM PRENOM 5623","TEL 99999999","99999999","Ok"]
["2014-01-31","NOM PRENOM 5624","TEL 99999999","99999999","Ok"]
["2014-01-31","NOM PRENOM 5625","CNI C9999999999 DU 99/99/9999 AU 99/99/9999","","VIDE"]
["2014-01-31","NOM PRENOM 5626",null,"","VIDE"]
["2014-01-31","NOM PRENOM 5627","CNI C9999999999 DU 99/99/9999 AU 99/99/9999","","VIDE"]
["2014-01-31","NOM PRENOM 5628",null,"","VIDE"]
["2014-01-31","NOM PRENOM 5629","CNI C9999999999 DU 99/99/99","","VIDE"]
["2014-01-31","NOM PRENOM 5630",null,"","VIDE"]
["2014-01-31","NOM PRENOM 5631",null,"","VIDE"]
["2014-01-31","NOM PRENOM 5632","TEL 99.99.99.99","99999999","Ok"]
["2014-01-31","NOM PRENOM 5633","TEL 99999999","99999999","Ok"]
["2014-01-31","NOM PRENOM 5634","CEL 99999999",{"$f":"gettel(C5635)","v":"99999999"},{"$f":"IF(LEN(D5635)=0,\"VIDE\",IF(LEN(D5635)=8,\"Ok\",\"?\"))","v":"Ok"}]
["2014-01-31","NOM PRENOM 5635","VAL 99/99/9999 CEL 99999999","99999999","Ok"]
["2014-01-31","NOM PRENOM 5636",null,"","VIDE"]
["2014-01-31","NOM PRENOM 5637",null,"","VIDE"]
["2014-01-31","NOM PRENOM 5638",null,"","VIDE"]
["2014-01-31","NOM PRENOM 5639","TEL 99.99.99.99","99999999","Ok"]
["2014-01-31","NOM PRENOM 5640",null,"","VIDE"]
["2014-01-31","NOM PRENOM 5641",null,"","VIDE"]
["2014-01-31","NOM PRENOM 5642","ZI KOUDOUGOU","","VIDE"]
["2014-01-31","NOM PRENOM 5643",null,"","VIDE"]
["2014-01-31","NOM PRENOM 5644",null,"","VIDE"]
["2014-01-31","NOM PRENOM 5645",null,"","VIDE"]
["2014-01-31","NOM PRENOM 5646",null,"","VIDE"]
["2014-01-31","NOM PRENOM 5647",null,"","VIDE"]
["2014-01-31","NOM PRENOM 5648","val 99/99/9999 cel 99999999","99999999","Ok"]
["2014-01-31","NOM PRENOM 5649","BENIN","","VIDE"]
["2014-01-31","NOM PRENOM 5650",null,"","VIDE"]
["2014-01-31","NOM PRENOM 5651","TEL 99999999","99999999","Ok"]
["2014-01-31","NOM PRENOM 5652",null,"","VIDE"]
["2014-01-31","NOM PRENOM 5653",null,"","VIDE"]
["2014-01-31","NOM PRENOM 5654","cel 99999999","99999999","Ok"]
["2014-01-31","NOM PRENOM 5655","TEL 99.99.99.99","99999999","Ok"]
["2014-01-31","NOM PRENOM 5656",null,"","VIDE"]
["2014-01-31","NOM PRENOM 5657",null,"","VIDE"]
["2014-01-31","NOM PRENOM 5658","TEL 99999999","99999999","Ok"]
["2014-01-31","NOM PRENOM 5659",null,"","VIDE"]
["2014-01-31","NOM PRENOM 5660","CEL 99999999","99999999","Ok"]
["2014-01-31","NOM PRENOM 5661",null,"","VIDE"]
["2014-01-31","NOM PRENOM 5662",null,"","VIDE"]
["2014-01-31","NOM PRENOM 5663","TEL 99999999","99999999","Ok"]
["2014-01-31","NOM PRENOM 5664",null,"","VIDE"]
["2014-01-31","NOM PRENOM 5665",null,"","VIDE"]
["2014-01-31","NOM PRENOM 5666","TEL 99999999","99999999","Ok"]
["2014-01-31","NOM PRENOM 5667",null,"","VIDE"]
["2014-01-31","NOM PRENOM 5668","TEL 99999999","99999999","Ok"]
["2014-01-31","NOM PRENOM 5669","bargo pogossada","","VIDE"]
["2014-01-31","NOM PRENOM 5670",null,"","VIDE"]
["2014-01-31","NOM PRENOM 5671",null,"","VIDE"]
["2014-01-31","NOM PRENOM 5672",99999999,"99999999","Ok"]
["2014-01-31","NOM PRENOM 5673",null,"","VIDE"]
["2014-01-31","NOM PRENOM 5674","TEL 99.99.99.99","99999999","Ok"]
["2014-01-31","NOM PRENOM 5675","SENEGAL","","VIDE"]
["2014-02-03","NOM PRENOM 5676","CNI C9999999999 DU 99.99.9999","","VIDE"]
["2014-02-03","NOM PRENOM 5677","TEL 99.99.99.99","99999999","Ok"]
["2014-02-03","NOM PRENOM 5678","cel 99999999","99999999","Ok"]
["2014-02-03","NOM PRENOM 5679","tel 99999999","99999999","Ok"]
["2014-02-03","NOM PRENOM 5680",null,"","VIDE"]
["2014-02-03","NOM PRENOM 5681","TEL 99999999","99999999","Ok"]
["2014-02-03","NOM PRENOM 5682","cel 99999999","99999999","Ok"]
["2014-02-03","NOM PRENOM 5683",null,"","VIDE"]
["2014-02-03","NOM PRENOM 5684","CNI C9999999999 DU 99.99.9999","","VIDE"]
["2014-02-03","NOM PRENOM 5685",null,"","VIDE"]
["2014-02-03","NOM PRENOM 5686","TEL:99-99-99-99","99999999","Ok"]
["2014-02-03","NOM PRENOM 5687","TEL 99999999","99999999","Ok"]
["2014-02-03","NOM PRENOM 5688","CNI C 9999999999 DU 99-99-99","","VIDE"]
["2014-02-03","NOM PRENOM 5689",null,"","VIDE"]
["2014-02-03","NOM PRENOM 5690","TEL 99999999","99999999","Ok"]
["2014-02-03","NOM PRENOM 5691",null,"","VIDE"]
["2014-02-03","NOM PRENOM 5692","TEL 99999999","99999999","Ok"]
["2014-02-03","NOM PRENOM 5693",null,"","VIDE"]
["2014-02-03","NOM PRENOM 5694","TEL99.999999","99999999","Ok"]
["2014-02-03","NOM PRENOM 5695","TEL 99999999","99999999","Ok"]
["2014-02-03","NOM PRENOM 5696",null,"","VIDE"]
["2014-02-03","NOM PRENOM 5697","TEL 99999999","99999999","Ok"]
["2014-02-03","NOM PRENOM 5698",null,{"$f":"gettel(C5699)","v":""},{"$f":"IF(LEN(D5699)=0,\"VIDE\",IF(LEN(D5699)=8,\"Ok\",\"?\"))","v":"VIDE"}]
["2014-02-03","NOM PRENOM 5699","TEL 99999999","99999999","Ok"]
["2014-02-03","NOM PRENOM 5700","TEL 99999999","99999999","Ok"]
["2014-02-03","NOM PRENOM 5701","TEL 99.99.99.99","99999999","Ok"]
["2014-02-03","NOM PRENOM 5702","TEL 99999999","99999999","Ok"]
["2014-02-03","NOM PRENOM 5703",null,"","VIDE"]
["2014-02-03","NOM PRENOM 5704","MLE 9999","","VIDE"]
["2014-02-03","NOM PRENOM 5705","TEL 99.99.99.99","99999999","Ok"]
["2014-02-03","NOM PRENOM 5706","TEL 99999999","99999999","Ok"]
["2014-02-03","NOM PRENOM 5707",null,"","VIDE"]
["2014-02-03","NOM PRENOM 5708","TEL 99.99.99.99","99999999","Ok"]
["2014-02-03","NOM PRENOM 5709","TEL 99999999","99999999","Ok"]
["2014-02-03","NOM PRENOM 5710",null,"","VIDE"]
["2014-02-03","NOM PRENOM 5711","val 99/99/9999 cel 99999999","99999999","Ok"]
["2014-02-03","NOM PRENOM 5712","CNI C 9999999999 DU 99-99-99","","VIDE"]
["2014-02-03","NOM PRENOM 5713",null,"","VIDE"]
["2014-02-03","NOM PRENOM 5714","TEL 99.99.99.99","99999999","Ok"]
["2014-02-03","NOM PRENOM 5715",null,"","VIDE"]
["2014-02-03","NOM PRENOM 5716",null,"","VIDE"]
["2014-02-03","NOM PRENOM 5717","CEL 99999999","99999999","Ok"]
["2014-02-03","NOM PRENOM 5718",null,"","VIDE"]
["2014-02-03","NOM PRENOM 5719",null,"","VIDE"]
["2014-02-03","NOM PRENOM 5720","TEL 99999999","99999999","Ok"]
["2014-02-03","NOM PRENOM 5721","TEL 99.99.99.99","99999999","Ok"]
["2014-02-03","NOM PRENOM 5722","COO99999999","","VIDE"]
["2014-02-03","NOM PRENOM 5723",null,"","VIDE"]
["2014-02-03","NOM PRENOM 5724","TEL 99999999","99999999","Ok"]
["2014-02-03","NOM PRENOM 5725","TEL 99999999","99999999","Ok"]
["2014-02-03","NOM PRENOM 5726","CNI C9999999999 DU 99/99/9999 AU 99/99/9999","","VIDE"]
["2014-02-03","NOM PRENOM 5727",99999999,"99999999","Ok"]
["2014-02-03","NOM PRENOM 5728","DU 99-99-9999 AU 99-99-9999","","VIDE"]
["2014-02-03","NOM PRENOM 5729","TEL 99.99.99.99","99999999","Ok"]
["2014-02-03","NOM PRENOM 5730",null,"","VIDE"]
["2014-02-03","NOM PRENOM 5731","TITRE DE SEJOUR N 9999999999999/MI/ONI/DIE/99 DU 99/9/99 AU 99/9/99","","VIDE"]
["2014-02-03","NOM PRENOM 5732","VAL 99/99/9999","","VIDE"]
["2014-02-03","NOM PRENOM 5733","TEL 99.99.99.99","99999999","Ok"]
["2014-02-03","NOM PRENOM 5734",null,"","VIDE"]
["2014-02-03","NOM PRENOM 5735","TEL 99.99.99.99","99999999","Ok"]
["2014-02-03","NOM PRENOM 5736",null,"","VIDE"]
["2014-02-03","NOM PRENOM 5737","DU 99-99-9999","","VIDE"]
["2014-02-03","NOM PRENOM 5738","C9999.9999.99 DU 99.99.99","","VIDE"]
["2014-02-03","NOM PRENOM 5739","CNI C 9999999999 DU 99/99/99 AU 99/99/99","","VIDE"]
["2014-02-03","NOM PRENOM 5740",null,"","VIDE"]
["2014-02-03","NOM PRENOM 5741","cel 99999999","99999999","Ok"]
["2014-02-03","NOM PRENOM 5742","CNI N°C9999999999 VAL 99.99.9999","","VIDE"]
["2014-02-03","NOM PRENOM 5743",null,"","VIDE"]
["2014-02-03","NOM PRENOM 5744","PASS CAM N 99999999 DU 99 JUIN 9999 AU 99 JUIN 9999","","VIDE"]
["2014-02-03","NOM PRENOM 5745","CNI N° C9999 9999 99 DU 99/99/9999","","VIDE"]
["2014-02-03","NOM PRENOM 5746",99999999,"99999999","Ok"]
["2014-02-03","NOM PRENOM 5747","CNIN° C9999 9999 99 DU 99/99/9999 AU 99/99/9999","","VIDE"]
["2014-02-03","NOM PRENOM 5748","TEL 99999999","99999999","Ok"]
["2014-02-03","NOM PRENOM 5749","CNI C 9999999999 DU 99/99/99 AU 99/99/99","","VIDE"]
["2014-02-03","NOM PRENOM 5750","CNI N° C9999999999 DU 99/99/9999","","VIDE"]
["2014-02-03","NOM PRENOM 5751","CNI C 9999999999 DU 99/99/99 AU 99/99/99","","VIDE"]
["2014-02-03","NOM PRENOM 5752",null,"","VIDE"]
["2014-02-03","NOM PRENOM 5753","TEL:99-99-99-99","99999999","Ok"]
["2014-02-03","NOM PRENOM 5754","CNI C 9999999999 DU 99/99/99 AU 99/9/99","","VIDE"]
["2014-02-03","NOM PRENOM 5755",null,"","VIDE"]
["2014-02-03","NOM PRENOM 5756","TEL 99.99.99.99","99999999","Ok"]
["2014-02-03","NOM PRENOM 5757","CNI C9999.9999.99 DU 99..99.99","","VIDE"]
["2014-02-03","NOM PRENOM 5758","CEL 99.99.99.99","99999999","Ok"]
["2014-02-03","NOM PRENOM 5759","TEL 99.99.99.99","99999999","Ok"]
["2014-02-03","NOM PRENOM 5760","CNI N° C 9999999999 DU 99/99/9999","","VIDE"]
["2014-02-03","NOM PRENOM 5761","TEL 99.99.99.99","99999999","Ok"]
["2014-02-03","NOM PRENOM 5762","CEL 99999999",{"$f":"gettel(C5763)","v":"99999999"},{"$f":"IF(LEN(D5763)=0,\"VIDE\",IF(LEN(D5763)=8,\"Ok\",\"?\"))","v":"Ok"}]
["2014-02-03","NOM PRENOM 5763","VAL 99/99/9999 CEL 99999999","99999999","Ok"]
["2014-02-03","NOM PRENOM 5764",99999999,"99999999","Ok"]
["2014-02-03","NOM PRENOM 5765","mle 9999","","VIDE"]
["2014-02-03","NOM PRENOM 5766","TEL 99.99.99.99","99999999","Ok"]
["2014-02-03","NOM PRENOM 5767","CNI N9 C 9999.9999.99 DU 99.99.9999","","VIDE"]
["2014-02-03","NOM PRENOM 5768","CNI C 9999999999 DU 99/9/99 AU 99/9/99","","VIDE"]
["2014-02-03","NOM PRENOM 5769","TEL 99999999","99999999","Ok"]
["2014-02-03","NOM PRENOM 5770","+ PC","","VIDE"]
["2014-02-03","NOM PRENOM 5771","9999 9999 99 DU 99.99.99 AU 99.99.99","","VIDE"]
["2014-02-03","NOM PRENOM 5772","TEL 99999999","99999999","Ok"]
["2014-02-03","NOM PRENOM 5773","TEL 99999999","99999999","Ok"]
["2014-02-03","NOM PRENOM 5774","TEL 99.99.99.99","99999999","Ok"]
["2014-02-03","NOM PRENOM 5775","TEL 99999999","99999999","Ok"]
["2014-02-03","NOM PRENOM 5776","CNI N° C9999999999 DU 99/99/9999","","VIDE"]
["2014-02-03","NOM PRENOM 5777",null,"","VIDE"]
["2014-02-03","NOM PRENOM 5778","TEL 99999999","99999999","Ok"]
["2014-02-03","NOM PRENOM 5779",null,"","VIDE"]
["2014-02-03","NOM PRENOM 5780",null,"","VIDE"]
["2014-02-03","NOM PRENOM 5781",null,"","VIDE"]
["2014-02-03","NOM PRENOM 5782",99999999,"99999999","Ok"]
["2014-02-03","NOM PRENOM 5783",null,"","VIDE"]
["2014-02-03","NOM PRENOM 5784","TEL 99999999","99999999","Ok"]
["2014-02-03","NOM PRENOM 5785","TEL 99.99.99.99","99999999","Ok"]
["2014-02-03","NOM PRENOM 5786","CNI C9999.9999.99 DU 99/99/9999","","VIDE"]
["2014-02-03","NOM PRENOM 5787","CNI C9999999999 DU 99/99/9999 AU 99/99/9999","","VIDE"]
["2014-02-03","NOM PRENOM 5788","CNI C9999999999 DU 99/99/9999 AU 99/99/9999 A IBOGUHE","","VIDE"]
["2014-02-03","NOM PRENOM 5789",null,"","VIDE"]
["2014-02-03","NOM PRENOM 5790",null,"","VIDE"]
["2014-02-03","NOM PRENOM 5791","CNI C 9999 9999 99 DU 99 99 9999 AU 99 99 9999","","VIDE"]
["2014-02-03","NOM PRENOM 5792",null,"","VIDE"]
["2014-02-03","NOM PRENOM 5793","TEL 99.99.99.99","99999999","Ok"]
["2014-02-03","NOM PRENOM 5794",null,"","VIDE"]
["2014-02-03","NOM PRENOM 5795","CNI C9999999999 DU 99/99/9999 AU 99/99/9999","","VIDE"]
["2014-02-03","NOM PRENOM 5796","TEL 99.99.99.99","99999999","Ok"]
["2014-02-03","NOM PRENOM 5797",null,"","VIDE"]
["2014-02-03","NOM PRENOM 5798",null,"","VIDE"]
["2014-02-03","NOM PRENOM 5799",null,"","VIDE"]
["2014-02-03","NOM PRENOM 5800","CNI C9999.9999.99 DU 99/99/9999","","VIDE"]
["2014-02-03","NOM PRENOM 5801","val 99/99/9999 cel 99999999","99999999","Ok"]
["2014-02-03","NOM PRENOM 5802","DU 99.99.99","","VIDE"]
["2014-02-03","NOM PRENOM 5803","CEL 99999999","99999999","Ok"]
["2014-02-03","NOM PRENOM 5804","CNI C9999.9999.99 DU 99.99.99","","VIDE"]
["2014-02-03","NOM PRENOM 5805","TEL 99.99.99.99","99999999","Ok"]
["2014-02-03","NOM PRENOM 5806","TEL 99.99.99.99","99999999","Ok"]
["2014-02-03","NOM PRENOM 5807","CEL 99999999","99999999","Ok"]
["2014-02-03","NOM PRENOM 5808",null,"","VIDE"]
["2014-02-03","NOM PRENOM 5809","CNI C9999999999 DU 99/99/9999 AU 99/99/9999","","VIDE"]
["2014-02-03","NOM PRENOM 5810","PC 99-99-99999999 DU 99/99/9999 + AI","","VIDE"]
["2014-02-03","NOM PRENOM 5811","TEL 99.99.99.99","99999999","Ok"]
["2014-02-03","NOM PRENOM 5812","CNI C 9999999999 DU 99/9/99 AU 99/9/99","","VIDE"]
["2014-02-03","NOM PRENOM 5813","CNI C9999999999 DU 99/99/9999 AU 99/99/9999 A ABJ","","VIDE"]
["2014-02-03","NOM PRENOM 5814",null,"","VIDE"]
["2014-02-03","NOM PRENOM 5815","TEL 99.99.99.99","99999999","Ok"]
["2014-02-03","NOM PRENOM 5816","CNI C9999999999 DU 99/99/9999 AU 99/99/9999 A ABJ","","VIDE"]
["2014-02-03","NOM PRENOM 5817","MLE 9999","","VIDE"]
["2014-02-03","NOM PRENOM 5818","TEL 99.99.99.99","99999999","Ok"]
["2014-02-03","NOM PRENOM 5819","CNI C9999999999 DU 99/99/9999","","VIDE"]
["2014-02-03","NOM PRENOM 5820",99999999,"99999999","Ok"]
["2014-02-03","NOM PRENOM 5821","99AD99999 DU 99.99.9999 ET ATT N°999-","","VIDE"]
["2014-02-03","NOM PRENOM 5822","CNI C9999.9999.99 DU 99/99/9999","","VIDE"]
["2014-02-03","NOM PRENOM 5823","CNI N° C9999999999 DU 99/99/9999","","VIDE"]
["2014-02-03","NOM PRENOM 5824","TEL 99.99.99.99","99999999","Ok"]
["2014-02-03","NOM PRENOM 5825","TEL 99999999","99999999","Ok"]
["2014-02-03","NOM PRENOM 5826","DU 99.99.99",{"$f":"gettel(C5827)","v":""},{"$f":"IF(LEN(D5827)=0,\"VIDE\",IF(LEN(D5827)=8,\"Ok\",\"?\"))","v":"VIDE"}]
["2014-02-03","NOM PRENOM 5827","val  99/99/9999","","VIDE"]
["2014-02-03","NOM PRENOM 5828",99999999,"99999999","Ok"]
["2014-02-03","NOM PRENOM 5829",null,"","VIDE"]
["2014-02-03","NOM PRENOM 5830","CNI C9999.9999.99 DU 99.99.99","","VIDE"]
["2014-02-03","NOM PRENOM 5831","CEL 99.99.99.99","99999999","Ok"]
["2014-02-03","NOM PRENOM 5832","CNI C9999.9999.99 DU 99.99.99","","VIDE"]
["2014-02-03","NOM PRENOM 5833",null,"","VIDE"]
["2014-02-03","NOM PRENOM 5834","CNI C9999.9999.99 DU 99/99/9999","","VIDE"]
["2014-02-03","NOM PRENOM 5835","TEL 99.99.99.99","99999999","Ok"]
["2014-02-03","NOM PRENOM 5836","CNI C9999999999 DU 99/99/9999 AU 99/99/9999","","VIDE"]
["2014-02-03","NOM PRENOM 5837","TEL 99.99.99.99","99999999","Ok"]
["2014-02-03","NOM PRENOM 5838","CNI N° C9999999999 DU 99/99/9999","","VIDE"]
["2014-02-03","NOM PRENOM 5839","CNI C 9999999999 DU 99/9/99 AU 99/9/99","","VIDE"]
["2014-02-03","NOM PRENOM 5840","VAL 99/99/9999 CEL 99999999","99999999","Ok"]
["2014-02-03","NOM PRENOM 5841","val 99/99/9999","","VIDE"]
["2014-02-03","NOM PRENOM 5842","CNI C9999999999 DU 99/99/9999 AU 99/99/9999","","VIDE"]
["2014-02-03","NOM PRENOM 5843","CNI C 9999 9999 99 DU 99/99/9999 AU 99/99/9999","","VIDE"]
["2014-02-03","NOM PRENOM 5844","CNI C9999999999 DU 99/99/9999 AU 99/99/9999","","VIDE"]
["2014-02-03","NOM PRENOM 5845",null,"","VIDE"]
["2014-02-03","NOM PRENOM 5846","cel 99999999","99999999","Ok"]
["2014-02-03","NOM PRENOM 5847","CEL  99999999","99999999","Ok"]
["2014-02-03","NOM PRENOM 5848",null,"","VIDE"]
["2014-02-03","NOM PRENOM 5849",null,"","VIDE"]
["2014-02-03","NOM PRENOM 5850","VAL 99/99/9999 CEL 99999999","99999999","Ok"]
["2014-02-03","NOM PRENOM 5851","AU 99/99/99 PLUS PC 99/-99-99999999","","VIDE"]
["2014-02-03","NOM PRENOM 5852","DU 99/99/9999","","VIDE"]
["2014-02-03","NOM PRENOM 5853","CEL 99999999","99999999","Ok"]
["2014-02-03","NOM PRENOM 5854","CNI C9999.9999.99 DU 99/99/9999","","VIDE"]
["2014-02-03","NOM PRENOM 5855","CNI C9999999999 DU 99/99/9999 AU 99/99/9999 A OKROUYO","","VIDE"]
["2014-02-03","NOM PRENOM 5856","DU 99/99/9999","","VIDE"]
["2014-02-03","NOM PRENOM 5857","DU 99.99.99","","VIDE"]
["2014-02-03","NOM PRENOM 5858","ATTEST N 999999999999N/99-99/MEMI/ONI/DECI DU 99/99/99 AU 99/99/99","","VIDE"]
["2014-02-03","NOM PRENOM 5859",null,"","VIDE"]
["2014-02-03","NOM PRENOM 5860","CNI C9999.9999.99 DU 99/99/9999","","VIDE"]
["2014-02-03","NOM PRENOM 5861","CNI C9999999999 DU 99/99/9999 AU 99/99/9999","","VIDE"]
["2014-02-03","NOM PRENOM 5862","DU 99/99/9999","","VIDE"]
["2014-02-03","NOM PRENOM 5863",99999999,"99999999","Ok"]
["2014-02-03","NOM PRENOM 5864","TEL 99.99.99.99","99999999","Ok"]
["2014-02-03","NOM PRENOM 5865","CNI N°9999999999999 DU 99/99/9999","","VIDE"]
["2014-02-03","NOM PRENOM 5866","CNI N° C9999999999 DU 99/99/9999","","VIDE"]
["2014-02-03","NOM PRENOM 5867","CNI C 9999999999 DU 99/99/99","","VIDE"]
["2014-02-03","NOM PRENOM 5868",null,"","VIDE"]
["2014-02-03","NOM PRENOM 5869",null,"","VIDE"]
["2014-02-03","NOM PRENOM 5870","CEL 99999999","99999999","Ok"]
["2014-02-03","NOM PRENOM 5871","CNI C 99999.9999.99 DU 99999999","","VIDE"]
["2014-02-03","NOM PRENOM 5872","CEL 99.99.99.99","99999999","Ok"]
["2014-02-03","NOM PRENOM 5873","CEL 99.99.99.99","99999999","Ok"]
["2014-02-03","NOM PRENOM 5874","TEL 99.99.99.99","99999999","Ok"]
["2014-02-03","NOM PRENOM 5875","TEL 99.99.99.99","99999999","Ok"]
["2014-02-03","NOM PRENOM 5876","PS 99AA99999 DU 99.99.9999","","VIDE"]
["2014-02-03","NOM PRENOM 5877",null,"","VIDE"]
["2014-02-03","NOM PRENOM 5878",99999999,"99999999","Ok"]
["2014-02-03","NOM PRENOM 5879",null,"","VIDE"]
["2014-02-03","NOM PRENOM 5880","CNI N° C9999999999 DU 99/99/9999","","VIDE"]
["2014-02-03","NOM PRENOM 5881","TEL 99.99.99.99","99999999","Ok"]
["2014-02-03","NOM PRENOM 5882",null,"","VIDE"]
["2014-02-03","NOM PRENOM 5883","TEL 99.99.99.99","99999999","Ok"]
["2014-02-03","NOM PRENOM 5884","TEL 99.99.99.99","99999999","Ok"]
["2014-02-03","NOM PRENOM 5885","CEL:99999999","99999999","Ok"]
["2014-02-03","NOM PRENOM 5886","CNI C9999.9999.99 DU 99.99.99","","VIDE"]
["2014-02-03","NOM PRENOM 5887","CEL 99.99.99.99","99999999","Ok"]
["2014-02-03","NOM PRENOM 5888","TEL 99999999","99999999","Ok"]
["2014-02-03","NOM PRENOM 5889","CNI N° C9999999999 DU 99/99/9999","","VIDE"]
["2014-02-03","NOM PRENOM 5890","TEL 99.99.99.99",{"$f":"gettel(C5891)","v":"99999999"},{"$f":"IF(LEN(D5891)=0,\"VIDE\",IF(LEN(D5891)=8,\"Ok\",\"?\"))","v":"Ok"}]
["2014-02-03","NOM PRENOM 5891","CEL:99999999","99999999","Ok"]
["2014-02-03","NOM PRENOM 5892","TEL 99999999","99999999","Ok"]
["2014-02-03","NOM PRENOM 5893",99999999,"99999999","Ok"]
["2014-02-03","NOM PRENOM 5894","CNI N9 C 9999.9999.99 DU 99.99.9999 SEGUELA","","VIDE"]
["2014-02-03","NOM PRENOM 5895",null,"","VIDE"]
["2014-02-03","NOM PRENOM 5896","TEL 99999999","99999999","Ok"]
["2014-02-03","NOM PRENOM 5897","TEL 99.99.99.99","99999999","Ok"]
["2014-02-03","NOM PRENOM 5898","CNI C 9999999999 DU 99/99/99","","VIDE"]
["2014-02-03","NOM PRENOM 5899","CEL 99.99.99.99","99999999","Ok"]
["2014-02-03","NOM PRENOM 5900","TEL 99999999","99999999","Ok"]
["2014-02-03","NOM PRENOM 5901","CEL 99999999","99999999","Ok"]
["2014-02-03","NOM PRENOM 5902","CNI N 9C 9999.9999.99 DU 99.99.9999","","VIDE"]
["2014-02-03","NOM PRENOM 5903",null,"","VIDE"]
["2014-02-03","NOM PRENOM 5904","N°9999999999999 DU 99/99/9999 + CARTE ONUCI","","VIDE"]
["2014-02-03","NOM PRENOM 5905","TEL 99.99.99.99","99999999","Ok"]
["2014-02-03","NOM PRENOM 5906","TEL 99.99.99.99","99999999","Ok"]
["2014-02-03","NOM PRENOM 5907",null,"","VIDE"]
["2014-02-03","NOM PRENOM 5908",null,"","VIDE"]
["2014-02-03","NOM PRENOM 5909",99999999,"99999999","Ok"]
["2014-02-03","NOM PRENOM 5910",99999999,"99999999","Ok"]
["2014-02-03","NOM PRENOM 5911","TEL:99-99-99-99","99999999","Ok"]
["2014-02-03","NOM PRENOM 5912",null,"","VIDE"]
["2014-02-03","NOM PRENOM 5913",null,"","VIDE"]
["2014-02-03","NOM PRENOM 5914","DU 99/99/99 AU 99/99/99","","VIDE"]
["2014-02-03","NOM PRENOM 5915","DU 99/99/9999","","VIDE"]
["2014-02-03","NOM PRENOM 5916",null,"","VIDE"]
["2014-02-03","NOM PRENOM 5917","CNI C9999999999 DU 99/99/9999 AU 99/99/9999 A SOUBRE","","VIDE"]
["2014-02-03","NOM PRENOM 5918","CEL 99999999","99999999","Ok"]
["2014-02-03","NOM PRENOM 5919",99999999,"99999999","Ok"]
["2014-02-03","NOM PRENOM 5920","TEL 99999999/99999999",{"$f":"gettel(C5921)","v":"99999999/99999999"},"?"]
["2014-02-03","NOM PRENOM 5921",null,"","VIDE"]
["2014-02-03","NOM PRENOM 5922","CIC NIGERIE N° 99999999NG DU 99/99/9999 AU 99/99/9999","","VIDE"]
["2014-02-03","NOM PRENOM 5923","CNI N 9C 9999.9999.99 DU 99.99.9999 JACQUEVILLE","","VIDE"]
["2014-02-03","NOM PRENOM 5924","CNI N 9C 9999.9999.99 DU 99.99.9999 JACQUEVILLE","","VIDE"]
["2014-02-03","NOM PRENOM 5925","CEL 99999999","99999999","Ok"]
["2014-02-03","NOM PRENOM 5926","TEL 99.99.99.99","99999999","Ok"]
["2014-02-03","NOM PRENOM 5927",null,"","VIDE"]
["2014-02-03","NOM PRENOM 5928","CNI N° C9999999999 DU 99/99/9999","","VIDE"]
["2014-02-03","NOM PRENOM 5929","DU 99.99.99","","VIDE"]
["2014-02-03","NOM PRENOM 5930","CNI N9 C 9999.9999.99 DU 99.99.9999","","VIDE"]
["2014-02-03","NOM PRENOM 5931","CNI 999999999999 DU 99/99/9999 AU 99/99/9999 A SOUBRE","","VIDE"]
["2014-02-03","NOM PRENOM 5932","TEL 99999999","99999999","Ok"]
["2014-02-03","NOM PRENOM 5933",null,"","VIDE"]
["2014-02-03","NOM PRENOM 5934","TEL 99999999","99999999","Ok"]
["2014-02-03","NOM PRENOM 5935",null,"","VIDE"]
["2014-02-03","NOM PRENOM 5936","val 99/99/9999 cel 99999999","99999999","Ok"]
["2014-02-03","NOM PRENOM 5937","CNI N° C9999999999 DU 99/99/9999","","VIDE"]
["2014-02-03","NOM PRENOM 5938","TEL 99.99.99.99","99999999","Ok"]
["2014-02-03","NOM PRENOM 5939",null,"","VIDE"]
["2014-02-03","NOM PRENOM 5940","DU 99/99/99 AU 99/99/99 CEL 99999999","99999999","Ok"]
["2014-02-03","NOM PRENOM 5941","TEL.99.99.99.99","99999999","Ok"]
["2014-02-03","NOM PRENOM 5942",null,"","VIDE"]
["2014-02-03","NOM PRENOM 5943",null,"","VIDE"]
["2014-02-03","NOM PRENOM 5944","val 99/99/9999 cel 99999999","99999999","Ok"]
["2014-02-03","NOM PRENOM 5945","TEL 99999999","99999999","Ok"]
["2014-02-03","NOM PRENOM 5946","TEL 99999999","99999999","Ok"]
["2014-02-03","NOM PRENOM 5947","val 99/99/9999 cel 99999999","99999999","Ok"]
["2014-02-03","NOM PRENOM 5948",null,"","VIDE"]
["2014-02-03","NOM PRENOM 5949","CNI N 9C 9999.9999.99 DU 99.99.9999 BONDOUKOU","","VIDE"]
["2014-02-03","NOM PRENOM 5950","CNI N° C9999999999 DU 99/99/9999","","VIDE"]
["2014-02-03","NOM PRENOM 5951","TEL 99999999","99999999","Ok"]
["2014-02-03","NOM PRENOM 5952","CNI N 9C 9999.9999.99 DU 99.99.9999 BONGOUANOU","","VIDE"]
["2014-02-03","NOM PRENOM 5953",null,"","VIDE"]
["2014-02-03","NOM PRENOM 5954",null,{"$f":"gettel(C5955)","v":""},{"$f":"IF(LEN(D5955)=0,\"VIDE\",IF(LEN(D5955)=8,\"Ok\",\"?\"))","v":"VIDE"}]
["2014-02-03","NOM PRENOM 5955","TEL 99999999","99999999","Ok"]
["2014-02-03","NOM PRENOM 5956","TEL 99999999","99999999","Ok"]
["2014-02-03","NOM PRENOM 5957","CNI N9 C 9999.9999.99 DU 99.99.9999","","VIDE"]
["2014-02-03","NOM PRENOM 5958","DU 99/99/9999","","VIDE"]
["2014-02-03","NOM PRENOM 5959","TEL 99999999","99999999","Ok"]
["2014-02-03","NOM PRENOM 5960","TEL 99999999","99999999","Ok"]
["2014-02-03","NOM PRENOM 5961","cel 99999999","99999999","Ok"]
["2014-02-03","NOM PRENOM 5962","CIC NIGERIA","","VIDE"]
["2014-02-03","NOM PRENOM 5963","TEL 99999999","99999999","Ok"]
["2014-02-03","NOM PRENOM 5964","cel 99999999","99999999","Ok"]
["2014-02-03","NOM PRENOM 5965","TEL 99999999","99999999","Ok"]
["2014-02-03","NOM PRENOM 5966",null,"","VIDE"]
["2014-02-03","NOM PRENOM 5967","TEL 99999999","99999999","Ok"]
["2014-02-03","NOM PRENOM 5968",null,"","VIDE"]
["2014-02-03","NOM PRENOM 5969",null,"","VIDE"]
["2014-02-03","NOM PRENOM 5970",null,"","VIDE"]
["2014-02-03","NOM PRENOM 5971","val 99/99/9999 cel 99999999","99999999","Ok"]
["2014-02-03","NOM PRENOM 5972","TEL:99-99-99-99","99999999","Ok"]
["2014-02-03","NOM PRENOM 5973","TEL:99-99-99-99","99999999","Ok"]
["2014-02-03","NOM PRENOM 5974",null,"","VIDE"]
["2014-02-03","NOM PRENOM 5975",null,"","VIDE"]
["2014-02-03","NOM PRENOM 5976",null,"","VIDE"]
["2014-02-03","NOM PRENOM 5977",null,"","VIDE"]
["2014-02-03","NOM PRENOM 5978","VAL 99/99/9999 CEL 99999999","99999999","Ok"]
["2014-02-03","NOM PRENOM 5979",null,"","VIDE"]
["2014-02-03","NOM PRENOM 5980",null,"","VIDE"]
["2014-02-03","NOM PRENOM 5981",null,"","VIDE"]
["2014-02-03","NOM PRENOM 5982",null,"","VIDE"]
["2014-02-03","NOM PRENOM 5983",null,"","VIDE"]
["2014-02-03","NOM PRENOM 5984",99999999,"99999999","Ok"]
["2014-02-03","NOM PRENOM 5985","TIA HYPPOLYTHE","","VIDE"]
["2014-02-03","NOM PRENOM 5986","CEL 99999999","99999999","Ok"]
["2014-02-03","NOM PRENOM 5987",null,"","VIDE"]
["2014-02-03","NOM PRENOM 5988","TOGOLA DRISSA","","VIDE"]
["2014-02-03","NOM PRENOM 5989","zi KOUDOUGOU","","VIDE"]
["2014-02-03","NOM PRENOM 5990","BAKOUAN CHARLE","","VIDE"]
["2014-02-03","NOM PRENOM 5991","val 99/99/9999","","VIDE"]
["2014-02-03","NOM PRENOM 5992",null,"","VIDE"]
["2014-02-03","NOM PRENOM 5993","TEL 99999999/99999999",{"$f":"gettel(C5994)","v":"99999999/99999999"},"?"]
["2014-02-03","NOM PRENOM 5994","TEL 99999999","99999999","Ok"]
["2014-02-03","NOM PRENOM 5995",null,"","VIDE"]
["2014-02-03","NOM PRENOM 5996",null,"","VIDE"]
["2014-02-03","NOM PRENOM 5997",null,"","VIDE"]
["2014-02-03","NOM PRENOM 5998",null,"","VIDE"]
["2014-02-03","NOM PRENOM 5999",null,"","VIDE"]
["2014-02-03","NOM PRENOM 6000","TEL 99999999","99999999","Ok"]
["2014-02-03","NOM PRENOM 6001",null,"","VIDE"]
["2014-02-03","NOM PRENOM 6002","CEL 99.99.99.99","99999999","Ok"]
["2014-02-03","NOM PRENOM 6003","TEL 99999999","99999999","Ok"]
["2014-02-03","NOM PRENOM 6004",null,"","VIDE"]
["2014-02-03","NOM PRENOM 6005","TEL 99999999","99999999","Ok"]
["2014-02-03","NOM PRENOM 6006","TEL 99999999","99999999","Ok"]
["2014-02-03","NOM PRENOM 6007",null,"","VIDE"]
["2014-02-03","NOM PRENOM 6008",null,"","VIDE"]
["2014-02-03","NOM PRENOM 6009","TEL 99999999","99999999","Ok"]
["2014-02-03","NOM PRENOM 6010","TEL 99.99.99.99","99999999","Ok"]
["2014-02-03","NOM PRENOM 6011","TEL 99.99.99.99","99999999","Ok"]
["2014-02-03","NOM PRENOM 6012",null,"","VIDE"]
["2014-02-03","NOM PRENOM 6013","TEL 99999999","99999999","Ok"]
["2014-02-03","NOM PRENOM 6014",null,"","VIDE"]
["2014-02-03","NOM PRENOM 6015","TEL 99999999","99999999","Ok"]
["2014-02-03","NOM PRENOM 6016","TEL 99999999","99999999","Ok"]
["2014-02-03","NOM PRENOM 6017","ATT N°999-99999/99-99/MI/PU-99","","VIDE"]
["2014-02-03","NOM PRENOM 6018","TEL 99.99.99.99",{"$f":"gettel(C6019)","v":"99999999"},{"$f":"IF(LEN(D6019)=0,\"VIDE\",IF(LEN(D6019)=8,\"Ok\",\"?\"))","v":"Ok"}]
["2014-02-03","NOM PRENOM 6019",null,"","VIDE"]
["2014-02-03","NOM PRENOM 6020","val 99/99/9999 cel 99999999","99999999","Ok"]
["2014-02-03","NOM PRENOM 6021","TEL 99999999","99999999","Ok"]
["2014-02-03","NOM PRENOM 6022","CIC N° 9999999/ABFA/99 VAL 99/99/9999","","VIDE"]
["2014-02-03","NOM PRENOM 6023","TEL 99999999","99999999","Ok"]
["2014-02-03","NOM PRENOM 6024","TEL 99.99.99.99","99999999","Ok"]
["2014-02-03","NOM PRENOM 6025",null,"","VIDE"]
["2014-02-03","NOM PRENOM 6026",null,"","VIDE"]
["2014-02-03","NOM PRENOM 6027",null,"","VIDE"]
["2014-02-03","NOM PRENOM 6028","TEL.99.99.99.99","99999999","Ok"]
["2014-02-03","NOM PRENOM 6029","CEL 99.99.99.99","99999999","Ok"]
["2014-02-03","NOM PRENOM 6030","TEL 99999999","99999999","Ok"]
["2014-02-03","NOM PRENOM 6031","SENEGAL","","VIDE"]
["2014-02-03","NOM PRENOM 6032",null,"","VIDE"]
["2014-02-03","NOM PRENOM 6033",null,"","VIDE"]
["2014-02-03","NOM PRENOM 6034","MAIGA MOHAMED","","VIDE"]
["2014-02-03","NOM PRENOM 6035","SOUNA MOUSSA","","VIDE"]
["2014-02-03","NOM PRENOM 6036","CEL 99.99.99.99","99999999","Ok"]
["2014-02-03","NOM PRENOM 6037",null,"","VIDE"]
["2014-02-03","NOM PRENOM 6038",null,"","VIDE"]
["2014-02-03","NOM PRENOM 6039",null,"","VIDE"]
["2014-02-03","NOM PRENOM 6040","CNI C 9999999999 DU 99/99/99","","VIDE"]
["2014-02-03","NOM PRENOM 6041",null,"","VIDE"]
["2014-02-03","NOM PRENOM 6042","CP N 9999/MDR DU 99/99/99","","VIDE"]
["2014-02-03","NOM PRENOM 6043","TEL 99999999","99999999","Ok"]
["2014-02-04","NOM PRENOM 6044",null,"","VIDE"]
["2014-02-04","NOM PRENOM 6045","MR GUEYE","","VIDE"]
["2014-02-04","NOM PRENOM 6046","CNI C 9999.9999.99 DU 99/99/9999","","VIDE"]
["2014-02-04","NOM PRENOM 6047","CEL 99999999","99999999","Ok"]
["2014-02-04","NOM PRENOM 6048",null,"","VIDE"]
["2014-02-04","NOM PRENOM 6049","CNI N 999999999999 DU 99/99/99 AU 99/99/9999","","VIDE"]
["2014-02-04","NOM PRENOM 6050",null,"","VIDE"]
["2014-02-04","NOM PRENOM 6051",99999999,"99999999","Ok"]
["2014-02-04","NOM PRENOM 6052","val 99/99/9999 cel 99999999","99999999","Ok"]
["2014-02-04","NOM PRENOM 6053","tel 99.99.99.99","99999999","Ok"]
["2014-02-04","NOM PRENOM 6054","CNI C9999999999 DU 99/99/9999 AU 99/99/9999","","VIDE"]
["2014-02-04","NOM PRENOM 6055","val 99/99/9999 cel 99999999","99999999","Ok"]
["2014-02-04","NOM PRENOM 6056",null,"","VIDE"]
["2014-02-04","NOM PRENOM 6057","ATTEST N 999-9999/99-99/PU-99 DU 99/99/99 AU 99/99/9999","","VIDE"]
["2014-02-04","NOM PRENOM 6058",null,"","VIDE"]
["2014-02-04","NOM PRENOM 6059","val 99/99/9999 cel 99999999","99999999","Ok"]
["2014-02-04","NOM PRENOM 6060","TEL 99.99.99.99","99999999","Ok"]
["2014-02-04","NOM PRENOM 6061","CIC BENIN N° 9999/99 DU 99/99/9999 AU 99/99/9999","","VIDE"]
["2014-02-04","NOM PRENOM 6062",null,"","VIDE"]
["2014-02-04","NOM PRENOM 6063",null,"","VIDE"]
["2014-02-04","NOM PRENOM 6064","TEL 99.99.99.99","99999999","Ok"]
["2014-02-04","NOM PRENOM 6065","val 99/99/9999 cel 99999999","99999999","Ok"]
["2014-02-04","NOM PRENOM 6066",null,"","VIDE"]
["2014-02-04","NOM PRENOM 6067","CNI C9999.9999.99 DU 99/99/9999","","VIDE"]
["2014-02-04","NOM PRENOM 6068",null,"","VIDE"]
["2014-02-04","NOM PRENOM 6069","DU 99-99-9999 AU 99-99-9999","","VIDE"]
["2014-02-04","NOM PRENOM 6070",null,"","VIDE"]
["2014-02-04","NOM PRENOM 6071","CNI N° C9999999999 DU 99/99/9999","","VIDE"]
["2014-02-04","NOM PRENOM 6072",null,"","VIDE"]
["2014-02-04","NOM PRENOM 6073","AI 9999-9999/99-99/PU9.YAKRO DU 99/99/9999","","VIDE"]
["2014-02-04","NOM PRENOM 6074","TEL 99.99.99.99","99999999","Ok"]
["2014-02-04","NOM PRENOM 6075","ATD N°999.9999.99.99.PU.99 DU 99.99.99","","VIDE"]
["2014-02-04","NOM PRENOM 6076","CNI C9999999999 DU 99/99/9999 AU 99/99/9999","","VIDE"]
["2014-02-04","NOM PRENOM 6077","TEL 99999999","99999999","Ok"]
["2014-02-04","NOM PRENOM 6078","TEL 99/99/9999",{"$f":"gettel(C6079)","v":"99/99/9999"},"?"]
["2014-02-04","NOM PRENOM 6079",99999999,"99999999","Ok"]
["2014-02-04","NOM PRENOM 6080","TEL 99.99.99.99","99999999","Ok"]
["2014-02-04","NOM PRENOM 6081","CNI N°C 9999 9999 99 VAL99/99/9999 CEL99999999","99999999","Ok"]
["2014-02-04","NOM PRENOM 6082","CNI C9999999999",{"$f":"gettel(C6083)","v":""},{"$f":"IF(LEN(D6083)=0,\"VIDE\",IF(LEN(D6083)=8,\"Ok\",\"?\"))","v":"VIDE"}]
["2014-02-04","NOM PRENOM 6083","CNI C 9999 9999 99 DU 99/99/99 - TEL 99999999","99999999","Ok"]
["2014-02-04","NOM PRENOM 6084",99999999,"99999999","Ok"]
["2014-02-04","NOM PRENOM 6085","TEL 99.99.99.99","99999999","Ok"]
["2014-02-04","NOM PRENOM 6086","CNI C9999999999 DU 99/99/9999 AU 99/99/9999 A ABJ","","VIDE"]
["2014-02-04","NOM PRENOM 6087","val 99/99/9999 cel 99999999","99999999","Ok"]
["2014-02-04","NOM PRENOM 6088","TEL 99999999","99999999","Ok"]
["2014-02-04","NOM PRENOM 6089",null,"","VIDE"]
["2014-02-04","NOM PRENOM 6090","CNI C 9999999999 DU 99/9/99 AU 99/9/99","","VIDE"]
["2014-02-04","NOM PRENOM 6091","TEL 99999999","99999999","Ok"]
["2014-02-04","NOM PRENOM 6092",null,"","VIDE"]
["2014-02-04","NOM PRENOM 6093","TEL 99.99.99.99","99999999","Ok"]
["2014-02-04","NOM PRENOM 6094",null,"","VIDE"]
["2014-02-04","NOM PRENOM 6095","CNI C9999999999 DU 99/99/9999 AU 99/99/9999","","VIDE"]
["2014-02-04","NOM PRENOM 6096","TEL 99.99.99.99","99999999","Ok"]
["2014-02-04","NOM PRENOM 6097","DU 99-99-9999 AU 99-99-9999","","VIDE"]
["2014-02-04","NOM PRENOM 6098",null,"","VIDE"]
["2014-02-04","NOM PRENOM 6099","TEL 99.99.99.99","99999999","Ok"]
["2014-02-04","NOM PRENOM 6100",null,"","VIDE"]
["2014-02-04","NOM PRENOM 6101","CNI C 9999999999 DU 99/9/99 AU 99/9/99","","VIDE"]
["2014-02-04","NOM PRENOM 6102","TEL 99999999","99999999","Ok"]
["2014-02-04","NOM PRENOM 6103",null,"","VIDE"]
["2014-02-04","NOM PRENOM 6104","PASS N 99AB99999 DU 99/99/99 AU 99/99/99","","VIDE"]
["2014-02-04","NOM PRENOM 6105","CNI C 9999 9999 99 DU 99/99/9999 AU 99/99/9999","","VIDE"]
["2014-02-04","NOM PRENOM 6106","TEL 99999999","99999999","Ok"]
["2014-02-04","NOM PRENOM 6107","TEL 99.99.99.99","99999999","Ok"]
["2014-02-04","NOM PRENOM 6108",null,"","VIDE"]
["2014-02-04","NOM PRENOM 6109","TEL 99999999","99999999","Ok"]
["2014-02-04","NOM PRENOM 6110","CNI C 9999999999 DU 99/9/99 AU 99/9/99","","VIDE"]
["2014-02-04","NOM PRENOM 6111","TEL 99999999","99999999","Ok"]
["2014-02-04","NOM PRENOM 6112",null,"","VIDE"]
["2014-02-04","NOM PRENOM 6113","TEL 99999999","99999999","Ok"]
["2014-02-04","NOM PRENOM 6114",null,"","VIDE"]
["2014-02-04","NOM PRENOM 6115","TEL 99.99.99.99","99999999","Ok"]
["2014-02-04","NOM PRENOM 6116","TEL 99.99.99.99","99999999","Ok"]
["2014-02-04","NOM PRENOM 6117",null,"","VIDE"]
["2014-02-04","NOM PRENOM 6118",null,"","VIDE"]
["2014-02-04","NOM PRENOM 6119",null,"","VIDE"]
["2014-02-04","NOM PRENOM 6120","9999 99 DU 99.99.99 AU 99.99.99","","VIDE"]
["2014-02-04","NOM PRENOM 6121","DU 99/99/9999","","VIDE"]
["2014-02-04","NOM PRENOM 6122","CNI C9999.9999.99 DU 99/99/9999","","VIDE"]
["2014-02-04","NOM PRENOM 6123","TEL 99999999","99999999","Ok"]
["2014-02-04","NOM PRENOM 6124","CNI N° C 9999999999 DU 99/99/9999 AU 99/99/9999","","VIDE"]
["2014-02-04","NOM PRENOM 6125","CEL 99999999","99999999","Ok"]
["2014-02-04","NOM PRENOM 6126",null,"","VIDE"]
["2014-02-04","NOM PRENOM 6127","val 99/99/9999 cel 99999999","99999999","Ok"]
["2014-02-04","NOM PRENOM 6128","CNI N° C 9999999999 DU 99/99/9999 AU 99/99/9999","","VIDE"]
["2014-02-04","NOM PRENOM 6129","TEL 99.99.99.99","99999999","Ok"]
["2014-02-04","NOM PRENOM 6130","CEL 99.99.99.99","99999999","Ok"]
["2014-02-04","NOM PRENOM 6131","CNI C 9999999999 DU 99-99-99","","VIDE"]
["2014-02-04","NOM PRENOM 6132","CNI C 9999999999 DU 99/99/9999","","VIDE"]
["2014-02-04","NOM PRENOM 6133","TEL:99-99-99-99","99999999","Ok"]
["2014-02-04","NOM PRENOM 6134","TEL 99999999","99999999","Ok"]
["2014-02-04","NOM PRENOM 6135","CIC CAM N 999/99 DU 99/9/99 AU 99/9/99","","VIDE"]
["2014-02-04","NOM PRENOM 6136","CNI C 9999999999 DU 99-9-99","","VIDE"]
["2014-02-04","NOM PRENOM 6137","CNI N° C9999999999 DU 99/99/9999","","VIDE"]
["2014-02-04","NOM PRENOM 6138",99999999,"99999999","Ok"]
["2014-02-04","NOM PRENOM 6139","TEL 99.99.99.99","99999999","Ok"]
["2014-02-04","NOM PRENOM 6140","CEL 99999999","99999999","Ok"]
["2014-02-04","NOM PRENOM 6141","CNI C9999999999 DU 99/99/9999 AU 99/99/9999","","VIDE"]
["2014-02-04","NOM PRENOM 6142","TEL 99.99.99.99","99999999","Ok"]
["2014-02-04","NOM PRENOM 6143","CNI C9999999999 DU 99/99/9999 AU 99/99/9999","","VIDE"]
["2014-02-04","NOM PRENOM 6144",null,"","VIDE"]
["2014-02-04","NOM PRENOM 6145","CEL 99.99.99.99","99999999","Ok"]
["2014-02-04","NOM PRENOM 6146","TEL 99.99.99.99",{"$f":"gettel(C6147)","v":"99999999"},{"$f":"IF(LEN(D6147)=0,\"VIDE\",IF(LEN(D6147)=8,\"Ok\",\"?\"))","v":"Ok"}]
["2014-02-04","NOM PRENOM 6147","TEL 99.99.99.99","99999999","Ok"]
["2014-02-04","NOM PRENOM 6148","TEL 99.99.99.99","99999999","Ok"]
["2014-02-04","NOM PRENOM 6149","CISSE ALEX PASS USA N 999999999 DU 99.99.99","","VIDE"]
["2014-02-04","NOM PRENOM 6150","PASS N 99AA99999 DU 99/9/99 AU 99/9/99","","VIDE"]
["2014-02-04","NOM PRENOM 6151","CEL 99999999","99999999","Ok"]
["2014-02-04","NOM PRENOM 6152","TEL 99.99.99.99","99999999","Ok"]
["2014-02-04","NOM PRENOM 6153","TEL 99999999","99999999","Ok"]
["2014-02-04","NOM PRENOM 6154","TEL 99999999","99999999","Ok"]
["2014-02-04","NOM PRENOM 6155","PASS NBE999999 DU 99/99/9999","","VIDE"]
["2014-02-04","NOM PRENOM 6156",99999999,"99999999","Ok"]
["2014-02-04","NOM PRENOM 6157",null,"","VIDE"]
["2014-02-04","NOM PRENOM 6158","CEL 99999999","99999999","Ok"]
["2014-02-04","NOM PRENOM 6159","CNI C 9999999999 DU 99/99/99 DU 999/99/99","","VIDE"]
["2014-02-04","NOM PRENOM 6160","FRANCE","","VIDE"]
["2014-02-04","NOM PRENOM 6161","CEL 99999999","99999999","Ok"]
["2014-02-04","NOM PRENOM 6162","PASS NBE999999 DU 99/99/9999","","VIDE"]
["2014-02-04","NOM PRENOM 6163","CNI C 9999999999 DU 99/99/99 AU 99/99/99","","VIDE"]
["2014-02-04","NOM PRENOM 6164","TEL 99.99.99.99","99999999","Ok"]
["2014-02-04","NOM PRENOM 6165","CNI C9999999999 DU 99/99/9999 AU 99/99/9999","","VIDE"]
["2014-02-04","NOM PRENOM 6166","CNI C 9999 9999 99 DU 99/99/9999 AU 99/99/9999","","VIDE"]
["2014-02-04","NOM PRENOM 6167","TEL 99.99.99.99","99999999","Ok"]
["2014-02-04","NOM PRENOM 6168","DU 99/99/9999 AU 99/99/9999","","VIDE"]
["2014-02-04","NOM PRENOM 6169","AI N° 999-9999-99-99/PU-9 DU 99.99.9999","","VIDE"]
["2014-02-04","NOM PRENOM 6170","DU 99/99/9999","","VIDE"]
["2014-02-04","NOM PRENOM 6171","CEL 99999999","99999999","Ok"]
["2014-02-04","NOM PRENOM 6172","CEL 99.99.99.99","99999999","Ok"]
["2014-02-04","NOM PRENOM 6173","DU 99.99.9999","","VIDE"]
["2014-02-04","NOM PRENOM 6174","AI N° 999/999999.99/ DU 99/99/9999 AU 99/99/9999","","VIDE"]
["2014-02-04","NOM PRENOM 6175",null,"","VIDE"]
["2014-02-04","NOM PRENOM 6176","9999 99 DU 99.99.99 AU 99.99.99","","VIDE"]
["2014-02-04","NOM PRENOM 6177","TEL 99999999","99999999","Ok"]
["2014-02-04","NOM PRENOM 6178","TEL 99999999","99999999","Ok"]
["2014-02-04","NOM PRENOM 6179","CNI N° C9999999999 DU 99/99/9999","","VIDE"]
["2014-02-04","NOM PRENOM 6180","TEL 99.99.99.99","99999999","Ok"]
["2014-02-04","NOM PRENOM 6181","CNI N9 C 9999.9999.99 DU 99.99.9999","","VIDE"]
["2014-02-04","NOM PRENOM 6182","TEL 99999999","99999999","Ok"]
["2014-02-04","NOM PRENOM 6183","CEL 99999999","99999999","Ok"]
["2014-02-04","NOM PRENOM 6184","TEL 99 99 99 99","99999999","Ok"]
["2014-02-04","NOM PRENOM 6185","DU 99/99/9999","","VIDE"]
["2014-02-04","NOM PRENOM 6186","TEL 99999999","99999999","Ok"]
["2014-02-04","NOM PRENOM 6187","TEL 99999999","99999999","Ok"]
["2014-02-04","NOM PRENOM 6188","DU 99/99/9999","","VIDE"]
["2014-02-04","NOM PRENOM 6189","val 99/99/9999 cel 99999999","99999999","Ok"]
["2014-02-04","NOM PRENOM 6190",null,"","VIDE"]
["2014-02-04","NOM PRENOM 6191","CNI N9 C 9999.9999.99 DU 99.99.9999 ALEPE","","VIDE"]
["2014-02-04","NOM PRENOM 6192","999999999999 DU 99.99.99 AU 99.99.99","","VIDE"]
["2014-02-04","NOM PRENOM 6193","val 99/99/9999 cel 99999999","99999999","Ok"]
["2014-02-04","NOM PRENOM 6194","TEL 99999999","99999999","Ok"]
["2014-02-04","NOM PRENOM 6195","TEL 99999999","99999999","Ok"]
["2014-02-04","NOM PRENOM 6196","CNI C 9999999999 DU 99/9/99 AU 99/9/99","","VIDE"]
["2014-02-04","NOM PRENOM 6197","CEL 99999999","99999999","Ok"]
["2014-02-04","NOM PRENOM 6198","TEL 99999999","99999999","Ok"]
["2014-02-04","NOM PRENOM 6199","val 9 octobre 9999 pc n 99-99-99999999","","VIDE"]
["2014-02-04","NOM PRENOM 6200","CNI N9 C 9999.9999.99 DU 99.99.9999","","VIDE"]
["2014-02-04","NOM PRENOM 6201","TEL 99.99.99.99","99999999","Ok"]
["2014-02-04","NOM PRENOM 6202","CNI C9999999999 DU 99.99.9999","","VIDE"]
["2014-02-04","NOM PRENOM 6203","TEL99.99.99.99","99999999","Ok"]
["2014-02-04","NOM PRENOM 6204","TEL 99999999","99999999","Ok"]
["2014-02-04","NOM PRENOM 6205",null,"","VIDE"]
["2014-02-04","NOM PRENOM 6206","CNI C9999 9999 99 DU 99/99/9999 AU 99/99/9999 A DALOA","","VIDE"]
["2014-02-04","NOM PRENOM 6207","TEL 99999999","99999999","Ok"]
["2014-02-04","NOM PRENOM 6208","CNI N 9C 9999.9999.99 DU 99.99.9999","","VIDE"]
["2014-02-04","NOM PRENOM 6209",null,"","VIDE"]
["2014-02-04","NOM PRENOM 6210","TEL 99999999",{"$f":"gettel(C6211)","v":"99999999"},{"$f":"IF(LEN(D6211)=0,\"VIDE\",IF(LEN(D6211)=8,\"Ok\",\"?\"))","v":"Ok"}]
["2014-02-04","NOM PRENOM 6211","REF 99999999","","VIDE"]
["2014-02-04","NOM PRENOM 6212","TEL 99.99.99.99","99999999","Ok"]
["2014-02-04","NOM PRENOM 6213","CNI N9 C 9999.9999.99 DU 99.99.9999","","VIDE"]
["2014-02-04","NOM PRENOM 6214","CNI C 9999999999 DU 99/9/99 AU 99/9/99","","VIDE"]
["2014-02-04","NOM PRENOM 6215","TEL 99.99.99.99","99999999","Ok"]
["2014-02-04","NOM PRENOM 6216",null,"","VIDE"]
["2014-02-04","NOM PRENOM 6217","CELL 99999999","99999999","Ok"]
["2014-02-04","NOM PRENOM 6218","TEL 99999999","99999999","Ok"]
["2014-02-04","NOM PRENOM 6219","TEL 99.99.99.99","99999999","Ok"]
["2014-02-04","NOM PRENOM 6220","TEL 99.99.99.99","99999999","Ok"]
["2014-02-04","NOM PRENOM 6221",99999999,"99999999","Ok"]
["2014-02-04","NOM PRENOM 6222","CNI N9 C 9999.9999.99 DU 99.99.9999 BONGOUANOU","","VIDE"]
["2014-02-04","NOM PRENOM 6223","TEL 99.99.99.99","99999999","Ok"]
["2014-02-04","NOM PRENOM 6224","PCN° 99-99-99999999 DU 99.99.9999","","VIDE"]
["2014-02-04","NOM PRENOM 6225","TEL 99999999","99999999","Ok"]
["2014-02-04","NOM PRENOM 6226","TEL99.99.99.99","99999999","Ok"]
["2014-02-04","NOM PRENOM 6227","CNI C 9999999999 DU 99/99/99 AU 99/99/99","","VIDE"]
["2014-02-04","NOM PRENOM 6228","CEL 99999999","99999999","Ok"]
["2014-02-04","NOM PRENOM 6229","CNI N° C9999 9999 99 DU 99/99/9999","","VIDE"]
["2014-02-04","NOM PRENOM 6230","TEL 99999999","99999999","Ok"]
["2014-02-04","NOM PRENOM 6231","C9999.9999.99 DU 99.99.99","","VIDE"]
["2014-02-04","NOM PRENOM 6232","val 99/99/9999 cel 99999999","99999999","Ok"]
["2014-02-04","NOM PRENOM 6233","TEL 99999999","99999999","Ok"]
["2014-02-04","NOM PRENOM 6234","VAL99/99/9999 CEL99999999","99999999","Ok"]
["2014-02-04","NOM PRENOM 6235",null,"","VIDE"]
["2014-02-04","NOM PRENOM 6236","TEL 99999999","99999999","Ok"]
["2014-02-04","NOM PRENOM 6237","CEL 99.99.99.99","99999999","Ok"]
["2014-02-04","NOM PRENOM 6238","CEL 99999999","99999999","Ok"]
["2014-02-04","NOM PRENOM 6239","CEL 99999999","99999999","Ok"]
["2014-02-04","NOM PRENOM 6240","CEL 99999999","99999999","Ok"]
["2014-02-04","NOM PRENOM 6241",99999999,"99999999","Ok"]
["2014-02-04","NOM PRENOM 6242","TEL 99999999","99999999","Ok"]
["2014-02-04","NOM PRENOM 6243",null,"","VIDE"]
["2014-02-04","NOM PRENOM 6244","CNI 999999999999 DU 99/99/9999 AU 99/99/9999","","VIDE"]
["2014-02-04","NOM PRENOM 6245","CEL 99999999","99999999","Ok"]
["2014-02-04","NOM PRENOM 6246","CNI 999999999999 DU 99/99/9999 AU 99/99/9999","","VIDE"]
["2014-02-04","NOM PRENOM 6247","CNI N° C9999 9999 99 DU 99/99/9999 AU 99/99/9999","","VIDE"]
["2014-02-04","NOM PRENOM 6248",null,"","VIDE"]
["2014-02-04","NOM PRENOM 6249",99999999,"99999999","Ok"]
["2014-02-04","NOM PRENOM 6250",null,"","VIDE"]
["2014-02-04","NOM PRENOM 6251",null,"","VIDE"]
["2014-02-04","NOM PRENOM 6252","TEL 99999999","99999999","Ok"]
["2014-02-04","NOM PRENOM 6253",null,"","VIDE"]
["2014-02-04","NOM PRENOM 6254","CNI N° C9999999999 DU 99/99/9999","","VIDE"]
["2014-02-04","NOM PRENOM 6255","CNI C9999.9999.99 DU 99.99.99","","VIDE"]
["2014-02-04","NOM PRENOM 6256","TEL 99.99.99.99","99999999","Ok"]
["2014-02-04","NOM PRENOM 6257","TEL 99.99.99.99","99999999","Ok"]
["2014-02-04","NOM PRENOM 6258",null,"","VIDE"]
["2014-02-04","NOM PRENOM 6259","TEL.99.99.9999","99999999","Ok"]
["2014-02-04","NOM PRENOM 6260","CNI N9 C 9999.9999.99 DU 99.99.9999","","VIDE"]
["2014-02-04","NOM PRENOM 6261",null,"","VIDE"]
["2014-02-04","NOM PRENOM 6262","TEL 99.99.99.99","99999999","Ok"]
["2014-02-04","NOM PRENOM 6263","val 99/99/9999 pc n 99-99-99999999","","VIDE"]
["2014-02-04","NOM PRENOM 6264","PC N9 99.99.99999999 DU 99.99.9999","","VIDE"]
["2014-02-04","NOM PRENOM 6265","TEL.99.99.99.99","99999999","Ok"]
["2014-02-04","NOM PRENOM 6266","TEL 99.99.99.99","99999999","Ok"]
["2014-02-04","NOM PRENOM 6267","TEL 99999999","99999999","Ok"]
["2014-02-04","NOM PRENOM 6268","TEL 99999999","99999999","Ok"]
["2014-02-04","NOM PRENOM 6269","CNI C9999.9999.99 DU 99/99/9999","","VIDE"]
["2014-02-04","NOM PRENOM 6270","TEL 99.99.99.99","99999999","Ok"]
["2014-02-04","NOM PRENOM 6271","CNI N9 C 9999.9999.99 DU 99.99.9999 GOHITAFLA","","VIDE"]
["2014-02-04","NOM PRENOM 6272","val 99/99/9999 cel 99999999","99999999","Ok"]
["2014-02-04","NOM PRENOM 6273",null,"","VIDE"]
["2014-02-04","NOM PRENOM 6274","CNI C9999999999 DU 99/99/9999 AU 99/99/9999",{"$f":"gettel(C6275)","v":""},{"$f":"IF(LEN(D6275)=0,\"VIDE\",IF(LEN(D6275)=8,\"Ok\",\"?\"))","v":"VIDE"}]
["2014-02-04","NOM PRENOM 6275","ATT 9999999/99-99/MEMI/PU DU 99.99.9999","","VIDE"]
["2014-02-04","NOM PRENOM 6276","CNI C9999.9999.99 DU 99.99.99","","VIDE"]
["2014-02-04","NOM PRENOM 6277","CNI N9 C 9999.9999.99 DU 99.99.9999","","VIDE"]
["2014-02-04","NOM PRENOM 6278",null,"","VIDE"]
["2014-02-04","NOM PRENOM 6279","TEL 99999999","99999999","Ok"]
["2014-02-04","NOM PRENOM 6280","TEL 99.99.99.99","99999999","Ok"]
["2014-02-04","NOM PRENOM 6281","CEL 99999999","99999999","Ok"]
["2014-02-04","NOM PRENOM 6282","CNI C9999.9999.99 DU 99/99/9999","","VIDE"]
["2014-02-04","NOM PRENOM 6283","CEL 99999999","99999999","Ok"]
["2014-02-04","NOM PRENOM 6284",null,"","VIDE"]
["2014-02-04","NOM PRENOM 6285","CNI C9999999999 DU 99/99/9999 AU 99/99/9999 A SOUBRE","","VIDE"]
["2014-02-04","NOM PRENOM 6286","CNI C 9999999999 DU 99/9/99 AU 99/9/99","","VIDE"]
["2014-02-04","NOM PRENOM 6287","CNI C9999999999 DU 99/99/9999 AU 99/99/9999 A SOUBRE","","VIDE"]
["2014-02-04","NOM PRENOM 6288",null,"","VIDE"]
["2014-02-04","NOM PRENOM 6289",99999999,"99999999","Ok"]
["2014-02-04","NOM PRENOM 6290","TEL 99999999","99999999","Ok"]
["2014-02-04","NOM PRENOM 6291","CNI C 9999999999 DU 99/9/99 AU 99/9/99","","VIDE"]
["2014-02-04","NOM PRENOM 6292","TEL 99999999","99999999","Ok"]
["2014-02-04","NOM PRENOM 6293","DU 99/99/9999","","VIDE"]
["2014-02-04","NOM PRENOM 6294","TEL 99999999","99999999","Ok"]
["2014-02-04","NOM PRENOM 6295","TEL 99999999","99999999","Ok"]
["2014-02-04","NOM PRENOM 6296","TEL:99-99-99-99","99999999","Ok"]
["2014-02-04","NOM PRENOM 6297",null,"","VIDE"]
["2014-02-04","NOM PRENOM 6298","CNI C9999999999 DU 99.99.9999","","VIDE"]
["2014-02-04","NOM PRENOM 6299","agent biao cel 99999999","99999999","Ok"]
["2014-02-04","NOM PRENOM 6300",null,"","VIDE"]
["2014-02-04","NOM PRENOM 6301","TEL 99999999","99999999","Ok"]
["2014-02-04","NOM PRENOM 6302","CEL:99999999","99999999","Ok"]
["2014-02-04","NOM PRENOM 6303","TEL 99.99.99.99","99999999","Ok"]
["2014-02-04","NOM PRENOM 6304","TEL 99 99 99 99","99999999","Ok"]
["2014-02-04","NOM PRENOM 6305","TEL 99.99.99.99","99999999","Ok"]
["2014-02-04","NOM PRENOM 6306","CEL 99999999","99999999","Ok"]
["2014-02-04","NOM PRENOM 6307",null,"","VIDE"]
["2014-02-04","NOM PRENOM 6308","CNI N9 C 9999.9999.99 DU 99.99.9999 SONGON","","VIDE"]
["2014-02-04","NOM PRENOM 6309",null,"","VIDE"]
["2014-02-04","NOM PRENOM 6310",99999999,"99999999","Ok"]
["2014-02-04","NOM PRENOM 6311",null,"","VIDE"]
["2014-02-04","NOM PRENOM 6312",null,"","VIDE"]
["2014-02-04","NOM PRENOM 6313",null,"","VIDE"]
["2014-02-04","NOM PRENOM 6314","TEL 99999999","99999999","Ok"]
["2014-02-04","NOM PRENOM 6315",null,"","VIDE"]
["2014-02-04","NOM PRENOM 6316",null,"","VIDE"]
["2014-02-04","NOM PRENOM 6317",null,"","VIDE"]
["2014-02-04","NOM PRENOM 6318",null,"","VIDE"]
["2014-02-04","NOM PRENOM 6319","CEL:99999999","99999999","Ok"]
["2014-02-04","NOM PRENOM 6320",null,"","VIDE"]
["2014-02-04","NOM PRENOM 6321",null,"","VIDE"]
["2014-02-04","NOM PRENOM 6322",null,"","VIDE"]
["2014-02-04","NOM PRENOM 6323","TEL 99.99.99.99","99999999","Ok"]
["2014-02-04","NOM PRENOM 6324",null,"","VIDE"]
["2014-02-04","NOM PRENOM 6325",999999999,{"$f":"gettel(C6326)","v":"999999999"},"?"]
["2014-02-04","NOM PRENOM 6326",null,"","VIDE"]
["2014-02-04","NOM PRENOM 6327",null,"","VIDE"]
["2014-02-04","NOM PRENOM 6328",null,"","VIDE"]
["2014-02-04","NOM PRENOM 6329","TEL 99999999","99999999","Ok"]
["2014-02-04","NOM PRENOM 6330","TEL 99999999","99999999","Ok"]
["2014-02-04","NOM PRENOM 6331","TEL 99999999","99999999","Ok"]
["2014-02-04","NOM PRENOM 6332",null,"","VIDE"]
["2014-02-04","NOM PRENOM 6333","DEST SERGE/ TOGO","","VIDE"]
["2014-02-04","NOM PRENOM 6334",null,"","VIDE"]
["2014-02-04","NOM PRENOM 6335","TEL 99.99.99.99","99999999","Ok"]
["2014-02-04","NOM PRENOM 6336","TRAORE MAMADOU","","VIDE"]
["2014-02-04","NOM PRENOM 6337",null,"","VIDE"]
["2014-02-04","NOM PRENOM 6338","CNI C 9999999999 DU 99/99/99 AU 99/99/99",{"$f":"gettel(C6339)","v":""},{"$f":"IF(LEN(D6339)=0,\"VIDE\",IF(LEN(D6339)=8,\"Ok\",\"?\"))","v":"VIDE"}]
["2014-02-04","NOM PRENOM 6339","DAGO HONORA","","VIDE"]
["2014-02-04","NOM PRENOM 6340","val 99/99/9999","","VIDE"]
["2014-02-04","NOM PRENOM 6341",null,"","VIDE"]
["2014-02-04","NOM PRENOM 6342",null,"","VIDE"]
["2014-02-04","NOM PRENOM 6343",null,"","VIDE"]
["2014-02-04","NOM PRENOM 6344","TEL 99999999","99999999","Ok"]
["2014-02-04","NOM PRENOM 6345","TEL 99999999","99999999","Ok"]
["2014-02-04","NOM PRENOM 6346",null,"","VIDE"]
["2014-02-04","NOM PRENOM 6347","CISSE MAHAMAR","","VIDE"]
["2014-02-05","NOM PRENOM 6348","CEL 99999999","99999999","Ok"]
["2014-02-05","NOM PRENOM 6349","TEL 99.99.99.99","99999999","Ok"]
["2014-02-05","NOM PRENOM 6350",null,"","VIDE"]
["2014-02-05","NOM PRENOM 6351","CEL 99999999","99999999","Ok"]
["2014-02-05","NOM PRENOM 6352",null,"","VIDE"]
["2014-02-05","NOM PRENOM 6353",null,"","VIDE"]
["2014-02-05","NOM PRENOM 6354",null,"","VIDE"]
["2014-02-05","NOM PRENOM 6355","TEL 99.99.99.99","99999999","Ok"]
["2014-02-05","NOM PRENOM 6356","CNI N9 C 9999.9999.99 DU 99.99.9999","","VIDE"]
["2014-02-05","NOM PRENOM 6357",99999999,"99999999","Ok"]
["2014-02-05","NOM PRENOM 6358","TEL 99999999","99999999","Ok"]
["2014-02-05","NOM PRENOM 6359","CNI N9 C 9999.9999.99 DU 99.99.9999","","VIDE"]
["2014-02-05","NOM PRENOM 6360","TEL 99999999","99999999","Ok"]
["2014-02-05","NOM PRENOM 6361","tel  99999999","99999999","Ok"]
["2014-02-05","NOM PRENOM 6362","CEL 99.99.99.99","99999999","Ok"]
["2014-02-05","NOM PRENOM 6363","TEL:99-99-99-99","99999999","Ok"]
["2014-02-05","NOM PRENOM 6364","CNI C 9999999999 DU 99/99/99 AU 99/99/99","","VIDE"]
["2014-02-05","NOM PRENOM 6365","TEL 99.99.99.99","99999999","Ok"]
["2014-02-05","NOM PRENOM 6366",null,"","VIDE"]
["2014-02-05","NOM PRENOM 6367","CNI N9 C 9999.9999.99 DU 99.99.9999","","VIDE"]
["2014-02-05","NOM PRENOM 6368",null,"","VIDE"]
["2014-02-05","NOM PRENOM 6369","CNI C99999999.99 DU 99.99.99","","VIDE"]
["2014-02-05","NOM PRENOM 6370",null,"","VIDE"]
["2014-02-05","NOM PRENOM 6371","CNI C 9999999999 DU 99/99/99 AU 99/99/99","","VIDE"]
["2014-02-05","NOM PRENOM 6372","C9999.9999.99 DU 99.99.99","","VIDE"]
["2014-02-05","NOM PRENOM 6373","TEL 99999999","99999999","Ok"]
["2014-02-05","NOM PRENOM 6374","TEL 99999999","99999999","Ok"]
["2014-02-05","NOM PRENOM 6375",null,"","VIDE"]
["2014-02-05","NOM PRENOM 6376",null,"","VIDE"]
["2014-02-05","NOM PRENOM 6377","TEL:99-99-99-99","99999999","Ok"]
["2014-02-05","NOM PRENOM 6378",null,"","VIDE"]
["2014-02-05","NOM PRENOM 6379","CNI C9999999999 DU 99/99/9999 AU 99/99/9999","","VIDE"]
["2014-02-05","NOM PRENOM 6380","CNI N9 C 9999.9999.99 DU 99.99.9999","","VIDE"]
["2014-02-05","NOM PRENOM 6381","TEL 99999999","99999999","Ok"]
["2014-02-05","NOM PRENOM 6382",null,"","VIDE"]
["2014-02-05","NOM PRENOM 6383","TEL 99999999","99999999","Ok"]
["2014-02-05","NOM PRENOM 6384",null,"","VIDE"]
["2014-02-05","NOM PRENOM 6385","TEL 99999999","99999999","Ok"]
["2014-02-05","NOM PRENOM 6386","TEL 99999999","99999999","Ok"]
["2014-02-05","NOM PRENOM 6387","CEL 99 99 99 99","99999999","Ok"]
["2014-02-05","NOM PRENOM 6388","TEL 99.99.99.99","99999999","Ok"]
["2014-02-05","NOM PRENOM 6389",null,"","VIDE"]
["2014-02-05","NOM PRENOM 6390",null,"","VIDE"]
["2014-02-05","NOM PRENOM 6391","CNI C 9999 9999 99 DU 99/99/9999 AU 99/99/9999","","VIDE"]
["2014-02-05","NOM PRENOM 6392","TEL 99999999","99999999","Ok"]
["2014-02-05","NOM PRENOM 6393","CEL 99 99 99 99","99999999","Ok"]
["2014-02-05","NOM PRENOM 6394","TEL 99999999","99999999","Ok"]
["2014-02-05","NOM PRENOM 6395","CNI C9999999999 DU 99/99/9999","","VIDE"]
["2014-02-05","NOM PRENOM 6396","TEL 99.99.99.99","99999999","Ok"]
["2014-02-05","NOM PRENOM 6397",null,"","VIDE"]
["2014-02-05","NOM PRENOM 6398","PASSPORT N 99AB99999 DU 99.99.99 AU 99.99.99","","VIDE"]
["2014-02-05","NOM PRENOM 6399","CNI C9999.9999.99 DU 99/99/9999","","VIDE"]
["2014-02-05","NOM PRENOM 6400",null,"","VIDE"]
["2014-02-05","NOM PRENOM 6401","TEL  99999999","99999999","Ok"]
["2014-02-05","NOM PRENOM 6402","TEL 99.99.99.99",{"$f":"gettel(C6403)","v":"99999999"},{"$f":"IF(LEN(D6403)=0,\"VIDE\",IF(LEN(D6403)=8,\"Ok\",\"?\"))","v":"Ok"}]
["2014-02-05","NOM PRENOM 6403","99 DU 99.99.99 AU 99.99.99","","VIDE"]
["2014-02-05","NOM PRENOM 6404","cel 99999999","99999999","Ok"]
["2014-02-05","NOM PRENOM 6405",null,"","VIDE"]
["2014-02-05","NOM PRENOM 6406","CEL 99.99.99.99","99999999","Ok"]
["2014-02-05","NOM PRENOM 6407","TEL 99999999","99999999","Ok"]
["2014-02-05","NOM PRENOM 6408","CEL 99.99.99.99","99999999","Ok"]
["2014-02-05","NOM PRENOM 6409","TEL 99.99.99.99","99999999","Ok"]
["2014-02-05","NOM PRENOM 6410",null,"","VIDE"]
["2014-02-05","NOM PRENOM 6411","PC N 99-99-99999999 DU 99/99/99","","VIDE"]
["2014-02-05","NOM PRENOM 6412","CNI C 9999999999 DU 99/9/99 AU 99/9/99","","VIDE"]
["2014-02-05","NOM PRENOM 6413","PC 99-99-99999999 DU 99/99/9999","","VIDE"]
["2014-02-05","NOM PRENOM 6414","TEL 99.99.99.99","99999999","Ok"]
["2014-02-05","NOM PRENOM 6415","TEL 99999999","99999999","Ok"]
["2014-02-05","NOM PRENOM 6416",null,"","VIDE"]
["2014-02-05","NOM PRENOM 6417","TEL 99999999","99999999","Ok"]
["2014-02-05","NOM PRENOM 6418","TEL 99999999","99999999","Ok"]
["2014-02-05","NOM PRENOM 6419","CEL 99999999","99999999","Ok"]
["2014-02-05","NOM PRENOM 6420","TEL 99.99.99.99","99999999","Ok"]
["2014-02-05","NOM PRENOM 6421","VAL99/99/9999 CEL99999999","99999999","Ok"]
["2014-02-05","NOM PRENOM 6422","PC N 99-99-99999999 DU 99/99/9999","","VIDE"]
["2014-02-05","NOM PRENOM 6423","CNI C 9999 9999 99 DU 99/99/9999 AU 99/99/9999","","VIDE"]
["2014-02-05","NOM PRENOM 6424","CNI N9 C 9999.9999.99 DU 99.99.9999","","VIDE"]
["2014-02-05","NOM PRENOM 6425","TEL 99.99.99.99","99999999","Ok"]
["2014-02-05","NOM PRENOM 6426","CEL:99999999","99999999","Ok"]
["2014-02-05","NOM PRENOM 6427",null,"","VIDE"]
["2014-02-05","NOM PRENOM 6428","AU 99/99/99 CEL 99999999","99999999","Ok"]
["2014-02-05","NOM PRENOM 6429",null,"","VIDE"]
["2014-02-05","NOM PRENOM 6430","CNI C9999999999 DU 99/99/9999 AU 99/99/9999","","VIDE"]
["2014-02-05","NOM PRENOM 6431","CEL 999999999999",{"$f":"gettel(C6432)","v":"999999999999"},"?"]
["2014-02-05","NOM PRENOM 6432","TEL 99.99.99.99","99999999","Ok"]
["2014-02-05","NOM PRENOM 6433","CNI C9999999999 DU 99/99/9999 AU 99/99/9999","","VIDE"]
["2014-02-05","NOM PRENOM 6434",null,"","VIDE"]
["2014-02-05","NOM PRENOM 6435","CEL 99999999","99999999","Ok"]
["2014-02-05","NOM PRENOM 6436","TEL 99999999","99999999","Ok"]
["2014-02-05","NOM PRENOM 6437",null,"","VIDE"]
["2014-02-05","NOM PRENOM 6438","PASS9BD999999","","VIDE"]
["2014-02-05","NOM PRENOM 6439","TEL 99.99.99.99","99999999","Ok"]
["2014-02-05","NOM PRENOM 6440","CIC N 999999/CGMA/CI DU 99/99/9999 AU 99/99/9999","","VIDE"]
["2014-02-05","NOM PRENOM 6441","TEL.99.99.99.99","99999999","Ok"]
["2014-02-05","NOM PRENOM 6442","CNI C9999999999 SIERRA LEONNE","","VIDE"]
["2014-02-05","NOM PRENOM 6443","CNI C 9999 9999 99 DU 99/99/9999 AU 99/99/9999","","VIDE"]
["2014-02-05","NOM PRENOM 6444","cel 99999999","99999999","Ok"]
["2014-02-05","NOM PRENOM 6445","ATD N°999.9999.99.99.MI.PU.9 DU 99.99.99","","VIDE"]
["2014-02-05","NOM PRENOM 6446","ATI 999/9999/99-99/MEMIS/PU-99 DU 99/99/99 AU 99/99/99","","VIDE"]
["2014-02-05","NOM PRENOM 6447",null,"","VIDE"]
["2014-02-05","NOM PRENOM 6448","CNI C9999999999 DU 99/99/9999 AU 99/99/9999","","VIDE"]
["2014-02-05","NOM PRENOM 6449",null,"","VIDE"]
["2014-02-05","NOM PRENOM 6450",null,"","VIDE"]
["2014-02-05","NOM PRENOM 6451","TEL 99.99.99.99","99999999","Ok"]
["2014-02-05","NOM PRENOM 6452","CNI C 9999 9999 99 DU 99/99/9999 AU 99/99/9999","","VIDE"]
["2014-02-05","NOM PRENOM 6453","CNI C9999999999 DU 99/99/9999 AU 99/99/9999","","VIDE"]
["2014-02-05","NOM PRENOM 6454","TEL 99.99.99.99","99999999","Ok"]
["2014-02-05","NOM PRENOM 6455","TEL 99999999","99999999","Ok"]
["2014-02-05","NOM PRENOM 6456","VAL 99/99/9999 CEL 99999999","99999999","Ok"]
["2014-02-05","NOM PRENOM 6457","TEL 99999999","99999999","Ok"]
["2014-02-05","NOM PRENOM 6458",99999999,"99999999","Ok"]
["2014-02-05","NOM PRENOM 6459",null,"","VIDE"]
["2014-02-05","NOM PRENOM 6460","TEL:99-99-99-99","99999999","Ok"]
["2014-02-05","NOM PRENOM 6461","TEL 99999999","99999999","Ok"]
["2014-02-05","NOM PRENOM 6462","DU 99.99.99","","VIDE"]
["2014-02-05","NOM PRENOM 6463",null,"","VIDE"]
["2014-02-05","NOM PRENOM 6464","AU 99/99/9999","","VIDE"]
["2014-02-05","NOM PRENOM 6465","TEL 99.99.99.99","99999999","Ok"]
["2014-02-05","NOM PRENOM 6466","TEL 99.99.99.99",{"$f":"gettel(C6467)","v":"99999999"},{"$f":"IF(LEN(D6467)=0,\"VIDE\",IF(LEN(D6467)=8,\"Ok\",\"?\"))","v":"Ok"}]
["2014-02-05","NOM PRENOM 6467","CNI C 9999.9999.99 DU 99/99/9999","","VIDE"]
["2014-02-05","NOM PRENOM 6468","CEL 99999999","99999999","Ok"]
["2014-02-05","NOM PRENOM 6469",null,"","VIDE"]
["2014-02-05","NOM PRENOM 6470",null,"","VIDE"]
["2014-02-05","NOM PRENOM 6471",null,"","VIDE"]
["2014-02-05","NOM PRENOM 6472","TEL 99.99.99.99","99999999","Ok"]
["2014-02-05","NOM PRENOM 6473","TEL 99.99.99.99","99999999","Ok"]
["2014-02-05","NOM PRENOM 6474",null,"","VIDE"]
["2014-02-05","NOM PRENOM 6475","TEL:99-99-99-99","99999999","Ok"]
["2014-02-05","NOM PRENOM 6476","TEL 99999999","99999999","Ok"]
["2014-02-05","NOM PRENOM 6477",null,"","VIDE"]
["2014-02-05","NOM PRENOM 6478","CEL 99.99.99.99","99999999","Ok"]
["2014-02-05","NOM PRENOM 6479","CNI C9999999999 DU 99/99/9999 AU 99/99/9999","","VIDE"]
["2014-02-05","NOM PRENOM 6480","VAL99/99/9999 CEL99999999","99999999","Ok"]
["2014-02-05","NOM PRENOM 6481","TEL 99999999","99999999","Ok"]
["2014-02-05","NOM PRENOM 6482","TEL 99999999","99999999","Ok"]
["2014-02-05","NOM PRENOM 6483",null,"","VIDE"]
["2014-02-05","NOM PRENOM 6484","CNI N° C9999999999 DU 99/99/9999","","VIDE"]
["2014-02-05","NOM PRENOM 6485","CELL 99999999","99999999","Ok"]
["2014-02-05","NOM PRENOM 6486","TEL 99999999","99999999","Ok"]
["2014-02-05","NOM PRENOM 6487","AU 99/99/99 CEL 99999999","99999999","Ok"]
["2014-02-05","NOM PRENOM 6488","TEL 99999999","99999999","Ok"]
["2014-02-05","NOM PRENOM 6489","ATD N°999.9999.99.99.MEMI.PU.99 DU 99.99.99","","VIDE"]
["2014-02-05","NOM PRENOM 6490","CNI C9999999999 DU 99/99/9999 AU 99/99/9999","","VIDE"]
["2014-02-05","NOM PRENOM 6491","TEL 99999999","99999999","Ok"]
["2014-02-05","NOM PRENOM 6492","VAL 99/99/9999 CEL 99999999","99999999","Ok"]
["2014-02-05","NOM PRENOM 6493","TEL 99.99.99.99","99999999","Ok"]
["2014-02-05","NOM PRENOM 6494","ATI 999-999/99-99/MI/PU DU 99/99/99 AU 99/99/99","","VIDE"]
["2014-02-05","NOM PRENOM 6495","TEL 99999999","99999999","Ok"]
["2014-02-05","NOM PRENOM 6496","CEL 99.99.99.99","99999999","Ok"]
["2014-02-05","NOM PRENOM 6497","TEL 99.99.99.99","99999999","Ok"]
["2014-02-05","NOM PRENOM 6498","TEL:99-99-99-99","99999999","Ok"]
["2014-02-05","NOM PRENOM 6499","CEL 99999999","99999999","Ok"]
["2014-02-05","NOM PRENOM 6500","TEL 99999999","99999999","Ok"]
["2014-02-05","NOM PRENOM 6501","CNI N° C9999999999 DU 99/99/9999","","VIDE"]
["2014-02-05","NOM PRENOM 6502","DU 99/99/9999 AU 99/99/9999","","VIDE"]
["2014-02-05","NOM PRENOM 6503","PASSEPORT RDCOB999999 DU 99/99/99 AU 99/99/99","","VIDE"]
["2014-02-05","NOM PRENOM 6504",null,"","VIDE"]
["2014-02-05","NOM PRENOM 6505","TEL 99999999","99999999","Ok"]
["2014-02-05","NOM PRENOM 6506","DU 99/99/9999","","VIDE"]
["2014-02-05","NOM PRENOM 6507",null,"","VIDE"]
["2014-02-05","NOM PRENOM 6508","TEL 99999999","99999999","Ok"]
["2014-02-05","NOM PRENOM 6509","VAL 99/99/9999 CEL 99999999","99999999","Ok"]
["2014-02-05","NOM PRENOM 6510",null,"","VIDE"]
["2014-02-05","NOM PRENOM 6511","CEL 99 99 99 99","99999999","Ok"]
["2014-02-05","NOM PRENOM 6512","CEL:99999999","99999999","Ok"]
["2014-02-05","NOM PRENOM 6513","CNI C9999999999 DU 99.99.9999","","VIDE"]
["2014-02-05","NOM PRENOM 6514","VAL 99/99/9999 CEL 99999999","99999999","Ok"]
["2014-02-05","NOM PRENOM 6515",null,"","VIDE"]
["2014-02-05","NOM PRENOM 6516",99999999,"99999999","Ok"]
["2014-02-05","NOM PRENOM 6517","TEL 99999999","99999999","Ok"]
["2014-02-05","NOM PRENOM 6518",99999999,"99999999","Ok"]
["2014-02-05","NOM PRENOM 6519",null,"","VIDE"]
["2014-02-05","NOM PRENOM 6520",null,"","VIDE"]
["2014-02-05","NOM PRENOM 6521","TEL 99999999","99999999","Ok"]
["2014-02-05","NOM PRENOM 6522","TEL 99999999","99999999","Ok"]
["2014-02-05","NOM PRENOM 6523",null,"","VIDE"]
["2014-02-05","NOM PRENOM 6524","PC N°999999999999 DU 99/99/9999 CEL:99999999","99999999","Ok"]
["2014-02-05","NOM PRENOM 6525","TEL 99999999","99999999","Ok"]
["2014-02-05","NOM PRENOM 6526","LE 99.99.9999 TEL 99.99.99.99","99999999","Ok"]
["2014-02-05","NOM PRENOM 6527","TEL 99999999","99999999","Ok"]
["2014-02-05","NOM PRENOM 6528",null,"","VIDE"]
["2014-02-05","NOM PRENOM 6529",null,"","VIDE"]
["2014-02-05","NOM PRENOM 6530","TEL 99999999//99999999",{"$f":"gettel(C6531)","v":"99999999/99999999"},{"$f":"IF(LEN(D6531)=0,\"VIDE\",IF(LEN(D6531)=8,\"Ok\",\"?\"))","v":"?"}]
["2014-02-05","NOM PRENOM 6531",null,{"$f":"gettel(C6532)","v":""},"VIDE"]
["2014-02-05","NOM PRENOM 6532","CNI C9999999999 DU 99/99/9999 AU 99/99/9999","","VIDE"]
["2014-02-05","NOM PRENOM 6533",null,"","VIDE"]
["2014-02-05","NOM PRENOM 6534","TEL 99999999","99999999","Ok"]
["2014-02-05","NOM PRENOM 6535","ATTEST N 999-9999/99-99/MI/PU-99 DU 99/99/99 AU 99/99/99","","VIDE"]
["2014-02-05","NOM PRENOM 6536",null,"","VIDE"]
["2014-02-05","NOM PRENOM 6537","DU 99/99/9999","","VIDE"]
["2014-02-05","NOM PRENOM 6538",null,"","VIDE"]
["2014-02-05","NOM PRENOM 6539","val 99/99/9999 cel 99999999","99999999","Ok"]
["2014-02-05","NOM PRENOM 6540","TEL 99999999","99999999","Ok"]
["2014-02-05","NOM PRENOM 6541","CNI C 9999999999 DU 99/99/99","","VIDE"]
["2014-02-05","NOM PRENOM 6542","DU 99.99.99","","VIDE"]
["2014-02-05","NOM PRENOM 6543","AI N° 999-9999/99-99/PU 99 DU 99/99/9999 AU 99/99/9999","","VIDE"]
["2014-02-05","NOM PRENOM 6544","ET PC IV NO 99-99-99999999 DU 99/99/99 CEL 99999999","99999999","Ok"]
["2014-02-05","NOM PRENOM 6545","cel 99999999","99999999","Ok"]
["2014-02-05","NOM PRENOM 6546","val 99/99/9999 cel 99999999","99999999","Ok"]
["2014-02-05","NOM PRENOM 6547","DU 99/99/9999","","VIDE"]
["2014-02-05","NOM PRENOM 6548","TEL 99999999","99999999","Ok"]
["2014-02-05","NOM PRENOM 6549",null,"","VIDE"]
["2014-02-05","NOM PRENOM 6550","TEL 99.99.99.99","99999999","Ok"]
["2014-02-05","NOM PRENOM 6551",null,"","VIDE"]
["2014-02-05","NOM PRENOM 6552","TEL 99.99.99.99","99999999","Ok"]
["2014-02-05","NOM PRENOM 6553","TEL 99999999","99999999","Ok"]
["2014-02-05","NOM PRENOM 6554","CNI C 9999999999 DU 99/99/99","","VIDE"]
["2014-02-05","NOM PRENOM 6555","CNI N C 9999 9999 99 DU 99.99.99 AU","","VIDE"]
["2014-02-05","NOM PRENOM 6556","DU 99.99.9999","","VIDE"]
["2014-02-05","NOM PRENOM 6557","CNI C9999.9999.99 DU 99.99.99","","VIDE"]
["2014-02-05","NOM PRENOM 6558","TEL 99999999","99999999","Ok"]
["2014-02-05","NOM PRENOM 6559","TEL 99999999","99999999","Ok"]
["2014-02-05","NOM PRENOM 6560","AI 999-9999/99/99/PU99 DU 99/99/99","","VIDE"]
["2014-02-05","NOM PRENOM 6561",null,"","VIDE"]
["2014-02-05","NOM PRENOM 6562","VAL99/99/9999 CEL99999999","99999999","Ok"]
["2014-02-05","NOM PRENOM 6563","CNI N9  9999.9999.99 DU 99.99.9999","","VIDE"]
["2014-02-05","NOM PRENOM 6564","CNI C9999999999","","VIDE"]
["2014-02-05","NOM PRENOM 6565","TEL 99999999","99999999","Ok"]
["2014-02-05","NOM PRENOM 6566","CNI C9999999999 DU 99/99/99","","VIDE"]
["2014-02-05","NOM PRENOM 6567","CNI C 9999999999 DU 99/9/99 AU 99/9/99","","VIDE"]
["2014-02-05","NOM PRENOM 6568","CNI C9999.9999.99 DU 99/99/9999","","VIDE"]
["2014-02-05","NOM PRENOM 6569","TEL  99999999","99999999","Ok"]
["2014-02-05","NOM PRENOM 6570",null,"","VIDE"]
["2014-02-05","NOM PRENOM 6571",null,"","VIDE"]
["2014-02-05","NOM PRENOM 6572","TEL 99.99.99.99","99999999","Ok"]
["2014-02-05","NOM PRENOM 6573","TEL:99-99-99-99","99999999","Ok"]
["2014-02-05","NOM PRENOM 6574",null,"","VIDE"]
["2014-02-05","NOM PRENOM 6575",null,"","VIDE"]
["2014-02-05","NOM PRENOM 6576",null,"","VIDE"]
["2014-02-05","NOM PRENOM 6577","TEL 99999999","99999999","Ok"]
["2014-02-05","NOM PRENOM 6578",null,"","VIDE"]
["2014-02-05","NOM PRENOM 6579",null,"","VIDE"]
["2014-02-05","NOM PRENOM 6580",null,"","VIDE"]
["2014-02-05","NOM PRENOM 6581",null,"","VIDE"]
["2014-02-05","NOM PRENOM 6582",null,"","VIDE"]
["2014-02-05","NOM PRENOM 6583",null,"","VIDE"]
["2014-02-05","NOM PRENOM 6584",null,"","VIDE"]
["2014-02-05","NOM PRENOM 6585",null,"","VIDE"]
["2014-02-05","NOM PRENOM 6586",null,"","VIDE"]
["2014-02-05","NOM PRENOM 6587",null,"","VIDE"]
["2014-02-05","NOM PRENOM 6588",99999999,"99999999","Ok"]
["2014-02-05","NOM PRENOM 6589",99999999,"99999999","Ok"]
["2014-02-05","NOM PRENOM 6590","TEL 99999999","99999999","Ok"]
["2014-02-05","NOM PRENOM 6591",null,"","VIDE"]
["2014-02-05","NOM PRENOM 6592",null,"","VIDE"]
["2014-02-05","NOM PRENOM 6593","CEL:99999999","99999999","Ok"]
["2014-02-05","NOM PRENOM 6594","CEL 99 99 99 99",{"$f":"gettel(C6595)","v":"99999999"},{"$f":"IF(LEN(D6595)=0,\"VIDE\",IF(LEN(D6595)=8,\"Ok\",\"?\"))","v":"Ok"}]
["2014-02-05","NOM PRENOM 6595","TEL 99999999","99999999","Ok"]
["2014-02-05","NOM PRENOM 6596","CNI N9 C 9999.9999.99 DU 99.99.9999","","VIDE"]
["2014-02-05","NOM PRENOM 6597",null,"","VIDE"]
["2014-02-05","NOM PRENOM 6598",null,"","VIDE"]
["2014-02-05","NOM PRENOM 6599",null,"","VIDE"]
["2014-02-05","NOM PRENOM 6600",null,"","VIDE"]
["2014-02-05","NOM PRENOM 6601","TEL 99999999","99999999","Ok"]
["2014-02-05","NOM PRENOM 6602",null,"","VIDE"]
["2014-02-05","NOM PRENOM 6603",null,"","VIDE"]
["2014-02-05","NOM PRENOM 6604",null,"","VIDE"]
["2014-02-05","NOM PRENOM 6605","9999999/ABFA/99 DU 99.99.9999","","VIDE"]
["2014-02-05","NOM PRENOM 6606","CNI C 9999 9999 99 DU 99/99/99","","VIDE"]
["2014-02-05","NOM PRENOM 6607",99999999,"99999999","Ok"]
["2014-02-05","NOM PRENOM 6608",null,"","VIDE"]
["2014-02-05","NOM PRENOM 6609","DU 99.99.9999","","VIDE"]
["2014-02-06","NOM PRENOM 6610","CNI N°C9999999999 VAL 99.99.9999","","VIDE"]
["2014-02-06","NOM PRENOM 6611",null,"","VIDE"]
["2014-02-06","NOM PRENOM 6612","CEL 99999999","99999999","Ok"]
["2014-02-06","NOM PRENOM 6613",null,"","VIDE"]
["2014-02-06","NOM PRENOM 6614","CNI N9 C 9999.9999.99 DU 99.99.9999","","VIDE"]
["2014-02-06","NOM PRENOM 6615","CIC GUINEE N° AB/9999/AGCI/99/99 DU 99.99.9999","","VIDE"]
["2014-02-06","NOM PRENOM 6616","CNI N9 C 9999.9999.99 DU 99.99.9999","","VIDE"]
["2014-02-06","NOM PRENOM 6617","ATT N 999-99999-99-99/PU-99 DU 99/99/9999","","VIDE"]
["2014-02-06","NOM PRENOM 6618","TEL 99999999","99999999","Ok"]
["2014-02-06","NOM PRENOM 6619","CEL 99 99 99 99","99999999","Ok"]
["2014-02-06","NOM PRENOM 6620",null,"","VIDE"]
["2014-02-06","NOM PRENOM 6621","TEL:99-99-99-99","99999999","Ok"]
["2014-02-06","NOM PRENOM 6622",null,"","VIDE"]
["2014-02-06","NOM PRENOM 6623","TEL 99.99.99.99","99999999","Ok"]
["2014-02-06","NOM PRENOM 6624","TEL 99.99.99.99","99999999","Ok"]
["2014-02-06","NOM PRENOM 6625","ATTEST N 999-99999/99-99/PPA/BCA DU 99/99/99 AU 99/99/99","","VIDE"]
["2014-02-06","NOM PRENOM 6626","CNI N9 C 9999.9999.99 DU 99.99.9999","","VIDE"]
["2014-02-06","NOM PRENOM 6627","TEL 99.99.99.99","99999999","Ok"]
["2014-02-06","NOM PRENOM 6628","TEL 99999999","99999999","Ok"]
["2014-02-06","NOM PRENOM 6629",null,"","VIDE"]
["2014-02-06","NOM PRENOM 6630","CNI C9999999999 DU 99/99/9999 AU 99/99/9999","","VIDE"]
["2014-02-06","NOM PRENOM 6631",null,"","VIDE"]
["2014-02-06","NOM PRENOM 6632","CNI N° C9999999999 DU 99/99/9999","","VIDE"]
["2014-02-06","NOM PRENOM 6633",null,"","VIDE"]
["2014-02-06","NOM PRENOM 6634","TEL 99999999","99999999","Ok"]
["2014-02-06","NOM PRENOM 6635","CNI C 9999999999 DU 99/9/99 AU 99/9/99","","VIDE"]
["2014-02-06","NOM PRENOM 6636",null,"","VIDE"]
["2014-02-06","NOM PRENOM 6637","cel 99999999","99999999","Ok"]
["2014-02-06","NOM PRENOM 6638",null,"","VIDE"]
["2014-02-06","NOM PRENOM 6639","AU 99.99.9999","","VIDE"]
["2014-02-06","NOM PRENOM 6640",null,"","VIDE"]
["2014-02-06","NOM PRENOM 6641","ATTEST N 999-9999-99-99/PPA/BCA DU 99/99/99 AU 99/99/99","","VIDE"]

{"sheet":"Feuil3","index":3,"n_rows":0,"n_cols":0,"rows_kept":0}