{"text_format":"3","workbook":"xlsx","n_sheets":4,"sheets":["Masque","Récap-","RECAP","A-Modèle"],"not_rendered":{"images":1,"macros":1,"defined_names":13},"read":"whole","date_system":"1900"}

{"sheet":"Masque","index":0,"n_rows":68,"n_cols":13,"rows_kept":68,"hidden":true,"merged":[[0,5,0,7]]}
["Prestation","Fonctions","Nets","Brut","Charges","Hébergement",null,null,"Ticket Resto","Oui/Non","Nom_feuilles","Factures","Paiement"]
["Concert","Musicien(ne)","(Vide)",0,0,"(Vide)",null,null,14,"Oui",null,"Envoyée","Reçu"]
["Résidence","Chanteur(se)","France",null,null,"Twin",0,65,null,"Non",null,"Pas envoyée","Pas reçu"]
["Arrangements","Danseur(se)",{"v":30,"d":"30 €"},{"v":39,"d":"39 €"},{"$f":"D4/2","v":{"v":19.5,"d":"20 €"}},"Single",1,60]
["Conférence","Son",{"v":40,"d":"40 €"},{"$f":"C5*D4/C4","v":{"v":52,"d":"52 €"}},{"$f":"D5/2","v":{"v":26,"d":"26 €"}},null,2]
["Projection","Lumière",{"v":50,"d":"50 €"},{"$f":"C6*D5/C5","v":{"v":65,"d":"65 €"}},{"v":32.5,"d":"33 €"},null,3]
["Ateliers","Régisseur(se)",{"v":60,"d":"60 €"},{"$f":"C7*D6/C6","v":{"v":78,"d":"78 €"}},{"v":39,"d":"39 €"},null,4]
[null,"Manageur(se)",{"v":70,"d":"70 €"},{"v":91,"d":"91 €"},{"v":45.5,"d":"46 €"},null,5]
[null,"Comédien(ne)",{"v":80,"d":"80 €"},{"v":104,"d":"104 €"},{"v":52,"d":"52 €"},null,6]
[null,"Intervenant(e)",{"v":90,"d":"90 €"},{"v":117,"d":"117 €"},{"v":58.5,"d":"59 €"},null,7]
[null,"Runner(euse)",{"v":100,"d":"100 €"},{"v":130,"d":"130 €"},{"v":65,"d":"65 €"},null,8]
[null,null,{"v":110,"d":"110 €"},{"v":143,"d":"143 €"},{"v":71.5,"d":"72 €"},null,9]
[null,null,{"v":120,"d":"120 €"},{"v":156,"d":"156 €"},{"v":78,"d":"78 €"},null,10]
[null,null,{"v":130,"d":"130 €"},{"v":169,"d":"169 €"},{"v":84.5,"d":"85 €"},null,11]
[null,null,{"v":140,"d":"140 €"},{"v":182,"d":"182 €"},{"v":91,"d":"91 €"},null,12]
[null,null,{"v":150,"d":"150 €"},{"v":195,"d":"195 €"},{"v":97.5,"d":"98 €"},null,13]
[null,null,{"v":160,"d":"160 €"},{"v":208,"d":"208 €"},{"v":104,"d":"104 €"},null,14]
[null,null,{"v":170,"d":"170 €"},{"v":221,"d":"221 €"},{"v":110.5,"d":"111 €"},null,15]
[null,null,{"v":180,"d":"180 €"},{"v":234,"d":"234 €"},{"v":117,"d":"117 €"},null,16]
[null,null,{"v":190,"d":"190 €"},{"v":247,"d":"247 €"},{"v":123.5,"d":"124 €"},null,17]
[null,null,{"v":200,"d":"200 €"},{"v":260,"d":"260 €"},{"v":130,"d":"130 €"},null,18]
[null,null,{"v":210,"d":"210 €"},{"v":273,"d":"273 €"},{"v":136.5,"d":"137 €"},null,19]
[null,null,{"v":220,"d":"220 €"},{"v":286,"d":"286 €"},{"v":143,"d":"143 €"},null,20]
[null,null,{"v":230,"d":"230 €"},{"v":299,"d":"299 €"},{"v":149.5,"d":"150 €"},null,21]
[null,null,{"v":240,"d":"240 €"},{"v":312,"d":"312 €"},{"v":156,"d":"156 €"},null,22]
[null,null,{"v":250,"d":"250 €"},{"v":325,"d":"325 €"},{"v":162.5,"d":"163 €"},null,23]
[null,null,{"v":260,"d":"260 €"},{"v":338,"d":"338 €"},{"v":169,"d":"169 €"},null,24]
[null,null,{"v":270,"d":"270 €"},{"v":351,"d":"351 €"},{"v":175.5,"d":"176 €"},null,25]
[null,null,{"v":280,"d":"280 €"},{"v":364,"d":"364 €"},{"v":182,"d":"182 €"},null,26]
[null,null,{"v":290,"d":"290 €"},{"v":377,"d":"377 €"},{"v":188.5,"d":"189 €"}]
[null,null,{"v":300,"d":"300 €"},{"v":390,"d":"390 €"},{"v":195,"d":"195 €"}]
[null,null,{"v":400,"d":"400 €"},{"v":520,"d":"520 €"},{"v":260,"d":"260 €"}]
[null,null,{"v":500,"d":"500 €"},{"v":650,"d":"650 €"},{"v":325,"d":"325 €"}]
[null,null,{"v":600,"d":"600 €"},{"v":780,"d":"780 €"},{"v":390,"d":"390 €"}]
[null,null,{"v":700,"d":"700 €"},{"v":910,"d":"910 €"},{"v":455,"d":"455 €"}]
[null,null,"Etranger"]
[null,null,{"v":30,"d":"30 €"},{"$f":"C37*D45/C45","v":{"v":41.45454545454545,"d":"41 €"}},{"$f":"E38*D37/D38","v":20.72727272727272}]
[null,null,{"v":40,"d":"40 €"},{"$f":"C38*D37/C37","v":{"v":55.272727272727266,"d":"55 €"}},27.636363636363626]
[null,null,{"v":50,"d":"50 €"},{"$f":"C39*D38/C38","v":{"v":69.0909090909091,"d":"69 €"}},34.54545454545454]
[null,null,{"v":60,"d":"60 €"},{"v":82.90909090909092,"d":"83 €"},41.45454545454545]
[null,null,{"v":70,"d":"70 €"},{"v":96.72727272727275,"d":"97 €"},48.36363636363637]
[null,null,{"v":80,"d":"80 €"},{"v":110.54545454545458,"d":"111 €"},55.27272727272728]
[null,null,{"v":90,"d":"90 €"},{"v":124.3636363636364,"d":"124 €"},62.181818181818194]
[null,null,{"v":100,"d":"100 €"},{"v":138.18181818181822,"d":"138 €"},{"$f":"E45*D44/D45","v":69.09090909090911}]
[null,null,{"v":110,"d":"110 €"},{"v":152,"d":"152 €"},{"$f":"228-152","v":76}]
[null,null,{"v":120,"d":"120 €"},{"$f":"C46*D45/C45","v":{"v":165.8181818181818,"d":"166 €"}},{"$f":"D46*E45/D45","v":82.9090909090909}]
[null,null,{"v":130,"d":"130 €"},{"$f":"C47*D46/C46","v":{"v":179.63636363636363,"d":"180 €"}},{"$f":"D47*E46/D46","v":89.81818181818181}]
[null,null,{"v":140,"d":"140 €"},{"v":193.45454545454544,"d":"193 €"},96.72727272727272]
[null,null,{"v":150,"d":"150 €"},{"v":207.27272727272725,"d":"207 €"},103.63636363636363]
[null,null,{"v":160,"d":"160 €"},{"v":221.09090909090907,"d":"221 €"},110.54545454545453]
[null,null,{"v":170,"d":"170 €"},{"v":234.9090909090909,"d":"235 €"},117.45454545454545]
[null,null,{"v":180,"d":"180 €"},{"v":248.72727272727272,"d":"249 €"},124.36363636363636]
[null,null,{"v":190,"d":"190 €"},{"v":262.54545454545456,"d":"263 €"},131.27272727272728]
[null,null,{"v":200,"d":"200 €"},{"v":276.3636363636364,"d":"276 €"},138.1818181818182]
[null,null,{"v":210,"d":"210 €"},{"v":290.1818181818182,"d":"290 €"},145.0909090909091]
[null,null,{"v":220,"d":"220 €"},{"v":304,"d":"304 €"},152]
[null,null,{"v":230,"d":"230 €"},{"v":317.8181818181818,"d":"318 €"},158.9090909090909]
[null,null,{"v":240,"d":"240 €"},{"v":331.6363636363636,"d":"332 €"},165.8181818181818]
[null,null,{"v":250,"d":"250 €"},{"v":345.45454545454544,"d":"345 €"},172.72727272727272]
[null,null,{"v":260,"d":"260 €"},{"v":359.27272727272725,"d":"359 €"},179.63636363636363]
[null,null,{"v":270,"d":"270 €"},{"v":373.09090909090907,"d":"373 €"},186.54545454545453]
[null,null,{"v":280,"d":"280 €"},{"v":386.9090909090909,"d":"387 €"},193.45454545454544]
[null,null,{"v":290,"d":"290 €"},{"v":400.7272727272727,"d":"401 €"},200.36363636363635]
[null,null,{"v":300,"d":"300 €"},{"v":414.5454545454545,"d":"415 €"},207.27272727272725]
[null,null,{"v":400,"d":"400 €"},{"v":552.7272727272726,"d":"553 €"},276.3636363636363]
[null,null,{"v":500,"d":"500 €"},{"v":690.9090909090908,"d":"691 €"},345.4545454545454]
[null,null,{"v":600,"d":"600 €"},{"v":829.0909090909089,"d":"829 €"},414.5454545454544]
[null,null,{"v":700,"d":"700 €"},{"v":967.272727272727,"d":"967 €"},483.63636363636346]

{"sheet":"Récap-","index":1,"n_rows":322,"n_cols":33,"rows_kept":322,"merged":[[0,0,1,17],[0,19,1,23],[2,2,2,17],[2,19,2,23],[3,5,3,6],[3,25,3,27],[3,28,3,30],[9,1,16,1],[9,2,16,2],[9,3,16,3],[9,15,16,15],[9,16,16,16],[9,17,16,17],[9,25,16,25],[9,26,16,26],[9,27,16,27],[9,28,16,28],[9,29,16,29],[9,30,16,30],[9,31,16,31],[9,32,16,32],[17,1,24,1],[17,2,24,2],[17,3,24,3],[17,15,24,15],[17,16,24,16],[17,17,24,17],[17,25,24,25],[17,26,24,26],[17,27,24,27],[17,28,24,28],[17,29,24,29],[17,30,24,30],[17,31,24,31],[17,32,24,32],[25,1,32,1],[25,2,32,2],[25,3,32,3],[25,15,32,15],[25,16,32,16],[25,17,32,17],[25,25,32,25],[25,26,32,26],[25,27,32,27],[25,28,32,28],[25,29,32,29],[25,30,32,30],[25,31,32,31],[25,32,32,32],[33,1,40,1],[33,2,40,2],[33,3,40,3],[33,15,40,15],[33,16,40,16],[33,17,40,17],[33,25,40,25],[33,26,40,26],[33,27,40,27],[33,28,40,28],[33,29,40,29],[33,30,40,30],[33,31,40,31],[33,32,40,32],[41,1,48,1],[41,2,48,2],[41,3,48,3],[41,15,48,15],[41,16,48,16],[41,17,48,17],[41,25,48,25],[41,26,48,26],[41,27,48,27],[41,28,48,28],[41,29,48,29],[41,30,48,30],[41,31,48,31],[41,32,48,32],[48,19,48,20],[49,1,56,1],[49,2,56,2],[49,3,56,3],[49,15,56,15],[49,16,56,16],[49,17,56,17],[49,25,56,25],[49,26,56,26],[49,27,56,27],[49,28,56,28],[49,29,56,29],[49,30,56,30],[49,31,56,31],[49,32,56,32],[57,1,64,1],[57,2,64,2],[57,3,64,3],[57,15,64,15],[57,16,64,16],[57,17,64,17],[57,25,64,25],[57,26,64,26],[57,27,64,27],[57,28,64,28],[57,29,64,29],[57,30,64,30],[57,31,64,31],[57,32,64,32],[65,1,72,1],[65,2,72,2],[65,3,72,3],[65,15,72,15],[65,16,72,16],[65,17,72,17],[65,25,72,25],[65,26,72,26],[65,27,72,27],[65,28,72,28],[65,29,72,29],[65,30,72,30],[65,31,72,31],[65,32,72,32],[73,1,80,1],[73,2,80,2],[73,3,80,3],[73,15,80,15],[73,16,80,16],[73,17,80,17],[73,25,80,25],[73,26,80,26],[73,27,80,27],[73,28,80,28],[73,29,80,29],[73,30,80,30],[73,31,80,31],[73,32,80,32],[81,1,88,1],[81,2,88,2],[81,3,88,3],[81,15,88,15],[81,16,88,16],[81,17,88,17],[81,25,88,25],[81,26,88,26],[81,27,88,27],[81,28,88,28],[81,29,88,29],[81,30,88,30],[81,31,88,31],[81,32,88,32],[89,1,96,1],[89,2,96,2],[89,3,96,3],[89,15,96,15],[89,16,96,16],[89,17,96,17],[89,25,96,25],[89,26,96,26],[89,27,96,27],[89,28,96,28],[89,29,96,29],[89,30,96,30],[89,31,96,31],[89,32,96,32],[97,1,104,1],[97,2,104,2],[97,3,104,3],[97,15,104,15],[97,16,104,16],[97,17,104,17],[97,25,104,25],[97,26,104,26],[97,27,104,27],[97,28,104,28],[97,29,104,29],[97,30,104,30],[97,31,104,31],[97,32,104,32],[105,1,112,1],[105,2,112,2],[105,3,112,3],[105,15,112,15],[105,16,112,16],[105,17,112,17],[105,25,112,25],[105,26,112,26],[105,27,112,27],[105,28,112,28],[105,29,112,29],[105,30,112,30],[105,31,112,31],[105,32,112,32],[113,1,120,1],[113,2,120,2],[113,3,120,3],[113,15,120,15],[113,16,120,16],[113,17,120,17],[113,25,120,25],[113,26,120,26],[113,27,120,27],[113,28,120,28],[113,29,120,29],[113,30,120,30],[113,31,120,31],[113,32,120,32],[121,1,128,1],[121,2,128,2],[121,3,128,3],[121,15,128,15],[121,16,128,16],[121,17,128,17],[121,25,128,25],[121,26,128,26],[121,27,128,27],[121,28,128,28],[121,29,128,29],[121,30,128,30],[121,31,128,31],[121,32,128,32],[129,1,136,1],[129,2,136,2],[129,3,136,3],[129,15,136,15],[129,16,136,16],[129,17,136,17],[129,25,136,25],[129,26,136,26],[129,27,136,27],[129,28,136,28],[129,29,136,29],[129,30,136,30],[129,31,136,31],[129,32,136,32],[137,1,144,1],[137,2,144,2],[137,3,144,3],[137,15,144,15],[137,16,144,16],[137,17,144,17],[137,25,144,25],[137,26,144,26],[137,27,144,27],[137,28,144,28],[137,29,144,29],[137,30,144,30],[137,31,144,31],[137,32,144,32],[145,1,152,1],[145,2,152,2],[145,3,152,3],[145,15,152,15],[145,16,152,16],[145,17,152,17],[145,25,152,25],[145,26,152,26],[145,27,152,27],[145,28,152,28],[145,29,152,29],[145,30,152,30],[145,31,152,31],[145,32,152,32],[153,1,160,1],[153,2,160,2],[153,3,160,3],[153,15,160,15],[153,16,160,16],[153,17,160,17],[153,25,160,25],[153,26,160,26],[153,27,160,27],[153,28,160,28],[153,29,160,29],[153,30,160,30],[153,31,160,31],[153,32,160,32],[161,1,168,1],[161,2,168,2],[161,3,168,3],[161,15,168,15],[161,16,168,16],[161,17,168,17],[161,25,168,25],[161,26,168,26],[161,27,168,27],[161,28,168,28],[161,29,168,29],[161,30,168,30],[161,31,168,31],[161,32,168,32],[169,1,176,1],[169,2,176,2],[169,3,176,3],[169,15,176,15],[169,16,176,16],[169,17,176,17],[169,25,176,25],[169,26,176,26],[169,27,176,27],[169,28,176,28],[169,29,176,29],[169,30,176,30],[169,31,176,31],[169,32,176,32],[177,1,184,1],[177,2,184,2],[177,3,184,3],[177,15,184,15],[177,16,184,16],[177,17,184,17],[177,25,184,25],[177,26,184,26],[177,27,184,27],[177,28,184,28],[177,29,184,29],[177,30,184,30],[177,31,184,31],[177,32,184,32],[185,1,192,1],[185,2,192,2],[185,3,192,3],[185,15,192,15],[185,16,192,16],[185,17,192,17],[185,25,192,25],[185,26,192,26],[185,27,192,27],[185,28,192,28],[185,29,192,29],[185,30,192,30],[185,31,192,31],[185,32,192,32],[193,1,200,1],[193,2,200,2],[193,3,200,3],[193,15,200,15],[193,16,200,16],[193,17,200,17],[193,25,200,25],[193,26,200,26],[193,27,200,27],[193,28,200,28],[193,29,200,29],[193,30,200,30],[193,31,200,31],[193,32,200,32],[201,1,208,1],[201,2,208,2],[201,3,208,3],[201,15,208,15],[201,16,208,16],[201,17,208,17],[201,25,208,25],[201,26,208,26],[201,27,208,27],[201,28,208,28],[201,29,208,29],[201,30,208,30],[201,31,208,31],[201,32,208,32],[209,1,216,1],[209,2,216,2],[209,3,216,3],[209,15,216,15],[209,16,216,16],[209,17,216,17],[209,25,216,25],[209,26,216,26],[209,27,216,27],[209,28,216,28],[209,29,216,29],[209,30,216,30],[209,31,216,31],[209,32,216,32],[217,1,224,1],[217,2,224,2],[217,3,224,3],[217,15,224,15],[217,16,224,16],[217,17,224,17],[217,25,224,25],[217,26,224,26],[217,27,224,27],[217,28,224,28],[217,29,224,29],[217,30,224,30],[217,31,224,31],[217,32,224,32],[225,1,232,1],[225,2,232,2],[225,3,232,3],[225,15,232,15],[225,16,232,16],[225,17,232,17],[225,25,232,25],[225,26,232,26],[225,27,232,27],[225,28,232,28],[225,29,232,29],[225,30,232,30],[225,31,232,31],[225,32,232,32],[233,1,240,1],[233,2,240,2],[233,3,240,3],[233,15,240,15],[233,16,240,16],[233,17,240,17],[233,25,240,25],[233,26,240,26],[233,27,240,27],[233,28,240,28],[233,29,240,29],[233,30,240,30],[233,31,240,31],[233,32,240,32],[241,1,248,1],[241,2,248,2],[241,3,248,3],[241,15,248,15],[241,16,248,16],[241,17,248,17],[241,25,248,25],[241,26,248,26],[241,27,248,27],[241,28,248,28],[241,29,248,29],[241,30,248,30],[241,31,248,31],[241,32,248,32],[249,1,256,1],[249,2,256,2],[249,3,256,3],[249,15,256,15],[249,16,256,16],[249,17,256,17],[249,25,256,25],[249,26,256,26],[249,27,256,27],[249,28,256,28],[249,29,256,29],[249,30,256,30],[249,31,256,31],[249,32,256,32],[257,1,264,1],[257,2,264,2],[257,3,264,3],[257,15,264,15],[257,16,264,16],[257,17,264,17],[257,25,264,25],[257,26,264,26],[257,27,264,27],[257,28,264,28],[257,29,264,29],[257,30,264,30],[257,31,264,31],[257,32,264,32],[265,1,272,1],[265,2,272,2],[265,3,272,3],[265,15,272,15],[265,16,272,16],[265,17,272,17],[265,25,272,25],[265,26,272,26],[265,27,272,27],[265,28,272,28],[265,29,272,29],[265,30,272,30],[265,31,272,31],[265,32,272,32],[273,1,280,1],[273,2,280,2],[273,3,280,3],[273,15,280,15],[273,16,280,16],[273,17,280,17],[273,25,280,25],[273,26,280,26],[273,27,280,27],[273,28,280,28],[273,29,280,29],[273,30,280,30],[273,31,280,31],[273,32,280,32],[281,1,288,1],[281,2,288,2],[281,3,288,3],[281,15,288,15],[281,16,288,16],[281,17,288,17],[281,25,288,25],[281,26,288,26],[281,27,288,27],[281,28,288,28],[281,29,288,29],[281,30,288,30],[281,31,288,31],[281,32,288,32],[289,1,296,1],[289,2,296,2],[289,3,296,3],[289,15,296,15],[289,16,296,16],[289,17,296,17],[289,25,296,25],[289,26,296,26],[289,27,296,27],[289,28,296,28],[289,29,296,29],[289,30,296,30],[289,31,296,31],[289,32,296,32],[297,1,304,1],[297,2,304,2],[297,3,304,3],[297,15,304,15],[297,16,304,16],[297,17,304,17],[297,25,304,25],[297,26,304,26],[297,27,304,27],[297,28,304,28],[297,29,304,29],[297,30,304,30],[297,31,304,31],[297,32,304,32],[305,1,312,1],[305,2,312,2],[305,3,312,3],[305,15,312,15],[305,16,312,16],[305,17,312,17],[305,25,312,25],[305,26,312,26],[305,27,312,27],[305,28,312,28],[305,29,312,29],[305,30,312,30],[305,31,312,31],[305,32,312,32],[313,1,320,1],[313,2,320,2],[313,3,320,3],[313,15,320,15],[313,16,320,16],[313,17,320,17],[313,25,320,25],[313,26,320,26],[313,27,320,27],[313,28,320,28],[313,29,320,29],[313,30,320,30],[313,31,320,31],[313,32,320,32],[321,2,322,4],[321,5,322,5],[321,6,322,6],[321,7,322,7],[321,8,322,8],[321,9,322,9],[321,10,322,10],[321,11,322,11],[321,12,322,12],[321,13,322,13],[321,14,322,14],[321,15,322,15],[321,16,322,16],[321,17,322,17]]}
["Tableau récapitulatif / Edition 2015",{"$nulls":18},"Tableau + que récapitulatif / Edition 2015"]
[]
[null,null,"Ne rien modifier, tout est automatisé sur cette page",{"$nulls":16},"Ne rien modifier, tout est automatisé sur cette page"]
[{"$nulls":25},"Convention Ville",null,null,"Cession Groupes"]
["Lien>Feuille","Feuille","Date","Ville",null,"Brut","Charges","Cession","Frais de Prod","Hôtel","Repas","Transport","Location Son","Location Studio","Sous-Total Charges","Total Charges","Total \nRecettes","Résultat",null,"Date","Ville","Total Charges","Total \nRecettes","Résultat",null,"Faite","Envoyée","Reçue","Faite","Envoyée","Reçue","SACEM","CNV"]
[null,{"$f":"MID(INDEX(nom_feuilles,ROW(Masque!K1)),SEARCH(\"]\",INDEX(nom_feuilles,ROW(Masque!K1)))+1,30)","v":"Masque"},null,{"$f":"IF(B6=\"\",\"\",INDIRECT(\"'\"&B6&\"'!$A$4\"))","v":"Arrangements"},{"$nulls":10},{"$f":"IF(B6=\"\",\"\",INDIRECT(\"'\"&B6&\"'!$B$5\"))","v":"Son"}]
[null,{"$f":"MID(INDEX(nom_feuilles,ROW(Masque!K2)),SEARCH(\"]\",INDEX(nom_feuilles,ROW(Masque!K2)))+1,30)","v":"Récap-"},null,{"$f":"IF(B7=\"\",\"\",INDIRECT(\"'\"&B7&\"'!$A$4\"))","v":0},{"$nulls":10},{"$f":"IF(B7=\"\",\"\",INDIRECT(\"'\"&B7&\"'!$B$7\"))","v":"Récap-"},null,{"$f":"IF(B7=\"\",\"\",INDIRECT(\"'\"&B7&\"'!$B$11\"))","v":0}]
[null,{"$f":"MID(INDEX(nom_feuilles,ROW(Masque!K3)),SEARCH(\"]\",INDEX(nom_feuilles,ROW(Masque!K3)))+1,30)","v":"RECAP"},null,{"$f":"IF(B8=\"\",\"\",INDIRECT(\"'\"&B8&\"'!$A$5\"))","v":0},{"$nulls":3},{"$f":"IF(B8=\"\",\"\",INDIRECT(\"'\"&B8&\"'!$B$13\"))","v":0},{"$f":"IF(B8=\"\",\"\",INDIRECT(\"'\"&B8&\"'!$B$15\"))","v":0},{"$f":"IF(B8=\"\",\"\",INDIRECT(\"'\"&B8&\"'!$D$18\"))","v":0},{"$f":"IF(B8=\"\",\"\",INDIRECT(\"'\"&B8&\"'!$c$22\"))","v":0},{"$f":"IF(B8=\"\",\"\",INDIRECT(\"'\"&B8&\"'!$B$27\"))","v":0},{"$f":"IF(B8=\"\",\"\",INDIRECT(\"'\"&B8&\"'!$B$29\"))","v":0},null,{"$f":"IF(B8=\"\",\"\",INDIRECT(\"'\"&B8&\"'!$B$7\"))","v":0},null,{"$f":"IF(B8=\"\",\"\",INDIRECT(\"'\"&B8&\"'!$B$9\"))","v":0}]
["Modèle",{"$f":"MID(INDEX(nom_feuilles,ROW(Masque!K4)),SEARCH(\"]\",INDEX(nom_feuilles,ROW(Masque!K4)))+1,30)","v":"A-Modèle"},null,{"$f":"IF(B9=\"\",\"\",INDIRECT(\"'\"&B9&\"'!$A$5\"))","v":0},null,{"$f":"IF(B9=\"\",\"\",INDIRECT(\"'\"&B9&\"'!$H$140\"))","v":0},{"$f":"IF(B9=\"\",\"\",INDIRECT(\"'\"&B9&\"'!$I$140\"))","v":0},{"$f":"IF(B9=\"\",\"\",INDIRECT(\"'\"&B9&\"'!$B$13\"))","v":0},{"$f":"IF(B9=\"\",\"\",INDIRECT(\"'\"&B9&\"'!$B$15\"))","v":0},{"$f":"IF(B9=\"\",\"\",INDIRECT(\"'\"&B9&\"'!$D$18\"))","v":0},{"$f":"IF(B9=\"\",\"\",INDIRECT(\"'\"&B9&\"'!$c$22\"))","v":0},{"$f":"IF(B9=\"\",\"\",INDIRECT(\"'\"&B9&\"'!$B$24\"))","v":0},{"$f":"IF(B9=\"\",\"\",INDIRECT(\"'\"&B9&\"'!$B$30\"))","v":0},null,{"$f":"SUM(F9:M9)","v":0},null,{"$f":"IF(B9=\"\",\"\",INDIRECT(\"'\"&B9&\"'!$B$9\"))","v":0},{"$f":"Q9-O9","v":0}]
[null,{"$f":"MID(INDEX(nom_feuilles,ROW(Masque!K5)),SEARCH(\"]\",INDEX(nom_feuilles,ROW(Masque!K5)))+1,30)","v":{"$error":"#REF!"}},{"$f":"IF(B10=\"\",\"\",INDIRECT(\"'\"&B10&\"'!$A$1\"))","v":{"$error":"#REF!"}},{"$f":"IF(B10=\"\",\"\",INDIRECT(\"'\"&B10&\"'!$A$2\"))","v":{"$error":"#REF!"}},{"$f":"IF(B10=\"\",\"\",INDIRECT(\"'\"&B10&\"'!$A$8\"))","v":{"$error":"#REF!"}},{"$f":"IF(B10=\"\",\"\",INDIRECT(\"'\"&B10&\"'!$K$30\"))","v":{"$error":"#REF!"}},{"$f":"IF(B10=\"\",\"\",INDIRECT(\"'\"&B10&\"'!$L$30\"))","v":{"$error":"#REF!"}},{"$f":"IF(B10=\"\",\"\",INDIRECT(\"'\"&B10&\"'!$H$30\"))","v":{"$error":"#REF!"}},{"$f":"IF(B10=\"\",\"\",INDIRECT(\"'\"&B10&\"'!$I$30\"))","v":{"$error":"#REF!"}},{"$f":"IF(B10=\"\",\"\",INDIRECT(\"'\"&B10&\"'!$R$30\"))","v":{"$error":"#REF!"}},{"$f":"IF(B10=\"\",\"\",INDIRECT(\"'\"&B10&\"'!$U$30\"))","v":{"$error":"#REF!"}},{"$f":"IF(B10=\"\",\"\",INDIRECT(\"'\"&B10&\"'!$X$30\"))","v":{"$error":"#REF!"}},{"$f":"IF(B10=\"\",\"\",INDIRECT(\"'\"&B10&\"'!$Z$30\"))","v":{"$error":"#REF!"}},{"$f":"IF(B10=\"\",\"\",INDIRECT(\"'\"&B10&\"'!$AA$30\"))","v":{"$error":"#REF!"}},{"$f":"SUM(F10:N10)","v":{"$error":"#REF!"}},{"$f":"SUM(O10:O17)","v":{"$error":"#REF!"}},{"$f":"IF(B10=\"\",\"\",INDIRECT(\"'\"&B10&\"'!$H$4\"))","v":{"$error":"#REF!"}},{"$f":"P10-Q10","v":{"$error":"#REF!"}},null,{"$f":"C10","v":{"$error":"#REF!"}},{"$f":"D10","v":{"$error":"#REF!"}},{"$f":"P10","v":{"$error":"#REF!"}},{"$f":"Q10","v":{"$error":"#REF!"}},{"$f":"V10-W10","v":{"$error":"#REF!"}}]
[{"$nulls":4},{"$f":"IF(B10=\"\",\"\",INDIRECT(\"'\"&B10&\"'!$A$32\"))","v":{"$error":"#REF!"}},{"$f":"IF(B10=\"\",\"\",INDIRECT(\"'\"&B10&\"'!$K$54\"))","v":{"$error":"#REF!"}},{"$f":"IF(B10=\"\",\"\",INDIRECT(\"'\"&B10&\"'!$L$54\"))","v":{"$error":"#REF!"}},{"$f":"IF(B10=\"\",\"\",INDIRECT(\"'\"&B10&\"'!$H$54\"))","v":{"$error":"#REF!"}},{"$f":"IF(B10=\"\",\"\",INDIRECT(\"'\"&B10&\"'!$I$54\"))","v":{"$error":"#REF!"}},{"$f":"IF(B10=\"\",\"\",INDIRECT(\"'\"&B10&\"'!$R$54\"))","v":{"$error":"#REF!"}},{"$f":"IF(B10=\"\",\"\",INDIRECT(\"'\"&B10&\"'!$U$54\"))","v":{"$error":"#REF!"}},{"$f":"IF(B10=\"\",\"\",INDIRECT(\"'\"&B10&\"'!$X$54\"))","v":{"$error":"#REF!"}},{"$f":"IF(B10=\"\",\"\",INDIRECT(\"'\"&B10&\"'!$Z$54\"))","v":{"$error":"#REF!"}},{"$f":"IF(B10=\"\",\"\",INDIRECT(\"'\"&B10&\"'!$AA$54\"))","v":{"$error":"#REF!"}},{"$f":"SUM(F11:N11)","v":{"$error":"#REF!"}},{"$nulls":4},{"$f":"C18","v":{"$error":"#REF!"}},{"$f":"D18","v":{"$error":"#REF!"}},{"$f":"P18","v":{"$error":"#REF!"}},{"$f":"Q18","v":{"$error":"#REF!"}},{"$f":"V11-W11","v":{"$error":"#REF!"}}]
[{"$nulls":4},{"$f":"IF(B10=\"\",\"\",INDIRECT(\"'\"&B10&\"'!$A$56\"))","v":{"$error":"#REF!"}},{"$f":"IF(B10=\"\",\"\",INDIRECT(\"'\"&B10&\"'!$K$78\"))","v":{"$error":"#REF!"}},{"$f":"IF(B10=\"\",\"\",INDIRECT(\"'\"&B10&\"'!$L$78\"))","v":{"$error":"#REF!"}},{"$f":"IF(B10=\"\",\"\",INDIRECT(\"'\"&B10&\"'!$H$78\"))","v":{"$error":"#REF!"}},{"$f":"IF(B10=\"\",\"\",INDIRECT(\"'\"&B10&\"'!$I$78\"))","v":{"$error":"#REF!"}},{"$f":"IF(B10=\"\",\"\",INDIRECT(\"'\"&B10&\"'!$R$78\"))","v":{"$error":"#REF!"}},{"$f":"IF(B10=\"\",\"\",INDIRECT(\"'\"&B10&\"'!$U$78\"))","v":{"$error":"#REF!"}},{"$f":"IF(B10=\"\",\"\",INDIRECT(\"'\"&B10&\"'!$X$78\"))","v":{"$error":"#REF!"}},{"$f":"IF(B10=\"\",\"\",INDIRECT(\"'\"&B10&\"'!$Z$78\"))","v":{"$error":"#REF!"}},{"$f":"IF(B10=\"\",\"\",INDIRECT(\"'\"&B10&\"'!$AA$78\"))","v":{"$error":"#REF!"}},{"$f":"SUM(F12:N12)","v":{"$error":"#REF!"}},{"$nulls":4},{"$f":"C26","v":{"$error":"#REF!"}},{"$f":"D26","v":{"$error":"#REF!"}},{"$f":"P26","v":{"$error":"#REF!"}},{"$f":"Q26","v":{"$error":"#REF!"}},{"$error":"#REF!"}]
[{"$nulls":4},{"$f":"IF(B10=\"\",\"\",INDIRECT(\"'\"&B10&\"'!$A$80\"))","v":{"$error":"#REF!"}},{"$f":"IF(B10=\"\",\"\",INDIRECT(\"'\"&B10&\"'!$K$102\"))","v":{"$error":"#REF!"}},{"$f":"IF(B10=\"\",\"\",INDIRECT(\"'\"&B10&\"'!$L$102\"))","v":{"$error":"#REF!"}},{"$f":"IF(B10=\"\",\"\",INDIRECT(\"'\"&B10&\"'!$H$102\"))","v":{"$error":"#REF!"}},{"$f":"IF(B10=\"\",\"\",INDIRECT(\"'\"&B10&\"'!$I$102\"))","v":{"$error":"#REF!"}},{"$f":"IF(B10=\"\",\"\",INDIRECT(\"'\"&B10&\"'!$R$102\"))","v":{"$error":"#REF!"}},{"$f":"IF(B10=\"\",\"\",INDIRECT(\"'\"&B10&\"'!$U$102\"))","v":{"$error":"#REF!"}},{"$f":"IF(B10=\"\",\"\",INDIRECT(\"'\"&B10&\"'!$X$102\"))","v":{"$error":"#REF!"}},{"$f":"IF(B10=\"\",\"\",INDIRECT(\"'\"&B10&\"'!$Z$102\"))","v":{"$error":"#REF!"}},{"$f":"IF(B10=\"\",\"\",INDIRECT(\"'\"&B10&\"'!$AA$102\"))","v":{"$error":"#REF!"}},{"$error":"#REF!"},{"$nulls":4},{"$f":"C34","v":{"$error":"#REF!"}},{"$f":"D34","v":{"$error":"#REF!"}},{"$f":"P34","v":{"$error":"#REF!"}},{"$f":"Q34","v":{"$error":"#REF!"}},{"$error":"#REF!"}]
[{"$nulls":4},{"$f":"IF(B10=\"\",\"\",INDIRECT(\"'\"&B10&\"'!$A$104\"))","v":{"$error":"#REF!"}},{"$f":"IF(B10=\"\",\"\",INDIRECT(\"'\"&B10&\"'!$K$111\"))","v":{"$error":"#REF!"}},{"$f":"IF(B10=\"\",\"\",INDIRECT(\"'\"&B10&\"'!$L$111\"))","v":{"$error":"#REF!"}},{"$f":"IF(B10=\"\",\"\",INDIRECT(\"'\"&B10&\"'!$H$111\"))","v":{"$error":"#REF!"}},{"$f":"IF(B10=\"\",\"\",INDIRECT(\"'\"&B10&\"'!$I$111\"))","v":{"$error":"#REF!"}},{"$f":"IF(B10=\"\",\"\",INDIRECT(\"'\"&B10&\"'!$R$111\"))","v":{"$error":"#REF!"}},{"$f":"IF(B10=\"\",\"\",INDIRECT(\"'\"&B10&\"'!$U$111\"))","v":{"$error":"#REF!"}},{"$f":"IF(B10=\"\",\"\",INDIRECT(\"'\"&B10&\"'!$X$111\"))","v":{"$error":"#REF!"}},{"$f":"IF(B10=\"\",\"\",INDIRECT(\"'\"&B10&\"'!$Z$111\"))","v":{"$error":"#REF!"}},{"$f":"IF(B10=\"\",\"\",INDIRECT(\"'\"&B10&\"'!$AA$111\"))","v":{"$error":"#REF!"}},{"$f":"SUM(F14:N14)","v":{"$error":"#REF!"}},{"$nulls":4},{"$f":"C42","v":{"$error":"#REF!"}},{"$f":"D42","v":{"$error":"#REF!"}},{"$f":"P42","v":{"$error":"#REF!"}},{"$f":"Q42","v":{"$error":"#REF!"}},{"$error":"#REF!"}]
[{"$nulls":4},{"$f":"IF(B10=\"\",\"\",INDIRECT(\"'\"&B10&\"'!$A$113\"))","v":{"$error":"#REF!"}},{"$f":"IF(B10=\"\",\"\",INDIRECT(\"'\"&B10&\"'!$K$120\"))","v":{"$error":"#REF!"}},{"$f":"IF(B10=\"\",\"\",INDIRECT(\"'\"&B10&\"'!$L$120\"))","v":{"$error":"#REF!"}},{"$f":"IF(B10=\"\",\"\",INDIRECT(\"'\"&B10&\"'!$H$120\"))","v":{"$error":"#REF!"}},{"$f":"IF(B10=\"\",\"\",INDIRECT(\"'\"&B10&\"'!$I$120\"))","v":{"$error":"#REF!"}},{"$f":"IF(B10=\"\",\"\",INDIRECT(\"'\"&B10&\"'!$R$120\"))","v":{"$error":"#REF!"}},{"$f":"IF(B10=\"\",\"\",INDIRECT(\"'\"&B10&\"'!$U$120\"))","v":{"$error":"#REF!"}},{"$f":"IF(B10=\"\",\"\",INDIRECT(\"'\"&B10&\"'!$X$120\"))","v":{"$error":"#REF!"}},{"$f":"IF(B10=\"\",\"\",INDIRECT(\"'\"&B10&\"'!$Z$120\"))","v":{"$error":"#REF!"}},{"$f":"IF(B10=\"\",\"\",INDIRECT(\"'\"&B10&\"'!$AA$120\"))","v":{"$error":"#REF!"}},{"$error":"#REF!"},{"$nulls":4},{"$f":"C50","v":{"$error":"#REF!"}},{"$f":"D50","v":{"$error":"#REF!"}},{"$f":"P50","v":{"$error":"#REF!"}},{"$f":"Q50","v":{"$error":"#REF!"}},{"$error":"#REF!"}]
[{"$nulls":4},{"$f":"IF(B10=\"\",\"\",INDIRECT(\"'\"&B10&\"'!$A$122\"))","v":{"$error":"#REF!"}},{"$f":"IF(B10=\"\",\"\",INDIRECT(\"'\"&B10&\"'!$K$129\"))","v":{"$error":"#REF!"}},{"$f":"IF(B10=\"\",\"\",INDIRECT(\"'\"&B10&\"'!$L$129\"))","v":{"$error":"#REF!"}},{"$f":"IF(B10=\"\",\"\",INDIRECT(\"'\"&B10&\"'!$H$129\"))","v":{"$error":"#REF!"}},{"$f":"IF(B10=\"\",\"\",INDIRECT(\"'\"&B10&\"'!$I$129\"))","v":{"$error":"#REF!"}},{"$f":"IF(B10=\"\",\"\",INDIRECT(\"'\"&B10&\"'!$R$129\"))","v":{"$error":"#REF!"}},{"$f":"IF(B10=\"\",\"\",INDIRECT(\"'\"&B10&\"'!$U$129\"))","v":{"$error":"#REF!"}},{"$f":"IF(B10=\"\",\"\",INDIRECT(\"'\"&B10&\"'!$X$129\"))","v":{"$error":"#REF!"}},{"$f":"IF(B10=\"\",\"\",INDIRECT(\"'\"&B10&\"'!$Z$129\"))","v":{"$error":"#REF!"}},{"$f":"IF(B10=\"\",\"\",INDIRECT(\"'\"&B10&\"'!$AA$129\"))","v":{"$error":"#REF!"}},{"$error":"#REF!"},{"$nulls":4},{"$f":"C58","v":{"$error":"#REF!"}},{"$f":"D58","v":{"$error":"#REF!"}},{"$f":"P58","v":{"$error":"#REF!"}},{"$f":"Q58","v":{"$error":"#REF!"}},{"$error":"#REF!"}]
[{"$nulls":4},{"$f":"IF(B10=\"\",\"\",INDIRECT(\"'\"&B10&\"'!$A$131\"))","v":{"$error":"#REF!"}},{"$f":"IF(B10=\"\",\"\",INDIRECT(\"'\"&B10&\"'!$K$167\"))","v":{"$error":"#REF!"}},{"$f":"IF(B10=\"\",\"\",INDIRECT(\"'\"&B10&\"'!$L$167\"))","v":{"$error":"#REF!"}},{"$f":"IF(B10=\"\",\"\",INDIRECT(\"'\"&B10&\"'!$H$167\"))","v":{"$error":"#REF!"}},{"$f":"IF(B10=\"\",\"\",INDIRECT(\"'\"&B10&\"'!$I$167\"))","v":{"$error":"#REF!"}},{"$f":"IF(B10=\"\",\"\",INDIRECT(\"'\"&B10&\"'!$R$167\"))","v":{"$error":"#REF!"}},{"$f":"IF(B10=\"\",\"\",INDIRECT(\"'\"&B10&\"'!$U$167\"))","v":{"$error":"#REF!"}},{"$f":"IF(B10=\"\",\"\",INDIRECT(\"'\"&B10&\"'!$X$167\"))","v":{"$error":"#REF!"}},{"$f":"IF(B10=\"\",\"\",INDIRECT(\"'\"&B10&\"'!$Z$167\"))","v":{"$error":"#REF!"}},{"$f":"IF(B10=\"\",\"\",INDIRECT(\"'\"&B10&\"'!$AA$167\"))","v":{"$error":"#REF!"}},{"$error":"#REF!"},{"$nulls":4},{"$f":"C66","v":{"$error":"#REF!"}},{"$f":"D66","v":{"$error":"#REF!"}},{"$f":"P66","v":{"$error":"#REF!"}},{"$f":"Q66","v":{"$error":"#REF!"}},{"$error":"#REF!"}]
[null,{"$f":"MID(INDEX(nom_feuilles,ROW(Masque!K6)),SEARCH(\"]\",INDEX(nom_feuilles,ROW(Masque!K6)))+1,30)","v":{"$error":"#REF!"}},{"$f":"IF(B18=\"\",\"\",INDIRECT(\"'\"&B18&\"'!$A$1\"))","v":{"$error":"#REF!"}},{"$f":"IF(B18=\"\",\"\",INDIRECT(\"'\"&B18&\"'!$A$2\"))","v":{"$error":"#REF!"}},{"$f":"IF(B18=\"\",\"\",INDIRECT(\"'\"&B18&\"'!$A$8\"))","v":{"$error":"#REF!"}},{"$f":"IF(B18=\"\",\"\",INDIRECT(\"'\"&B18&\"'!$K$30\"))","v":{"$error":"#REF!"}},{"$f":"IF(B18=\"\",\"\",INDIRECT(\"'\"&B18&\"'!$L$30\"))","v":{"$error":"#REF!"}},{"$f":"IF(B18=\"\",\"\",INDIRECT(\"'\"&B18&\"'!$H$30\"))","v":{"$error":"#REF!"}},{"$f":"IF(B18=\"\",\"\",INDIRECT(\"'\"&B18&\"'!$I$30\"))","v":{"$error":"#REF!"}},{"$f":"IF(B18=\"\",\"\",INDIRECT(\"'\"&B18&\"'!$R$30\"))","v":{"$error":"#REF!"}},{"$f":"IF(B18=\"\",\"\",INDIRECT(\"'\"&B18&\"'!$U$30\"))","v":{"$error":"#REF!"}},{"$f":"IF(B18=\"\",\"\",INDIRECT(\"'\"&B18&\"'!$X$30\"))","v":{"$error":"#REF!"}},{"$f":"IF(B18=\"\",\"\",INDIRECT(\"'\"&B18&\"'!$Z$30\"))","v":{"$error":"#REF!"}},{"$f":"IF(B18=\"\",\"\",INDIRECT(\"'\"&B18&\"'!$AA$30\"))","v":{"$error":"#REF!"}},{"$f":"SUM(F18:N18)","v":{"$error":"#REF!"}},{"$f":"SUM(O18:O25)","v":{"$error":"#REF!"}},{"$f":"IF(B18=\"\",\"\",INDIRECT(\"'\"&B18&\"'!$H$4\"))","v":{"$error":"#REF!"}},{"$f":"P18-Q18","v":{"$error":"#REF!"}},null,{"$f":"C74","v":{"$error":"#REF!"}},{"$f":"D74","v":{"$error":"#REF!"}},{"$f":"P74","v":{"$error":"#REF!"}},{"$f":"Q74","v":{"$error":"#REF!"}},{"$error":"#REF!"}]
[{"$nulls":4},{"$f":"IF(B18=\"\",\"\",INDIRECT(\"'\"&B18&\"'!$A$32\"))","v":{"$error":"#REF!"}},{"$f":"IF(B18=\"\",\"\",INDIRECT(\"'\"&B18&\"'!$K$54\"))","v":{"$error":"#REF!"}},{"$f":"IF(B18=\"\",\"\",INDIRECT(\"'\"&B18&\"'!$L$54\"))","v":{"$error":"#REF!"}},{"$f":"IF(B18=\"\",\"\",INDIRECT(\"'\"&B18&\"'!$H$54\"))","v":{"$error":"#REF!"}},{"$f":"IF(B18=\"\",\"\",INDIRECT(\"'\"&B18&\"'!$I$54\"))","v":{"$error":"#REF!"}},{"$f":"IF(B18=\"\",\"\",INDIRECT(\"'\"&B18&\"'!$R$54\"))","v":{"$error":"#REF!"}},{"$f":"IF(B18=\"\",\"\",INDIRECT(\"'\"&B18&\"'!$U$54\"))","v":{"$error":"#REF!"}},{"$f":"IF(B18=\"\",\"\",INDIRECT(\"'\"&B18&\"'!$X$54\"))","v":{"$error":"#REF!"}},{"$f":"IF(B18=\"\",\"\",INDIRECT(\"'\"&B18&\"'!$Z$54\"))","v":{"$error":"#REF!"}},{"$f":"IF(B18=\"\",\"\",INDIRECT(\"'\"&B18&\"'!$AA$54\"))","v":{"$error":"#REF!"}},{"$f":"SUM(F19:N19)","v":{"$error":"#REF!"}},{"$nulls":4},{"$f":"C82","v":{"$error":"#REF!"}},{"$f":"D82","v":{"$error":"#REF!"}},{"$f":"P82","v":{"$error":"#REF!"}},{"$f":"Q82","v":{"$error":"#REF!"}},{"$error":"#REF!"}]
[{"$nulls":4},{"$f":"IF(B18=\"\",\"\",INDIRECT(\"'\"&B18&\"'!$A$56\"))","v":{"$error":"#REF!"}},{"$f":"IF(B18=\"\",\"\",INDIRECT(\"'\"&B18&\"'!$K$78\"))","v":{"$error":"#REF!"}},{"$f":"IF(B18=\"\",\"\",INDIRECT(\"'\"&B18&\"'!$L$78\"))","v":{"$error":"#REF!"}},{"$f":"IF(B18=\"\",\"\",INDIRECT(\"'\"&B18&\"'!$H$78\"))","v":{"$error":"#REF!"}},{"$f":"IF(B18=\"\",\"\",INDIRECT(\"'\"&B18&\"'!$I$78\"))","v":{"$error":"#REF!"}},{"$f":"IF(B18=\"\",\"\",INDIRECT(\"'\"&B18&\"'!$R$78\"))","v":{"$error":"#REF!"}},{"$f":"IF(B18=\"\",\"\",INDIRECT(\"'\"&B18&\"'!$U$78\"))","v":{"$error":"#REF!"}},{"$f":"IF(B18=\"\",\"\",INDIRECT(\"'\"&B18&\"'!$X$78\"))","v":{"$error":"#REF!"}},{"$f":"IF(B18=\"\",\"\",INDIRECT(\"'\"&B18&\"'!$Z$78\"))","v":{"$error":"#REF!"}},{"$f":"IF(B18=\"\",\"\",INDIRECT(\"'\"&B18&\"'!$AA$78\"))","v":{"$error":"#REF!"}},{"$f":"SUM(F20:N20)","v":{"$error":"#REF!"}},{"$nulls":4},{"$f":"C90","v":{"$error":"#REF!"}},{"$f":"D90","v":{"$error":"#REF!"}},{"$f":"P90","v":{"$error":"#REF!"}},{"$f":"Q90","v":{"$error":"#REF!"}},{"$error":"#REF!"}]
[{"$nulls":4},{"$f":"IF(B18=\"\",\"\",INDIRECT(\"'\"&B18&\"'!$A$80\"))","v":{"$error":"#REF!"}},{"$f":"IF(B18=\"\",\"\",INDIRECT(\"'\"&B18&\"'!$K$102\"))","v":{"$error":"#REF!"}},{"$f":"IF(B18=\"\",\"\",INDIRECT(\"'\"&B18&\"'!$L$102\"))","v":{"$error":"#REF!"}},{"$f":"IF(B18=\"\",\"\",INDIRECT(\"'\"&B18&\"'!$H$102\"))","v":{"$error":"#REF!"}},{"$f":"IF(B18=\"\",\"\",INDIRECT(\"'\"&B18&\"'!$I$102\"))","v":{"$error":"#REF!"}},{"$f":"IF(B18=\"\",\"\",INDIRECT(\"'\"&B18&\"'!$R$102\"))","v":{"$error":"#REF!"}},{"$f":"IF(B18=\"\",\"\",INDIRECT(\"'\"&B18&\"'!$U$102\"))","v":{"$error":"#REF!"}},{"$f":"IF(B18=\"\",\"\",INDIRECT(\"'\"&B18&\"'!$X$102\"))","v":{"$error":"#REF!"}},{"$f":"IF(B18=\"\",\"\",INDIRECT(\"'\"&B18&\"'!$Z$102\"))","v":{"$error":"#REF!"}},{"$f":"IF(B18=\"\",\"\",INDIRECT(\"'\"&B18&\"'!$AA$102\"))","v":{"$error":"#REF!"}},{"$error":"#REF!"},{"$nulls":4},{"$f":"C98","v":{"$error":"#REF!"}},{"$f":"D98","v":{"$error":"#REF!"}},{"$f":"P98","v":{"$error":"#REF!"}},{"$f":"Q98","v":{"$error":"#REF!"}},{"$error":"#REF!"}]
[{"$nulls":4},{"$f":"IF(B18=\"\",\"\",INDIRECT(\"'\"&B18&\"'!$A$104\"))","v":{"$error":"#REF!"}},{"$f":"IF(B18=\"\",\"\",INDIRECT(\"'\"&B18&\"'!$K$111\"))","v":{"$error":"#REF!"}},{"$f":"IF(B18=\"\",\"\",INDIRECT(\"'\"&B18&\"'!$L$111\"))","v":{"$error":"#REF!"}},{"$f":"IF(B18=\"\",\"\",INDIRECT(\"'\"&B18&\"'!$H$111\"))","v":{"$error":"#REF!"}},{"$f":"IF(B18=\"\",\"\",INDIRECT(\"'\"&B18&\"'!$I$111\"))","v":{"$error":"#REF!"}},{"$f":"IF(B18=\"\",\"\",INDIRECT(\"'\"&B18&\"'!$R$111\"))","v":{"$error":"#REF!"}},{"$f":"IF(B18=\"\",\"\",INDIRECT(\"'\"&B18&\"'!$U$111\"))","v":{"$error":"#REF!"}},{"$f":"IF(B18=\"\",\"\",INDIRECT(\"'\"&B18&\"'!$X$111\"))","v":{"$error":"#REF!"}},{"$f":"IF(B18=\"\",\"\",INDIRECT(\"'\"&B18&\"'!$Z$111\"))","v":{"$error":"#REF!"}},{"$f":"IF(B18=\"\",\"\",INDIRECT(\"'\"&B18&\"'!$AA$111\"))","v":{"$error":"#REF!"}},{"$error":"#REF!"},{"$nulls":4},{"$f":"C106","v":{"$error":"#REF!"}},{"$f":"D106","v":{"$error":"#REF!"}},{"$f":"P106","v":{"$error":"#REF!"}},{"$f":"Q106","v":{"$error":"#REF!"}},{"$error":"#REF!"}]
[{"$nulls":4},{"$f":"IF(B18=\"\",\"\",INDIRECT(\"'\"&B18&\"'!$A$113\"))","v":{"$error":"#REF!"}},{"$f":"IF(B18=\"\",\"\",INDIRECT(\"'\"&B18&\"'!$K$120\"))","v":{"$error":"#REF!"}},{"$f":"IF(B18=\"\",\"\",INDIRECT(\"'\"&B18&\"'!$L$120\"))","v":{"$error":"#REF!"}},{"$f":"IF(B18=\"\",\"\",INDIRECT(\"'\"&B18&\"'!$H$120\"))","v":{"$error":"#REF!"}},{"$f":"IF(B18=\"\",\"\",INDIRECT(\"'\"&B18&\"'!$I$120\"))","v":{"$error":"#REF!"}},{"$f":"IF(B18=\"\",\"\",INDIRECT(\"'\"&B18&\"'!$R$120\"))","v":{"$error":"#REF!"}},{"$f":"IF(B18=\"\",\"\",INDIRECT(\"'\"&B18&\"'!$U$120\"))","v":{"$error":"#REF!"}},{"$f":"IF(B18=\"\",\"\",INDIRECT(\"'\"&B18&\"'!$X$120\"))","v":{"$error":"#REF!"}},{"$f":"IF(B18=\"\",\"\",INDIRECT(\"'\"&B18&\"'!$Z$120\"))","v":{"$error":"#REF!"}},{"$f":"IF(B18=\"\",\"\",INDIRECT(\"'\"&B18&\"'!$AA$120\"))","v":{"$error":"#REF!"}},{"$error":"#REF!"},{"$nulls":4},{"$f":"C114","v":{"$error":"#REF!"}},{"$f":"D114","v":{"$error":"#REF!"}},{"$f":"P114","v":{"$error":"#REF!"}},{"$f":"Q114","v":{"$error":"#REF!"}},{"$error":"#REF!"}]
[{"$nulls":4},{"$f":"IF(B18=\"\",\"\",INDIRECT(\"'\"&B18&\"'!$A$122\"))","v":{"$error":"#REF!"}},{"$f":"IF(B18=\"\",\"\",INDIRECT(\"'\"&B18&\"'!$K$129\"))","v":{"$error":"#REF!"}},{"$f":"IF(B18=\"\",\"\",INDIRECT(\"'\"&B18&\"'!$L$129\"))","v":{"$error":"#REF!"}},{"$f":"IF(B18=\"\",\"\",INDIRECT(\"'\"&B18&\"'!$H$129\"))","v":{"$error":"#REF!"}},{"$f":"IF(B18=\"\",\"\",INDIRECT(\"'\"&B18&\"'!$I$129\"))","v":{"$error":"#REF!"}},{"$f":"IF(B18=\"\",\"\",INDIRECT(\"'\"&B18&\"'!$R$129\"))","v":{"$error":"#REF!"}},{"$f":"IF(B18=\"\",\"\",INDIRECT(\"'\"&B18&\"'!$U$129\"))","v":{"$error":"#REF!"}},{"$f":"IF(B18=\"\",\"\",INDIRECT(\"'\"&B18&\"'!$X$129\"))","v":{"$error":"#REF!"}},{"$f":"IF(B18=\"\",\"\",INDIRECT(\"'\"&B18&\"'!$Z$129\"))","v":{"$error":"#REF!"}},{"$f":"IF(B18=\"\",\"\",INDIRECT(\"'\"&B18&\"'!$AA$129\"))","v":{"$error":"#REF!"}},{"$error":"#REF!"},{"$nulls":4},{"$f":"C122","v":{"$error":"#REF!"}},{"$f":"D122","v":{"$error":"#REF!"}},{"$f":"P122","v":{"$error":"#REF!"}},{"$f":"Q122","v":{"$error":"#REF!"}},{"$error":"#REF!"}]
[{"$nulls":4},{"$f":"IF(B18=\"\",\"\",INDIRECT(\"'\"&B18&\"'!$A$131\"))","v":{"$error":"#REF!"}},{"$f":"IF(B18=\"\",\"\",INDIRECT(\"'\"&B18&\"'!$K$167\"))","v":{"$error":"#REF!"}},{"$f":"IF(B18=\"\",\"\",INDIRECT(\"'\"&B18&\"'!$L$167\"))","v":{"$error":"#REF!"}},{"$f":"IF(B18=\"\",\"\",INDIRECT(\"'\"&B18&\"'!$H$167\"))","v":{"$error":"#REF!"}},{"$f":"IF(B18=\"\",\"\",INDIRECT(\"'\"&B18&\"'!$I$167\"))","v":{"$error":"#REF!"}},{"$f":"IF(B18=\"\",\"\",INDIRECT(\"'\"&B18&\"'!$R$167\"))","v":{"$error":"#REF!"}},{"$f":"IF(B18=\"\",\"\",INDIRECT(\"'\"&B18&\"'!$U$167\"))","v":{"$error":"#REF!"}},{"$f":"IF(B18=\"\",\"\",INDIRECT(\"'\"&B18&\"'!$X$167\"))","v":{"$error":"#REF!"}},{"$f":"IF(B18=\"\",\"\",INDIRECT(\"'\"&B18&\"'!$Z$167\"))","v":{"$error":"#REF!"}},{"$f":"IF(B18=\"\",\"\",INDIRECT(\"'\"&B18&\"'!$AA$167\"))","v":{"$error":"#REF!"}},{"$error":"#REF!"},{"$nulls":4},{"$f":"C130","v":{"$error":"#REF!"}},{"$f":"D130","v":{"$error":"#REF!"}},{"$f":"P130","v":{"$error":"#REF!"}},{"$f":"Q130","v":{"$error":"#REF!"}},{"$error":"#REF!"}]
[null,{"$f":"MID(INDEX(nom_feuilles,ROW(Masque!K7)),SEARCH(\"]\",INDEX(nom_feuilles,ROW(Masque!K7)))+1,30)","v":{"$error":"#REF!"}},{"$f":"IF(B26=\"\",\"\",INDIRECT(\"'\"&B26&\"'!$A$1\"))","v":{"$error":"#REF!"}},{"$f":"IF(B26=\"\",\"\",INDIRECT(\"'\"&B26&\"'!$A$2\"))","v":{"$error":"#REF!"}},{"$f":"IF(B26=\"\",\"\",INDIRECT(\"'\"&B26&\"'!$A$8\"))","v":{"$error":"#REF!"}},{"$f":"IF(B26=\"\",\"\",INDIRECT(\"'\"&B26&\"'!$K$30\"))","v":{"$error":"#REF!"}},{"$f":"IF(B26=\"\",\"\",INDIRECT(\"'\"&B26&\"'!$L$30\"))","v":{"$error":"#REF!"}},{"$f":"IF(B26=\"\",\"\",INDIRECT(\"'\"&B26&\"'!$H$30\"))","v":{"$error":"#REF!"}},{"$f":"IF(B26=\"\",\"\",INDIRECT(\"'\"&B26&\"'!$I$30\"))","v":{"$error":"#REF!"}},{"$f":"IF(B26=\"\",\"\",INDIRECT(\"'\"&B26&\"'!$R$30\"))","v":{"$error":"#REF!"}},{"$f":"IF(B26=\"\",\"\",INDIRECT(\"'\"&B26&\"'!$U$30\"))","v":{"$error":"#REF!"}},{"$f":"IF(B26=\"\",\"\",INDIRECT(\"'\"&B26&\"'!$X$30\"))","v":{"$error":"#REF!"}},{"$f":"IF(B26=\"\",\"\",INDIRECT(\"'\"&B26&\"'!$Z$30\"))","v":{"$error":"#REF!"}},{"$f":"IF(B26=\"\",\"\",INDIRECT(\"'\"&B26&\"'!$AA$30\"))","v":{"$error":"#REF!"}},{"$f":"SUM(F26:N26)","v":{"$error":"#REF!"}},{"$f":"SUM(O26:O33)","v":{"$error":"#REF!"}},{"$f":"IF(B26=\"\",\"\",INDIRECT(\"'\"&B26&\"'!$H$4\"))","v":{"$error":"#REF!"}},{"$f":"P26-Q26","v":{"$error":"#REF!"}},null,{"$f":"C138","v":{"$error":"#REF!"}},{"$f":"D138","v":{"$error":"#REF!"}},{"$f":"P138","v":{"$error":"#REF!"}},{"$f":"Q138","v":{"$error":"#REF!"}},{"$error":"#REF!"}]
[{"$nulls":4},{"$f":"IF(B26=\"\",\"\",INDIRECT(\"'\"&B26&\"'!$A$32\"))","v":{"$error":"#REF!"}},{"$f":"IF(B26=\"\",\"\",INDIRECT(\"'\"&B26&\"'!$K$54\"))","v":{"$error":"#REF!"}},{"$f":"IF(B26=\"\",\"\",INDIRECT(\"'\"&B26&\"'!$L$54\"))","v":{"$error":"#REF!"}},{"$f":"IF(B26=\"\",\"\",INDIRECT(\"'\"&B26&\"'!$H$54\"))","v":{"$error":"#REF!"}},{"$f":"IF(B26=\"\",\"\",INDIRECT(\"'\"&B26&\"'!$I$54\"))","v":{"$error":"#REF!"}},{"$f":"IF(B26=\"\",\"\",INDIRECT(\"'\"&B26&\"'!$R$54\"))","v":{"$error":"#REF!"}},{"$f":"IF(B26=\"\",\"\",INDIRECT(\"'\"&B26&\"'!$U$54\"))","v":{"$error":"#REF!"}},{"$f":"IF(B26=\"\",\"\",INDIRECT(\"'\"&B26&\"'!$X$54\"))","v":{"$error":"#REF!"}},{"$f":"IF(B26=\"\",\"\",INDIRECT(\"'\"&B26&\"'!$Z$54\"))","v":{"$error":"#REF!"}},{"$f":"IF(B26=\"\",\"\",INDIRECT(\"'\"&B26&\"'!$AA$54\"))","v":{"$error":"#REF!"}},{"$f":"SUM(F27:N27)","v":{"$error":"#REF!"}},{"$nulls":4},{"$f":"C146","v":{"$error":"#REF!"}},{"$f":"D146","v":{"$error":"#REF!"}},{"$f":"P146","v":{"$error":"#REF!"}},{"$f":"Q146","v":{"$error":"#REF!"}},{"$error":"#REF!"}]
[{"$nulls":4},{"$f":"IF(B26=\"\",\"\",INDIRECT(\"'\"&B26&\"'!$A$56\"))","v":{"$error":"#REF!"}},{"$f":"IF(B26=\"\",\"\",INDIRECT(\"'\"&B26&\"'!$K$78\"))","v":{"$error":"#REF!"}},{"$f":"IF(B26=\"\",\"\",INDIRECT(\"'\"&B26&\"'!$L$78\"))","v":{"$error":"#REF!"}},{"$f":"IF(B26=\"\",\"\",INDIRECT(\"'\"&B26&\"'!$H$78\"))","v":{"$error":"#REF!"}},{"$f":"IF(B26=\"\",\"\",INDIRECT(\"'\"&B26&\"'!$I$78\"))","v":{"$error":"#REF!"}},{"$f":"IF(B26=\"\",\"\",INDIRECT(\"'\"&B26&\"'!$R$78\"))","v":{"$error":"#REF!"}},{"$f":"IF(B26=\"\",\"\",INDIRECT(\"'\"&B26&\"'!$U$78\"))","v":{"$error":"#REF!"}},{"$f":"IF(B26=\"\",\"\",INDIRECT(\"'\"&B26&\"'!$X$78\"))","v":{"$error":"#REF!"}},{"$f":"IF(B26=\"\",\"\",INDIRECT(\"'\"&B26&\"'!$Z$78\"))","v":{"$error":"#REF!"}},{"$f":"IF(B26=\"\",\"\",INDIRECT(\"'\"&B26&\"'!$AA$78\"))","v":{"$error":"#REF!"}},{"$f":"SUM(F28:N28)","v":{"$error":"#REF!"}},{"$nulls":4},{"$f":"C154","v":{"$error":"#REF!"}},{"$f":"D154","v":{"$error":"#REF!"}},{"$f":"P154","v":{"$error":"#REF!"}},{"$f":"Q154","v":{"$error":"#REF!"}},{"$error":"#REF!"}]
[{"$nulls":4},{"$f":"IF(B26=\"\",\"\",INDIRECT(\"'\"&B26&\"'!$A$80\"))","v":{"$error":"#REF!"}},{"$f":"IF(B26=\"\",\"\",INDIRECT(\"'\"&B26&\"'!$K$102\"))","v":{"$error":"#REF!"}},{"$f":"IF(B26=\"\",\"\",INDIRECT(\"'\"&B26&\"'!$L$102\"))","v":{"$error":"#REF!"}},{"$f":"IF(B26=\"\",\"\",INDIRECT(\"'\"&B26&\"'!$H$102\"))","v":{"$error":"#REF!"}},{"$f":"IF(B26=\"\",\"\",INDIRECT(\"'\"&B26&\"'!$I$102\"))","v":{"$error":"#REF!"}},{"$f":"IF(B26=\"\",\"\",INDIRECT(\"'\"&B26&\"'!$R$102\"))","v":{"$error":"#REF!"}},{"$f":"IF(B26=\"\",\"\",INDIRECT(\"'\"&B26&\"'!$U$102\"))","v":{"$error":"#REF!"}},{"$f":"IF(B26=\"\",\"\",INDIRECT(\"'\"&B26&\"'!$X$102\"))","v":{"$error":"#REF!"}},{"$f":"IF(B26=\"\",\"\",INDIRECT(\"'\"&B26&\"'!$Z$102\"))","v":{"$error":"#REF!"}},{"$f":"IF(B26=\"\",\"\",INDIRECT(\"'\"&B26&\"'!$AA$102\"))","v":{"$error":"#REF!"}},{"$error":"#REF!"},{"$nulls":4},{"$f":"C162","v":{"$error":"#REF!"}},{"$f":"D162","v":{"$error":"#REF!"}},{"$f":"P162","v":{"$error":"#REF!"}},{"$f":"Q162","v":{"$error":"#REF!"}},{"$error":"#REF!"}]
[{"$nulls":4},{"$f":"IF(B26=\"\",\"\",INDIRECT(\"'\"&B26&\"'!$A$104\"))","v":{"$error":"#REF!"}},{"$f":"IF(B26=\"\",\"\",INDIRECT(\"'\"&B26&\"'!$K$111\"))","v":{"$error":"#REF!"}},{"$f":"IF(B26=\"\",\"\",INDIRECT(\"'\"&B26&\"'!$L$111\"))","v":{"$error":"#REF!"}},{"$f":"IF(B26=\"\",\"\",INDIRECT(\"'\"&B26&\"'!$H$111\"))","v":{"$error":"#REF!"}},{"$f":"IF(B26=\"\",\"\",INDIRECT(\"'\"&B26&\"'!$I$111\"))","v":{"$error":"#REF!"}},{"$f":"IF(B26=\"\",\"\",INDIRECT(\"'\"&B26&\"'!$R$111\"))","v":{"$error":"#REF!"}},{"$f":"IF(B26=\"\",\"\",INDIRECT(\"'\"&B26&\"'!$U$111\"))","v":{"$error":"#REF!"}},{"$f":"IF(B26=\"\",\"\",INDIRECT(\"'\"&B26&\"'!$X$111\"))","v":{"$error":"#REF!"}},{"$f":"IF(B26=\"\",\"\",INDIRECT(\"'\"&B26&\"'!$Z$111\"))","v":{"$error":"#REF!"}},{"$f":"IF(B26=\"\",\"\",INDIRECT(\"'\"&B26&\"'!$AA$111\"))","v":{"$error":"#REF!"}},{"$error":"#REF!"},{"$nulls":4},{"$f":"C170","v":{"$error":"#REF!"}},{"$f":"D170","v":{"$error":"#REF!"}},{"$f":"P170","v":{"$error":"#REF!"}},{"$f":"Q170","v":{"$error":"#REF!"}},{"$error":"#REF!"}]
[{"$nulls":4},{"$f":"IF(B26=\"\",\"\",INDIRECT(\"'\"&B26&\"'!$A$113\"))","v":{"$error":"#REF!"}},{"$f":"IF(B26=\"\",\"\",INDIRECT(\"'\"&B26&\"'!$K$120\"))","v":{"$error":"#REF!"}},{"$f":"IF(B26=\"\",\"\",INDIRECT(\"'\"&B26&\"'!$L$120\"))","v":{"$error":"#REF!"}},{"$f":"IF(B26=\"\",\"\",INDIRECT(\"'\"&B26&\"'!$H$120\"))","v":{"$error":"#REF!"}},{"$f":"IF(B26=\"\",\"\",INDIRECT(\"'\"&B26&\"'!$I$120\"))","v":{"$error":"#REF!"}},{"$f":"IF(B26=\"\",\"\",INDIRECT(\"'\"&B26&\"'!$R$120\"))","v":{"$error":"#REF!"}},{"$f":"IF(B26=\"\",\"\",INDIRECT(\"'\"&B26&\"'!$U$120\"))","v":{"$error":"#REF!"}},{"$f":"IF(B26=\"\",\"\",INDIRECT(\"'\"&B26&\"'!$X$120\"))","v":{"$error":"#REF!"}},{"$f":"IF(B26=\"\",\"\",INDIRECT(\"'\"&B26&\"'!$Z$120\"))","v":{"$error":"#REF!"}},{"$f":"IF(B26=\"\",\"\",INDIRECT(\"'\"&B26&\"'!$AA$120\"))","v":{"$error":"#REF!"}},{"$error":"#REF!"},{"$nulls":4},{"$f":"C178","v":{"$error":"#REF!"}},{"$f":"D178","v":{"$error":"#REF!"}},{"$f":"P178","v":{"$error":"#REF!"}},{"$f":"Q178","v":{"$error":"#REF!"}},{"$error":"#REF!"}]
[{"$nulls":4},{"$f":"IF(B26=\"\",\"\",INDIRECT(\"'\"&B26&\"'!$A$122\"))","v":{"$error":"#REF!"}},{"$f":"IF(B26=\"\",\"\",INDIRECT(\"'\"&B26&\"'!$K$129\"))","v":{"$error":"#REF!"}},{"$f":"IF(B26=\"\",\"\",INDIRECT(\"'\"&B26&\"'!$L$129\"))","v":{"$error":"#REF!"}},{"$f":"IF(B26=\"\",\"\",INDIRECT(\"'\"&B26&\"'!$H$129\"))","v":{"$error":"#REF!"}},{"$f":"IF(B26=\"\",\"\",INDIRECT(\"'\"&B26&\"'!$I$129\"))","v":{"$error":"#REF!"}},{"$f":"IF(B26=\"\",\"\",INDIRECT(\"'\"&B26&\"'!$R$129\"))","v":{"$error":"#REF!"}},{"$f":"IF(B26=\"\",\"\",INDIRECT(\"'\"&B26&\"'!$U$129\"))","v":{"$error":"#REF!"}},{"$f":"IF(B26=\"\",\"\",INDIRECT(\"'\"&B26&\"'!$X$129\"))","v":{"$error":"#REF!"}},{"$f":"IF(B26=\"\",\"\",INDIRECT(\"'\"&B26&\"'!$Z$129\"))","v":{"$error":"#REF!"}},{"$f":"IF(B26=\"\",\"\",INDIRECT(\"'\"&B26&\"'!$AA$129\"))","v":{"$error":"#REF!"}},{"$error":"#REF!"},{"$nulls":4},{"$f":"C186","v":{"$error":"#REF!"}},{"$f":"D186","v":{"$error":"#REF!"}},{"$f":"P186","v":{"$error":"#REF!"}},{"$f":"Q186","v":{"$error":"#REF!"}},{"$error":"#REF!"}]
[{"$nulls":4},{"$f":"IF(B26=\"\",\"\",INDIRECT(\"'\"&B26&\"'!$A$131\"))","v":{"$error":"#REF!"}},{"$f":"IF(B26=\"\",\"\",INDIRECT(\"'\"&B26&\"'!$K$167\"))","v":{"$error":"#REF!"}},{"$f":"IF(B26=\"\",\"\",INDIRECT(\"'\"&B26&\"'!$L$167\"))","v":{"$error":"#REF!"}},{"$f":"IF(B26=\"\",\"\",INDIRECT(\"'\"&B26&\"'!$H$167\"))","v":{"$error":"#REF!"}},{"$f":"IF(B26=\"\",\"\",INDIRECT(\"'\"&B26&\"'!$I$167\"))","v":{"$error":"#REF!"}},{"$f":"IF(B26=\"\",\"\",INDIRECT(\"'\"&B26&\"'!$R$167\"))","v":{"$error":"#REF!"}},{"$f":"IF(B26=\"\",\"\",INDIRECT(\"'\"&B26&\"'!$U$167\"))","v":{"$error":"#REF!"}},{"$f":"IF(B26=\"\",\"\",INDIRECT(\"'\"&B26&\"'!$X$167\"))","v":{"$error":"#REF!"}},{"$f":"IF(B26=\"\",\"\",INDIRECT(\"'\"&B26&\"'!$Z$167\"))","v":{"$error":"#REF!"}},{"$f":"IF(B26=\"\",\"\",INDIRECT(\"'\"&B26&\"'!$AA$167\"))","v":{"$error":"#REF!"}},{"$error":"#REF!"},{"$nulls":4},{"$f":"C194","v":{"$error":"#REF!"}},{"$f":"D194","v":{"$error":"#REF!"}},{"$f":"P194","v":{"$error":"#REF!"}},{"$f":"Q194","v":{"$error":"#REF!"}},{"$error":"#REF!"}]
[null,{"$f":"MID(INDEX(nom_feuilles,ROW(Masque!K8)),SEARCH(\"]\",INDEX(nom_feuilles,ROW(Masque!K8)))+1,30)","v":{"$error":"#REF!"}},{"$f":"IF(B34=\"\",\"\",INDIRECT(\"'\"&B34&\"'!$A$1\"))","v":{"$error":"#REF!"}},{"$f":"IF(B34=\"\",\"\",INDIRECT(\"'\"&B34&\"'!$A$2\"))","v":{"$error":"#REF!"}},{"$f":"IF(B34=\"\",\"\",INDIRECT(\"'\"&B34&\"'!$A$8\"))","v":{"$error":"#REF!"}},{"$f":"IF(B34=\"\",\"\",INDIRECT(\"'\"&B34&\"'!$K$30\"))","v":{"$error":"#REF!"}},{"$f":"IF(B34=\"\",\"\",INDIRECT(\"'\"&B34&\"'!$L$30\"))","v":{"$error":"#REF!"}},{"$f":"IF(B34=\"\",\"\",INDIRECT(\"'\"&B34&\"'!$H$30\"))","v":{"$error":"#REF!"}},{"$f":"IF(B34=\"\",\"\",INDIRECT(\"'\"&B34&\"'!$I$30\"))","v":{"$error":"#REF!"}},{"$f":"IF(B34=\"\",\"\",INDIRECT(\"'\"&B34&\"'!$R$30\"))","v":{"$error":"#REF!"}},{"$f":"IF(B34=\"\",\"\",INDIRECT(\"'\"&B34&\"'!$U$30\"))","v":{"$error":"#REF!"}},{"$f":"IF(B34=\"\",\"\",INDIRECT(\"'\"&B34&\"'!$X$30\"))","v":{"$error":"#REF!"}},{"$f":"IF(B34=\"\",\"\",INDIRECT(\"'\"&B34&\"'!$Z$30\"))","v":{"$error":"#REF!"}},{"$f":"IF(B34=\"\",\"\",INDIRECT(\"'\"&B34&\"'!$AA$30\"))","v":{"$error":"#REF!"}},{"$f":"SUM(F34:N34)","v":{"$error":"#REF!"}},{"$f":"SUM(O34:O41)","v":{"$error":"#REF!"}},{"$f":"IF(B34=\"\",\"\",INDIRECT(\"'\"&B34&\"'!$H$4\"))","v":{"$error":"#REF!"}},{"$f":"P34-Q34","v":{"$error":"#REF!"}},null,{"$f":"C202","v":{"$error":"#REF!"}},{"$f":"D202","v":{"$error":"#REF!"}},{"$f":"P202","v":{"$error":"#REF!"}},{"$f":"Q202","v":{"$error":"#REF!"}},{"$error":"#REF!"}]
[{"$nulls":4},{"$f":"IF(B34=\"\",\"\",INDIRECT(\"'\"&B34&\"'!$A$32\"))","v":{"$error":"#REF!"}},{"$f":"IF(B34=\"\",\"\",INDIRECT(\"'\"&B34&\"'!$K$54\"))","v":{"$error":"#REF!"}},{"$f":"IF(B34=\"\",\"\",INDIRECT(\"'\"&B34&\"'!$L$54\"))","v":{"$error":"#REF!"}},{"$f":"IF(B34=\"\",\"\",INDIRECT(\"'\"&B34&\"'!$H$54\"))","v":{"$error":"#REF!"}},{"$f":"IF(B34=\"\",\"\",INDIRECT(\"'\"&B34&\"'!$I$54\"))","v":{"$error":"#REF!"}},{"$f":"IF(B34=\"\",\"\",INDIRECT(\"'\"&B34&\"'!$R$54\"))","v":{"$error":"#REF!"}},{"$f":"IF(B34=\"\",\"\",INDIRECT(\"'\"&B34&\"'!$U$54\"))","v":{"$error":"#REF!"}},{"$f":"IF(B34=\"\",\"\",INDIRECT(\"'\"&B34&\"'!$X$54\"))","v":{"$error":"#REF!"}},{"$f":"IF(B34=\"\",\"\",INDIRECT(\"'\"&B34&\"'!$Z$54\"))","v":{"$error":"#REF!"}},{"$f":"IF(B34=\"\",\"\",INDIRECT(\"'\"&B34&\"'!$AA$54\"))","v":{"$error":"#REF!"}},{"$f":"SUM(F35:N35)","v":{"$error":"#REF!"}},{"$nulls":4},{"$f":"C210","v":{"$error":"#REF!"}},{"$f":"D210","v":{"$error":"#REF!"}},{"$f":"P210","v":{"$error":"#REF!"}},{"$f":"Q210","v":{"$error":"#REF!"}},{"$error":"#REF!"}]
[{"$nulls":4},{"$f":"IF(B34=\"\",\"\",INDIRECT(\"'\"&B34&\"'!$A$56\"))","v":{"$error":"#REF!"}},{"$f":"IF(B34=\"\",\"\",INDIRECT(\"'\"&B34&\"'!$K$78\"))","v":{"$error":"#REF!"}},{"$f":"IF(B34=\"\",\"\",INDIRECT(\"'\"&B34&\"'!$L$78\"))","v":{"$error":"#REF!"}},{"$f":"IF(B34=\"\",\"\",INDIRECT(\"'\"&B34&\"'!$H$78\"))","v":{"$error":"#REF!"}},{"$f":"IF(B34=\"\",\"\",INDIRECT(\"'\"&B34&\"'!$I$78\"))","v":{"$error":"#REF!"}},{"$f":"IF(B34=\"\",\"\",INDIRECT(\"'\"&B34&\"'!$R$78\"))","v":{"$error":"#REF!"}},{"$f":"IF(B34=\"\",\"\",INDIRECT(\"'\"&B34&\"'!$U$78\"))","v":{"$error":"#REF!"}},{"$f":"IF(B34=\"\",\"\",INDIRECT(\"'\"&B34&\"'!$X$78\"))","v":{"$error":"#REF!"}},{"$f":"IF(B34=\"\",\"\",INDIRECT(\"'\"&B34&\"'!$Z$78\"))","v":{"$error":"#REF!"}},{"$f":"IF(B34=\"\",\"\",INDIRECT(\"'\"&B34&\"'!$AA$78\"))","v":{"$error":"#REF!"}},{"$f":"SUM(F36:N36)","v":{"$error":"#REF!"}},{"$nulls":4},{"$f":"C218","v":{"$error":"#REF!"}},{"$f":"D218","v":{"$error":"#REF!"}},{"$f":"P218","v":{"$error":"#REF!"}},{"$f":"Q218","v":{"$error":"#REF!"}},{"$error":"#REF!"}]
[{"$nulls":4},{"$f":"IF(B34=\"\",\"\",INDIRECT(\"'\"&B34&\"'!$A$80\"))","v":{"$error":"#REF!"}},{"$f":"IF(B34=\"\",\"\",INDIRECT(\"'\"&B34&\"'!$K$102\"))","v":{"$error":"#REF!"}},{"$f":"IF(B34=\"\",\"\",INDIRECT(\"'\"&B34&\"'!$L$102\"))","v":{"$error":"#REF!"}},{"$f":"IF(B34=\"\",\"\",INDIRECT(\"'\"&B34&\"'!$H$102\"))","v":{"$error":"#REF!"}},{"$f":"IF(B34=\"\",\"\",INDIRECT(\"'\"&B34&\"'!$I$102\"))","v":{"$error":"#REF!"}},{"$f":"IF(B34=\"\",\"\",INDIRECT(\"'\"&B34&\"'!$R$102\"))","v":{"$error":"#REF!"}},{"$f":"IF(B34=\"\",\"\",INDIRECT(\"'\"&B34&\"'!$U$102\"))","v":{"$error":"#REF!"}},{"$f":"IF(B34=\"\",\"\",INDIRECT(\"'\"&B34&\"'!$X$102\"))","v":{"$error":"#REF!"}},{"$f":"IF(B34=\"\",\"\",INDIRECT(\"'\"&B34&\"'!$Z$102\"))","v":{"$error":"#REF!"}},{"$f":"IF(B34=\"\",\"\",INDIRECT(\"'\"&B34&\"'!$AA$102\"))","v":{"$error":"#REF!"}},{"$error":"#REF!"},{"$nulls":4},{"$f":"C226","v":{"$error":"#REF!"}},{"$f":"D226","v":{"$error":"#REF!"}},{"$f":"P226","v":{"$error":"#REF!"}},{"$f":"Q226","v":{"$error":"#REF!"}},{"$error":"#REF!"}]
[{"$nulls":4},{"$f":"IF(B34=\"\",\"\",INDIRECT(\"'\"&B34&\"'!$A$104\"))","v":{"$error":"#REF!"}},{"$f":"IF(B34=\"\",\"\",INDIRECT(\"'\"&B34&\"'!$K$111\"))","v":{"$error":"#REF!"}},{"$f":"IF(B34=\"\",\"\",INDIRECT(\"'\"&B34&\"'!$L$111\"))","v":{"$error":"#REF!"}},{"$f":"IF(B34=\"\",\"\",INDIRECT(\"'\"&B34&\"'!$H$111\"))","v":{"$error":"#REF!"}},{"$f":"IF(B34=\"\",\"\",INDIRECT(\"'\"&B34&\"'!$I$111\"))","v":{"$error":"#REF!"}},{"$f":"IF(B34=\"\",\"\",INDIRECT(\"'\"&B34&\"'!$R$111\"))","v":{"$error":"#REF!"}},{"$f":"IF(B34=\"\",\"\",INDIRECT(\"'\"&B34&\"'!$U$111\"))","v":{"$error":"#REF!"}},{"$f":"IF(B34=\"\",\"\",INDIRECT(\"'\"&B34&\"'!$X$111\"))","v":{"$error":"#REF!"}},{"$f":"IF(B34=\"\",\"\",INDIRECT(\"'\"&B34&\"'!$Z$111\"))","v":{"$error":"#REF!"}},{"$f":"IF(B34=\"\",\"\",INDIRECT(\"'\"&B34&\"'!$AA$111\"))","v":{"$error":"#REF!"}},{"$error":"#REF!"},{"$nulls":4},{"$f":"C234","v":{"$error":"#REF!"}},{"$f":"D234","v":{"$error":"#REF!"}},{"$f":"P234","v":{"$error":"#REF!"}},{"$f":"Q234","v":{"$error":"#REF!"}},{"$error":"#REF!"}]
[{"$nulls":4},{"$f":"IF(B34=\"\",\"\",INDIRECT(\"'\"&B34&\"'!$A$113\"))","v":{"$error":"#REF!"}},{"$f":"IF(B34=\"\",\"\",INDIRECT(\"'\"&B34&\"'!$K$120\"))","v":{"$error":"#REF!"}},{"$f":"IF(B34=\"\",\"\",INDIRECT(\"'\"&B34&\"'!$L$120\"))","v":{"$error":"#REF!"}},{"$f":"IF(B34=\"\",\"\",INDIRECT(\"'\"&B34&\"'!$H$120\"))","v":{"$error":"#REF!"}},{"$f":"IF(B34=\"\",\"\",INDIRECT(\"'\"&B34&\"'!$I$120\"))","v":{"$error":"#REF!"}},{"$f":"IF(B34=\"\",\"\",INDIRECT(\"'\"&B34&\"'!$R$120\"))","v":{"$error":"#REF!"}},{"$f":"IF(B34=\"\",\"\",INDIRECT(\"'\"&B34&\"'!$U$120\"))","v":{"$error":"#REF!"}},{"$f":"IF(B34=\"\",\"\",INDIRECT(\"'\"&B34&\"'!$X$120\"))","v":{"$error":"#REF!"}},{"$f":"IF(B34=\"\",\"\",INDIRECT(\"'\"&B34&\"'!$Z$120\"))","v":{"$error":"#REF!"}},{"$f":"IF(B34=\"\",\"\",INDIRECT(\"'\"&B34&\"'!$AA$120\"))","v":{"$error":"#REF!"}},{"$error":"#REF!"},{"$nulls":4},{"$f":"C242","v":{"$error":"#REF!"}},{"$f":"D242","v":{"$error":"#REF!"}},{"$f":"P242","v":{"$error":"#REF!"}},{"$f":"Q242","v":{"$error":"#REF!"}},{"$error":"#REF!"}]
[{"$nulls":4},{"$f":"IF(B34=\"\",\"\",INDIRECT(\"'\"&B34&\"'!$A$122\"))","v":{"$error":"#REF!"}},{"$f":"IF(B34=\"\",\"\",INDIRECT(\"'\"&B34&\"'!$K$129\"))","v":{"$error":"#REF!"}},{"$f":"IF(B34=\"\",\"\",INDIRECT(\"'\"&B34&\"'!$L$129\"))","v":{"$error":"#REF!"}},{"$f":"IF(B34=\"\",\"\",INDIRECT(\"'\"&B34&\"'!$H$129\"))","v":{"$error":"#REF!"}},{"$f":"IF(B34=\"\",\"\",INDIRECT(\"'\"&B34&\"'!$I$129\"))","v":{"$error":"#REF!"}},{"$f":"IF(B34=\"\",\"\",INDIRECT(\"'\"&B34&\"'!$R$129\"))","v":{"$error":"#REF!"}},{"$f":"IF(B34=\"\",\"\",INDIRECT(\"'\"&B34&\"'!$U$129\"))","v":{"$error":"#REF!"}},{"$f":"IF(B34=\"\",\"\",INDIRECT(\"'\"&B34&\"'!$X$129\"))","v":{"$error":"#REF!"}},{"$f":"IF(B34=\"\",\"\",INDIRECT(\"'\"&B34&\"'!$Z$129\"))","v":{"$error":"#REF!"}},{"$f":"IF(B34=\"\",\"\",INDIRECT(\"'\"&B34&\"'!$AA$129\"))","v":{"$error":"#REF!"}},{"$error":"#REF!"},{"$nulls":4},{"$f":"C250","v":{"$error":"#REF!"}},{"$f":"D250","v":{"$error":"#REF!"}},{"$f":"P250","v":{"$error":"#REF!"}},{"$f":"Q250","v":{"$error":"#REF!"}},{"$error":"#REF!"}]
[{"$nulls":4},{"$f":"IF(B34=\"\",\"\",INDIRECT(\"'\"&B34&\"'!$A$131\"))","v":{"$error":"#REF!"}},{"$f":"IF(B34=\"\",\"\",INDIRECT(\"'\"&B34&\"'!$K$167\"))","v":{"$error":"#REF!"}},{"$f":"IF(B34=\"\",\"\",INDIRECT(\"'\"&B34&\"'!$L$167\"))","v":{"$error":"#REF!"}},{"$f":"IF(B34=\"\",\"\",INDIRECT(\"'\"&B34&\"'!$H$167\"))","v":{"$error":"#REF!"}},{"$f":"IF(B34=\"\",\"\",INDIRECT(\"'\"&B34&\"'!$I$167\"))","v":{"$error":"#REF!"}},{"$f":"IF(B34=\"\",\"\",INDIRECT(\"'\"&B34&\"'!$R$167\"))","v":{"$error":"#REF!"}},{"$f":"IF(B34=\"\",\"\",INDIRECT(\"'\"&B34&\"'!$U$167\"))","v":{"$error":"#REF!"}},{"$f":"IF(B34=\"\",\"\",INDIRECT(\"'\"&B34&\"'!$X$167\"))","v":{"$error":"#REF!"}},{"$f":"IF(B34=\"\",\"\",INDIRECT(\"'\"&B34&\"'!$Z$167\"))","v":{"$error":"#REF!"}},{"$f":"IF(B34=\"\",\"\",INDIRECT(\"'\"&B34&\"'!$AA$167\"))","v":{"$error":"#REF!"}},{"$error":"#REF!"},{"$nulls":4},{"$f":"C258","v":{"$error":"#REF!"}},{"$f":"D258","v":{"$error":"#REF!"}},{"$f":"P258","v":{"$error":"#REF!"}},{"$f":"Q258","v":{"$error":"#REF!"}},{"$error":"#REF!"}]
[null,{"$f":"MID(INDEX(nom_feuilles,ROW(Masque!K9)),SEARCH(\"]\",INDEX(nom_feuilles,ROW(Masque!K9)))+1,30)","v":{"$error":"#REF!"}},{"$f":"IF(B42=\"\",\"\",INDIRECT(\"'\"&B42&\"'!$A$1\"))","v":{"$error":"#REF!"}},{"$f":"IF(B42=\"\",\"\",INDIRECT(\"'\"&B42&\"'!$A$2\"))","v":{"$error":"#REF!"}},{"$f":"IF(B42=\"\",\"\",INDIRECT(\"'\"&B42&\"'!$A$8\"))","v":{"$error":"#REF!"}},{"$f":"IF(B42=\"\",\"\",INDIRECT(\"'\"&B42&\"'!$K$30\"))","v":{"$error":"#REF!"}},{"$f":"IF(B42=\"\",\"\",INDIRECT(\"'\"&B42&\"'!$L$30\"))","v":{"$error":"#REF!"}},{"$f":"IF(B42=\"\",\"\",INDIRECT(\"'\"&B42&\"'!$H$30\"))","v":{"$error":"#REF!"}},{"$f":"IF(B42=\"\",\"\",INDIRECT(\"'\"&B42&\"'!$I$30\"))","v":{"$error":"#REF!"}},{"$f":"IF(B42=\"\",\"\",INDIRECT(\"'\"&B42&\"'!$R$30\"))","v":{"$error":"#REF!"}},{"$f":"IF(B42=\"\",\"\",INDIRECT(\"'\"&B42&\"'!$U$30\"))","v":{"$error":"#REF!"}},{"$f":"IF(B42=\"\",\"\",INDIRECT(\"'\"&B42&\"'!$X$30\"))","v":{"$error":"#REF!"}},{"$f":"IF(B42=\"\",\"\",INDIRECT(\"'\"&B42&\"'!$Z$30\"))","v":{"$error":"#REF!"}},{"$f":"IF(B42=\"\",\"\",INDIRECT(\"'\"&B42&\"'!$AA$30\"))","v":{"$error":"#REF!"}},{"$f":"SUM(F42:N42)","v":{"$error":"#REF!"}},{"$f":"SUM(O42:O49)","v":{"$error":"#REF!"}},{"$f":"IF(B42=\"\",\"\",INDIRECT(\"'\"&B42&\"'!$H$4\"))","v":{"$error":"#REF!"}},{"$f":"P42-Q42","v":{"$error":"#REF!"}},null,{"$f":"C266","v":{"$error":"#REF!"}},{"$f":"D266","v":{"$error":"#REF!"}},{"$f":"P266","v":{"$error":"#REF!"}},{"$f":"Q266","v":{"$error":"#REF!"}},{"$error":"#REF!"}]
[{"$nulls":4},{"$f":"IF(B42=\"\",\"\",INDIRECT(\"'\"&B42&\"'!$A$32\"))","v":{"$error":"#REF!"}},{"$f":"IF(B42=\"\",\"\",INDIRECT(\"'\"&B42&\"'!$K$54\"))","v":{"$error":"#REF!"}},{"$f":"IF(B42=\"\",\"\",INDIRECT(\"'\"&B42&\"'!$L$54\"))","v":{"$error":"#REF!"}},{"$f":"IF(B42=\"\",\"\",INDIRECT(\"'\"&B42&\"'!$H$54\"))","v":{"$error":"#REF!"}},{"$f":"IF(B42=\"\",\"\",INDIRECT(\"'\"&B42&\"'!$I$54\"))","v":{"$error":"#REF!"}},{"$f":"IF(B42=\"\",\"\",INDIRECT(\"'\"&B42&\"'!$R$54\"))","v":{"$error":"#REF!"}},{"$f":"IF(B42=\"\",\"\",INDIRECT(\"'\"&B42&\"'!$U$54\"))","v":{"$error":"#REF!"}},{"$f":"IF(B42=\"\",\"\",INDIRECT(\"'\"&B42&\"'!$X$54\"))","v":{"$error":"#REF!"}},{"$f":"IF(B42=\"\",\"\",INDIRECT(\"'\"&B42&\"'!$Z$54\"))","v":{"$error":"#REF!"}},{"$f":"IF(B42=\"\",\"\",INDIRECT(\"'\"&B42&\"'!$AA$54\"))","v":{"$error":"#REF!"}},{"$f":"SUM(F43:N43)","v":{"$error":"#REF!"}},{"$nulls":4},{"$f":"C274","v":{"$error":"#REF!"}},{"$f":"D274","v":{"$error":"#REF!"}},{"$f":"P274","v":{"$error":"#REF!"}},{"$f":"Q274","v":{"$error":"#REF!"}},{"$error":"#REF!"}]
[{"$nulls":4},{"$f":"IF(B42=\"\",\"\",INDIRECT(\"'\"&B42&\"'!$A$56\"))","v":{"$error":"#REF!"}},{"$f":"IF(B42=\"\",\"\",INDIRECT(\"'\"&B42&\"'!$K$78\"))","v":{"$error":"#REF!"}},{"$f":"IF(B42=\"\",\"\",INDIRECT(\"'\"&B42&\"'!$L$78\"))","v":{"$error":"#REF!"}},{"$f":"IF(B42=\"\",\"\",INDIRECT(\"'\"&B42&\"'!$H$78\"))","v":{"$error":"#REF!"}},{"$f":"IF(B42=\"\",\"\",INDIRECT(\"'\"&B42&\"'!$I$78\"))","v":{"$error":"#REF!"}},{"$f":"IF(B42=\"\",\"\",INDIRECT(\"'\"&B42&\"'!$R$78\"))","v":{"$error":"#REF!"}},{"$f":"IF(B42=\"\",\"\",INDIRECT(\"'\"&B42&\"'!$U$78\"))","v":{"$error":"#REF!"}},{"$f":"IF(B42=\"\",\"\",INDIRECT(\"'\"&B42&\"'!$X$78\"))","v":{"$error":"#REF!"}},{"$f":"IF(B42=\"\",\"\",INDIRECT(\"'\"&B42&\"'!$Z$78\"))","v":{"$error":"#REF!"}},{"$f":"IF(B42=\"\",\"\",INDIRECT(\"'\"&B42&\"'!$AA$78\"))","v":{"$error":"#REF!"}},{"$f":"SUM(F44:N44)","v":{"$error":"#REF!"}},{"$nulls":4},{"$f":"C282","v":{"$error":"#REF!"}},{"$f":"D282","v":{"$error":"#REF!"}},{"$f":"P282","v":{"$error":"#REF!"}},{"$f":"Q282","v":{"$error":"#REF!"}},{"$error":"#REF!"}]
[{"$nulls":4},{"$f":"IF(B42=\"\",\"\",INDIRECT(\"'\"&B42&\"'!$A$80\"))","v":{"$error":"#REF!"}},{"$f":"IF(B42=\"\",\"\",INDIRECT(\"'\"&B42&\"'!$K$102\"))","v":{"$error":"#REF!"}},{"$f":"IF(B42=\"\",\"\",INDIRECT(\"'\"&B42&\"'!$L$102\"))","v":{"$error":"#REF!"}},{"$f":"IF(B42=\"\",\"\",INDIRECT(\"'\"&B42&\"'!$H$102\"))","v":{"$error":"#REF!"}},{"$f":"IF(B42=\"\",\"\",INDIRECT(\"'\"&B42&\"'!$I$102\"))","v":{"$error":"#REF!"}},{"$f":"IF(B42=\"\",\"\",INDIRECT(\"'\"&B42&\"'!$R$102\"))","v":{"$error":"#REF!"}},{"$f":"IF(B42=\"\",\"\",INDIRECT(\"'\"&B42&\"'!$U$102\"))","v":{"$error":"#REF!"}},{"$f":"IF(B42=\"\",\"\",INDIRECT(\"'\"&B42&\"'!$X$102\"))","v":{"$error":"#REF!"}},{"$f":"IF(B42=\"\",\"\",INDIRECT(\"'\"&B42&\"'!$Z$102\"))","v":{"$error":"#REF!"}},{"$f":"IF(B42=\"\",\"\",INDIRECT(\"'\"&B42&\"'!$AA$102\"))","v":{"$error":"#REF!"}},{"$error":"#REF!"},{"$nulls":4},{"$f":"C290","v":{"$error":"#REF!"}},{"$f":"D290","v":{"$error":"#REF!"}},{"$f":"P290","v":{"$error":"#REF!"}},{"$f":"Q290","v":{"$error":"#REF!"}},{"$error":"#REF!"}]
[{"$nulls":4},{"$f":"IF(B42=\"\",\"\",INDIRECT(\"'\"&B42&\"'!$A$104\"))","v":{"$error":"#REF!"}},{"$f":"IF(B42=\"\",\"\",INDIRECT(\"'\"&B42&\"'!$K$111\"))","v":{"$error":"#REF!"}},{"$f":"IF(B42=\"\",\"\",INDIRECT(\"'\"&B42&\"'!$L$111\"))","v":{"$error":"#REF!"}},{"$f":"IF(B42=\"\",\"\",INDIRECT(\"'\"&B42&\"'!$H$111\"))","v":{"$error":"#REF!"}},{"$f":"IF(B42=\"\",\"\",INDIRECT(\"'\"&B42&\"'!$I$111\"))","v":{"$error":"#REF!"}},{"$f":"IF(B42=\"\",\"\",INDIRECT(\"'\"&B42&\"'!$R$111\"))","v":{"$error":"#REF!"}},{"$f":"IF(B42=\"\",\"\",INDIRECT(\"'\"&B42&\"'!$U$111\"))","v":{"$error":"#REF!"}},{"$f":"IF(B42=\"\",\"\",INDIRECT(\"'\"&B42&\"'!$X$111\"))","v":{"$error":"#REF!"}},{"$f":"IF(B42=\"\",\"\",INDIRECT(\"'\"&B42&\"'!$Z$111\"))","v":{"$error":"#REF!"}},{"$f":"IF(B42=\"\",\"\",INDIRECT(\"'\"&B42&\"'!$AA$111\"))","v":{"$error":"#REF!"}},{"$error":"#REF!"},{"$nulls":4},{"$f":"C298","v":{"$error":"#REF!"}},{"$f":"D298","v":{"$error":"#REF!"}},{"$f":"P298","v":{"$error":"#REF!"}},{"$f":"Q298","v":{"$error":"#REF!"}},{"$error":"#REF!"}]
[{"$nulls":4},{"$f":"IF(B42=\"\",\"\",INDIRECT(\"'\"&B42&\"'!$A$113\"))","v":{"$error":"#REF!"}},{"$f":"IF(B42=\"\",\"\",INDIRECT(\"'\"&B42&\"'!$K$120\"))","v":{"$error":"#REF!"}},{"$f":"IF(B42=\"\",\"\",INDIRECT(\"'\"&B42&\"'!$L$120\"))","v":{"$error":"#REF!"}},{"$f":"IF(B42=\"\",\"\",INDIRECT(\"'\"&B42&\"'!$H$120\"))","v":{"$error":"#REF!"}},{"$f":"IF(B42=\"\",\"\",INDIRECT(\"'\"&B42&\"'!$I$120\"))","v":{"$error":"#REF!"}},{"$f":"IF(B42=\"\",\"\",INDIRECT(\"'\"&B42&\"'!$R$120\"))","v":{"$error":"#REF!"}},{"$f":"IF(B42=\"\",\"\",INDIRECT(\"'\"&B42&\"'!$U$120\"))","v":{"$error":"#REF!"}},{"$f":"IF(B42=\"\",\"\",INDIRECT(\"'\"&B42&\"'!$X$120\"))","v":{"$error":"#REF!"}},{"$f":"IF(B42=\"\",\"\",INDIRECT(\"'\"&B42&\"'!$Z$120\"))","v":{"$error":"#REF!"}},{"$f":"IF(B42=\"\",\"\",INDIRECT(\"'\"&B42&\"'!$AA$120\"))","v":{"$error":"#REF!"}},{"$error":"#REF!"},{"$nulls":4},{"$f":"C306","v":{"$error":"#REF!"}},{"$f":"D306","v":{"$error":"#REF!"}},{"$f":"P306","v":{"$error":"#REF!"}},{"$f":"Q306","v":{"$error":"#REF!"}},{"$error":"#REF!"}]
[{"$nulls":4},{"$f":"IF(B42=\"\",\"\",INDIRECT(\"'\"&B42&\"'!$A$122\"))","v":{"$error":"#REF!"}},{"$f":"IF(B42=\"\",\"\",INDIRECT(\"'\"&B42&\"'!$K$129\"))","v":{"$error":"#REF!"}},{"$f":"IF(B42=\"\",\"\",INDIRECT(\"'\"&B42&\"'!$L$129\"))","v":{"$error":"#REF!"}},{"$f":"IF(B42=\"\",\"\",INDIRECT(\"'\"&B42&\"'!$H$129\"))","v":{"$error":"#REF!"}},{"$f":"IF(B42=\"\",\"\",INDIRECT(\"'\"&B42&\"'!$I$129\"))","v":{"$error":"#REF!"}},{"$f":"IF(B42=\"\",\"\",INDIRECT(\"'\"&B42&\"'!$R$129\"))","v":{"$error":"#REF!"}},{"$f":"IF(B42=\"\",\"\",INDIRECT(\"'\"&B42&\"'!$U$129\"))","v":{"$error":"#REF!"}},{"$f":"IF(B42=\"\",\"\",INDIRECT(\"'\"&B42&\"'!$X$129\"))","v":{"$error":"#REF!"}},{"$f":"IF(B42=\"\",\"\",INDIRECT(\"'\"&B42&\"'!$Z$129\"))","v":{"$error":"#REF!"}},{"$f":"IF(B42=\"\",\"\",INDIRECT(\"'\"&B42&\"'!$AA$129\"))","v":{"$error":"#REF!"}},{"$error":"#REF!"},{"$nulls":4},{"$f":"C314","v":{"$error":"#REF!"}},{"$f":"D314","v":{"$error":"#REF!"}},{"$f":"P314","v":{"$error":"#REF!"}},{"$f":"Q314","v":{"$error":"#REF!"}},{"$error":"#REF!"}]
[{"$nulls":4},{"$f":"IF(B42=\"\",\"\",INDIRECT(\"'\"&B42&\"'!$A$131\"))","v":{"$error":"#REF!"}},{"$f":"IF(B42=\"\",\"\",INDIRECT(\"'\"&B42&\"'!$K$167\"))","v":{"$error":"#REF!"}},{"$f":"IF(B42=\"\",\"\",INDIRECT(\"'\"&B42&\"'!$L$167\"))","v":{"$error":"#REF!"}},{"$f":"IF(B42=\"\",\"\",INDIRECT(\"'\"&B42&\"'!$H$167\"))","v":{"$error":"#REF!"}},{"$f":"IF(B42=\"\",\"\",INDIRECT(\"'\"&B42&\"'!$I$167\"))","v":{"$error":"#REF!"}},{"$f":"IF(B42=\"\",\"\",INDIRECT(\"'\"&B42&\"'!$R$167\"))","v":{"$error":"#REF!"}},{"$f":"IF(B42=\"\",\"\",INDIRECT(\"'\"&B42&\"'!$U$167\"))","v":{"$error":"#REF!"}},{"$f":"IF(B42=\"\",\"\",INDIRECT(\"'\"&B42&\"'!$X$167\"))","v":{"$error":"#REF!"}},{"$f":"IF(B42=\"\",\"\",INDIRECT(\"'\"&B42&\"'!$Z$167\"))","v":{"$error":"#REF!"}},{"$f":"IF(B42=\"\",\"\",INDIRECT(\"'\"&B42&\"'!$AA$167\"))","v":{"$error":"#REF!"}},{"$error":"#REF!"},{"$nulls":4},"TOTAUX",null,{"$f":"SUM(V5:V48)","v":{"$error":"#REF!"}},{"$f":"SUM(W5:W48)","v":{"$error":"#REF!"}},{"$error":"#REF!"}]
[null,{"$f":"MID(INDEX(nom_feuilles,ROW(Masque!K10)),SEARCH(\"]\",INDEX(nom_feuilles,ROW(Masque!K10)))+1,30)","v":{"$error":"#REF!"}},{"$f":"IF(B50=\"\",\"\",INDIRECT(\"'\"&B50&\"'!$A$1\"))","v":{"$error":"#REF!"}},{"$f":"IF(B50=\"\",\"\",INDIRECT(\"'\"&B50&\"'!$A$2\"))","v":{"$error":"#REF!"}},{"$f":"IF(B50=\"\",\"\",INDIRECT(\"'\"&B50&\"'!$A$8\"))","v":{"$error":"#REF!"}},{"$f":"IF(B50=\"\",\"\",INDIRECT(\"'\"&B50&\"'!$K$30\"))","v":{"$error":"#REF!"}},{"$f":"IF(B50=\"\",\"\",INDIRECT(\"'\"&B50&\"'!$L$30\"))","v":{"$error":"#REF!"}},{"$f":"IF(B50=\"\",\"\",INDIRECT(\"'\"&B50&\"'!$H$30\"))","v":{"$error":"#REF!"}},{"$f":"IF(B50=\"\",\"\",INDIRECT(\"'\"&B50&\"'!$I$30\"))","v":{"$error":"#REF!"}},{"$f":"IF(B50=\"\",\"\",INDIRECT(\"'\"&B50&\"'!$R$30\"))","v":{"$error":"#REF!"}},{"$f":"IF(B50=\"\",\"\",INDIRECT(\"'\"&B50&\"'!$U$30\"))","v":{"$error":"#REF!"}},{"$f":"IF(B50=\"\",\"\",INDIRECT(\"'\"&B50&\"'!$X$30\"))","v":{"$error":"#REF!"}},{"$f":"IF(B50=\"\",\"\",INDIRECT(\"'\"&B50&\"'!$Z$30\"))","v":{"$error":"#REF!"}},{"$f":"IF(B50=\"\",\"\",INDIRECT(\"'\"&B50&\"'!$AA$30\"))","v":{"$error":"#REF!"}},{"$f":"SUM(F50:N50)","v":{"$error":"#REF!"}},{"$f":"SUM(O50:O57)","v":{"$error":"#REF!"}},{"$f":"IF(B50=\"\",\"\",INDIRECT(\"'\"&B50&\"'!$H$4\"))","v":{"$error":"#REF!"}},{"$f":"P50-Q50","v":{"$error":"#REF!"}}]
[{"$nulls":4},{"$f":"IF(B50=\"\",\"\",INDIRECT(\"'\"&B50&\"'!$A$32\"))","v":{"$error":"#REF!"}},{"$f":"IF(B50=\"\",\"\",INDIRECT(\"'\"&B50&\"'!$K$54\"))","v":{"$error":"#REF!"}},{"$f":"IF(B50=\"\",\"\",INDIRECT(\"'\"&B50&\"'!$L$54\"))","v":{"$error":"#REF!"}},{"$f":"IF(B50=\"\",\"\",INDIRECT(\"'\"&B50&\"'!$H$54\"))","v":{"$error":"#REF!"}},{"$f":"IF(B50=\"\",\"\",INDIRECT(\"'\"&B50&\"'!$I$54\"))","v":{"$error":"#REF!"}},{"$f":"IF(B50=\"\",\"\",INDIRECT(\"'\"&B50&\"'!$R$54\"))","v":{"$error":"#REF!"}},{"$f":"IF(B50=\"\",\"\",INDIRECT(\"'\"&B50&\"'!$U$54\"))","v":{"$error":"#REF!"}},{"$f":"IF(B50=\"\",\"\",INDIRECT(\"'\"&B50&\"'!$X$54\"))","v":{"$error":"#REF!"}},{"$f":"IF(B50=\"\",\"\",INDIRECT(\"'\"&B50&\"'!$Z$54\"))","v":{"$error":"#REF!"}},{"$f":"IF(B50=\"\",\"\",INDIRECT(\"'\"&B50&\"'!$AA$54\"))","v":{"$error":"#REF!"}},{"$f":"SUM(F51:N51)","v":{"$error":"#REF!"}}]
[{"$nulls":4},{"$f":"IF(B50=\"\",\"\",INDIRECT(\"'\"&B50&\"'!$A$56\"))","v":{"$error":"#REF!"}},{"$f":"IF(B50=\"\",\"\",INDIRECT(\"'\"&B50&\"'!$K$78\"))","v":{"$error":"#REF!"}},{"$f":"IF(B50=\"\",\"\",INDIRECT(\"'\"&B50&\"'!$L$78\"))","v":{"$error":"#REF!"}},{"$f":"IF(B50=\"\",\"\",INDIRECT(\"'\"&B50&\"'!$H$78\"))","v":{"$error":"#REF!"}},{"$f":"IF(B50=\"\",\"\",INDIRECT(\"'\"&B50&\"'!$I$78\"))","v":{"$error":"#REF!"}},{"$f":"IF(B50=\"\",\"\",INDIRECT(\"'\"&B50&\"'!$R$78\"))","v":{"$error":"#REF!"}},{"$f":"IF(B50=\"\",\"\",INDIRECT(\"'\"&B50&\"'!$U$78\"))","v":{"$error":"#REF!"}},{"$f":"IF(B50=\"\",\"\",INDIRECT(\"'\"&B50&\"'!$X$78\"))","v":{"$error":"#REF!"}},{"$f":"IF(B50=\"\",\"\",INDIRECT(\"'\"&B50&\"'!$Z$78\"))","v":{"$error":"#REF!"}},{"$f":"IF(B50=\"\",\"\",INDIRECT(\"'\"&B50&\"'!$AA$78\"))","v":{"$error":"#REF!"}},{"$f":"SUM(F52:N52)","v":{"$error":"#REF!"}}]
[{"$nulls":4},{"$f":"IF(B50=\"\",\"\",INDIRECT(\"'\"&B50&\"'!$A$80\"))","v":{"$error":"#REF!"}},{"$f":"IF(B50=\"\",\"\",INDIRECT(\"'\"&B50&\"'!$K$102\"))","v":{"$error":"#REF!"}},{"$f":"IF(B50=\"\",\"\",INDIRECT(\"'\"&B50&\"'!$L$102\"))","v":{"$error":"#REF!"}},{"$f":"IF(B50=\"\",\"\",INDIRECT(\"'\"&B50&\"'!$H$102\"))","v":{"$error":"#REF!"}},{"$f":"IF(B50=\"\",\"\",INDIRECT(\"'\"&B50&\"'!$I$102\"))","v":{"$error":"#REF!"}},{"$f":"IF(B50=\"\",\"\",INDIRECT(\"'\"&B50&\"'!$R$102\"))","v":{"$error":"#REF!"}},{"$f":"IF(B50=\"\",\"\",INDIRECT(\"'\"&B50&\"'!$U$102\"))","v":{"$error":"#REF!"}},{"$f":"IF(B50=\"\",\"\",INDIRECT(\"'\"&B50&\"'!$X$102\"))","v":{"$error":"#REF!"}},{"$f":"IF(B50=\"\",\"\",INDIRECT(\"'\"&B50&\"'!$Z$102\"))","v":{"$error":"#REF!"}},{"$f":"IF(B50=\"\",\"\",INDIRECT(\"'\"&B50&\"'!$AA$102\"))","v":{"$error":"#REF!"}},{"$error":"#REF!"}]
[{"$nulls":4},{"$f":"IF(B50=\"\",\"\",INDIRECT(\"'\"&B50&\"'!$A$104\"))","v":{"$error":"#REF!"}},{"$f":"IF(B50=\"\",\"\",INDIRECT(\"'\"&B50&\"'!$K$111\"))","v":{"$error":"#REF!"}},{"$f":"IF(B50=\"\",\"\",INDIRECT(\"'\"&B50&\"'!$L$111\"))","v":{"$error":"#REF!"}},{"$f":"IF(B50=\"\",\"\",INDIRECT(\"'\"&B50&\"'!$H$111\"))","v":{"$error":"#REF!"}},{"$f":"IF(B50=\"\",\"\",INDIRECT(\"'\"&B50&\"'!$I$111\"))","v":{"$error":"#REF!"}},{"$f":"IF(B50=\"\",\"\",INDIRECT(\"'\"&B50&\"'!$R$111\"))","v":{"$error":"#REF!"}},{"$f":"IF(B50=\"\",\"\",INDIRECT(\"'\"&B50&\"'!$U$111\"))","v":{"$error":"#REF!"}},{"$f":"IF(B50=\"\",\"\",INDIRECT(\"'\"&B50&\"'!$X$111\"))","v":{"$error":"#REF!"}},{"$f":"IF(B50=\"\",\"\",INDIRECT(\"'\"&B50&\"'!$Z$111\"))","v":{"$error":"#REF!"}},{"$f":"IF(B50=\"\",\"\",INDIRECT(\"'\"&B50&\"'!$AA$111\"))","v":{"$error":"#REF!"}},{"$error":"#REF!"}]
[{"$nulls":4},{"$f":"IF(B50=\"\",\"\",INDIRECT(\"'\"&B50&\"'!$A$113\"))","v":{"$error":"#REF!"}},{"$f":"IF(B50=\"\",\"\",INDIRECT(\"'\"&B50&\"'!$K$120\"))","v":{"$error":"#REF!"}},{"$f":"IF(B50=\"\",\"\",INDIRECT(\"'\"&B50&\"'!$L$120\"))","v":{"$error":"#REF!"}},{"$f":"IF(B50=\"\",\"\",INDIRECT(\"'\"&B50&\"'!$H$120\"))","v":{"$error":"#REF!"}},{"$f":"IF(B50=\"\",\"\",INDIRECT(\"'\"&B50&\"'!$I$120\"))","v":{"$error":"#REF!"}},{"$f":"IF(B50=\"\",\"\",INDIRECT(\"'\"&B50&\"'!$R$120\"))","v":{"$error":"#REF!"}},{"$f":"IF(B50=\"\",\"\",INDIRECT(\"'\"&B50&\"'!$U$120\"))","v":{"$error":"#REF!"}},{"$f":"IF(B50=\"\",\"\",INDIRECT(\"'\"&B50&\"'!$X$120\"))","v":{"$error":"#REF!"}},{"$f":"IF(B50=\"\",\"\",INDIRECT(\"'\"&B50&\"'!$Z$120\"))","v":{"$error":"#REF!"}},{"$f":"IF(B50=\"\",\"\",INDIRECT(\"'\"&B50&\"'!$AA$120\"))","v":{"$error":"#REF!"}},{"$error":"#REF!"}]
[{"$nulls":4},{"$f":"IF(B50=\"\",\"\",INDIRECT(\"'\"&B50&\"'!$A$122\"))","v":{"$error":"#REF!"}},{"$f":"IF(B50=\"\",\"\",INDIRECT(\"'\"&B50&\"'!$K$129\"))","v":{"$error":"#REF!"}},{"$f":"IF(B50=\"\",\"\",INDIRECT(\"'\"&B50&\"'!$L$129\"))","v":{"$error":"#REF!"}},{"$f":"IF(B50=\"\",\"\",INDIRECT(\"'\"&B50&\"'!$H$129\"))","v":{"$error":"#REF!"}},{"$f":"IF(B50=\"\",\"\",INDIRECT(\"'\"&B50&\"'!$I$129\"))","v":{"$error":"#REF!"}},{"$f":"IF(B50=\"\",\"\",INDIRECT(\"'\"&B50&\"'!$R$129\"))","v":{"$error":"#REF!"}},{"$f":"IF(B50=\"\",\"\",INDIRECT(\"'\"&B50&\"'!$U$129\"))","v":{"$error":"#REF!"}},{"$f":"IF(B50=\"\",\"\",INDIRECT(\"'\"&B50&\"'!$X$129\"))","v":{"$error":"#REF!"}},{"$f":"IF(B50=\"\",\"\",INDIRECT(\"'\"&B50&\"'!$Z$129\"))","v":{"$error":"#REF!"}},{"$f":"IF(B50=\"\",\"\",INDIRECT(\"'\"&B50&\"'!$AA$129\"))","v":{"$error":"#REF!"}},{"$error":"#REF!"}]
[{"$nulls":4},{"$f":"IF(B50=\"\",\"\",INDIRECT(\"'\"&B50&\"'!$A$131\"))","v":{"$error":"#REF!"}},{"$f":"IF(B50=\"\",\"\",INDIRECT(\"'\"&B50&\"'!$K$167\"))","v":{"$error":"#REF!"}},{"$f":"IF(B50=\"\",\"\",INDIRECT(\"'\"&B50&\"'!$L$167\"))","v":{"$error":"#REF!"}},{"$f":"IF(B50=\"\",\"\",INDIRECT(\"'\"&B50&\"'!$H$167\"))","v":{"$error":"#REF!"}},{"$f":"IF(B50=\"\",\"\",INDIRECT(\"'\"&B50&\"'!$I$167\"))","v":{"$error":"#REF!"}},{"$f":"IF(B50=\"\",\"\",INDIRECT(\"'\"&B50&\"'!$R$167\"))","v":{"$error":"#REF!"}},{"$f":"IF(B50=\"\",\"\",INDIRECT(\"'\"&B50&\"'!$U$167\"))","v":{"$error":"#REF!"}},{"$f":"IF(B50=\"\",\"\",INDIRECT(\"'\"&B50&\"'!$X$167\"))","v":{"$error":"#REF!"}},{"$f":"IF(B50=\"\",\"\",INDIRECT(\"'\"&B50&\"'!$Z$167\"))","v":{"$error":"#REF!"}},{"$f":"IF(B50=\"\",\"\",INDIRECT(\"'\"&B50&\"'!$AA$167\"))","v":{"$error":"#REF!"}},{"$error":"#REF!"}]
[null,{"$f":"MID(INDEX(nom_feuilles,ROW(Masque!K11)),SEARCH(\"]\",INDEX(nom_feuilles,ROW(Masque!K11)))+1,30)","v":{"$error":"#REF!"}},{"$f":"IF(B58=\"\",\"\",INDIRECT(\"'\"&B58&\"'!$A$1\"))","v":{"$error":"#REF!"}},{"$f":"IF(B58=\"\",\"\",INDIRECT(\"'\"&B58&\"'!$A$2\"))","v":{"$error":"#REF!"}},{"$f":"IF(B58=\"\",\"\",INDIRECT(\"'\"&B58&\"'!$A$8\"))","v":{"$error":"#REF!"}},{"$f":"IF(B58=\"\",\"\",INDIRECT(\"'\"&B58&\"'!$K$30\"))","v":{"$error":"#REF!"}},{"$f":"IF(B58=\"\",\"\",INDIRECT(\"'\"&B58&\"'!$L$30\"))","v":{"$error":"#REF!"}},{"$f":"IF(B58=\"\",\"\",INDIRECT(\"'\"&B58&\"'!$H$30\"))","v":{"$error":"#REF!"}},{"$f":"IF(B58=\"\",\"\",INDIRECT(\"'\"&B58&\"'!$I$30\"))","v":{"$error":"#REF!"}},{"$f":"IF(B58=\"\",\"\",INDIRECT(\"'\"&B58&\"'!$R$30\"))","v":{"$error":"#REF!"}},{"$f":"IF(B58=\"\",\"\",INDIRECT(\"'\"&B58&\"'!$U$30\"))","v":{"$error":"#REF!"}},{"$f":"IF(B58=\"\",\"\",INDIRECT(\"'\"&B58&\"'!$X$30\"))","v":{"$error":"#REF!"}},{"$f":"IF(B58=\"\",\"\",INDIRECT(\"'\"&B58&\"'!$Z$30\"))","v":{"$error":"#REF!"}},{"$f":"IF(B58=\"\",\"\",INDIRECT(\"'\"&B58&\"'!$AA$30\"))","v":{"$error":"#REF!"}},{"$f":"SUM(F58:N58)","v":{"$error":"#REF!"}},{"$f":"SUM(O58:O65)","v":{"$error":"#REF!"}},{"$f":"IF(B58=\"\",\"\",INDIRECT(\"'\"&B58&\"'!$H$4\"))","v":{"$error":"#REF!"}},{"$f":"P58-Q58","v":{"$error":"#REF!"}}]
[{"$nulls":4},{"$f":"IF(B58=\"\",\"\",INDIRECT(\"'\"&B58&\"'!$A$32\"))","v":{"$error":"#REF!"}},{"$f":"IF(B58=\"\",\"\",INDIRECT(\"'\"&B58&\"'!$K$54\"))","v":{"$error":"#REF!"}},{"$f":"IF(B58=\"\",\"\",INDIRECT(\"'\"&B58&\"'!$L$54\"))","v":{"$error":"#REF!"}},{"$f":"IF(B58=\"\",\"\",INDIRECT(\"'\"&B58&\"'!$H$54\"))","v":{"$error":"#REF!"}},{"$f":"IF(B58=\"\",\"\",INDIRECT(\"'\"&B58&\"'!$I$54\"))","v":{"$error":"#REF!"}},{"$f":"IF(B58=\"\",\"\",INDIRECT(\"'\"&B58&\"'!$R$54\"))","v":{"$error":"#REF!"}},{"$f":"IF(B58=\"\",\"\",INDIRECT(\"'\"&B58&\"'!$U$54\"))","v":{"$error":"#REF!"}},{"$f":"IF(B58=\"\",\"\",INDIRECT(\"'\"&B58&\"'!$X$54\"))","v":{"$error":"#REF!"}},{"$f":"IF(B58=\"\",\"\",INDIRECT(\"'\"&B58&\"'!$Z$54\"))","v":{"$error":"#REF!"}},{"$f":"IF(B58=\"\",\"\",INDIRECT(\"'\"&B58&\"'!$AA$54\"))","v":{"$error":"#REF!"}},{"$f":"SUM(F59:N59)","v":{"$error":"#REF!"}}]
[{"$nulls":4},{"$f":"IF(B58=\"\",\"\",INDIRECT(\"'\"&B58&\"'!$A$56\"))","v":{"$error":"#REF!"}},{"$f":"IF(B58=\"\",\"\",INDIRECT(\"'\"&B58&\"'!$K$78\"))","v":{"$error":"#REF!"}},{"$f":"IF(B58=\"\",\"\",INDIRECT(\"'\"&B58&\"'!$L$78\"))","v":{"$error":"#REF!"}},{"$f":"IF(B58=\"\",\"\",INDIRECT(\"'\"&B58&\"'!$H$78\"))","v":{"$error":"#REF!"}},{"$f":"IF(B58=\"\",\"\",INDIRECT(\"'\"&B58&\"'!$I$78\"))","v":{"$error":"#REF!"}},{"$f":"IF(B58=\"\",\"\",INDIRECT(\"'\"&B58&\"'!$R$78\"))","v":{"$error":"#REF!"}},{"$f":"IF(B58=\"\",\"\",INDIRECT(\"'\"&B58&\"'!$U$78\"))","v":{"$error":"#REF!"}},{"$f":"IF(B58=\"\",\"\",INDIRECT(\"'\"&B58&\"'!$X$78\"))","v":{"$error":"#REF!"}},{"$f":"IF(B58=\"\",\"\",INDIRECT(\"'\"&B58&\"'!$Z$78\"))","v":{"$error":"#REF!"}},{"$f":"IF(B58=\"\",\"\",INDIRECT(\"'\"&B58&\"'!$AA$78\"))","v":{"$error":"#REF!"}},{"$f":"SUM(F60:N60)","v":{"$error":"#REF!"}}]
[{"$nulls":4},{"$f":"IF(B58=\"\",\"\",INDIRECT(\"'\"&B58&\"'!$A$80\"))","v":{"$error":"#REF!"}},{"$f":"IF(B58=\"\",\"\",INDIRECT(\"'\"&B58&\"'!$K$102\"))","v":{"$error":"#REF!"}},{"$f":"IF(B58=\"\",\"\",INDIRECT(\"'\"&B58&\"'!$L$102\"))","v":{"$error":"#REF!"}},{"$f":"IF(B58=\"\",\"\",INDIRECT(\"'\"&B58&\"'!$H$102\"))","v":{"$error":"#REF!"}},{"$f":"IF(B58=\"\",\"\",INDIRECT(\"'\"&B58&\"'!$I$102\"))","v":{"$error":"#REF!"}},{"$f":"IF(B58=\"\",\"\",INDIRECT(\"'\"&B58&\"'!$R$102\"))","v":{"$error":"#REF!"}},{"$f":"IF(B58=\"\",\"\",INDIRECT(\"'\"&B58&\"'!$U$102\"))","v":{"$error":"#REF!"}},{"$f":"IF(B58=\"\",\"\",INDIRECT(\"'\"&B58&\"'!$X$102\"))","v":{"$error":"#REF!"}},{"$f":"IF(B58=\"\",\"\",INDIRECT(\"'\"&B58&\"'!$Z$102\"))","v":{"$error":"#REF!"}},{"$f":"IF(B58=\"\",\"\",INDIRECT(\"'\"&B58&\"'!$AA$102\"))","v":{"$error":"#REF!"}},{"$error":"#REF!"}]
[{"$nulls":4},{"$f":"IF(B58=\"\",\"\",INDIRECT(\"'\"&B58&\"'!$A$104\"))","v":{"$error":"#REF!"}},{"$f":"IF(B58=\"\",\"\",INDIRECT(\"'\"&B58&\"'!$K$111\"))","v":{"$error":"#REF!"}},{"$f":"IF(B58=\"\",\"\",INDIRECT(\"'\"&B58&\"'!$L$111\"))","v":{"$error":"#REF!"}},{"$f":"IF(B58=\"\",\"\",INDIRECT(\"'\"&B58&\"'!$H$111\"))","v":{"$error":"#REF!"}},{"$f":"IF(B58=\"\",\"\",INDIRECT(\"'\"&B58&\"'!$I$111\"))","v":{"$error":"#REF!"}},{"$f":"IF(B58=\"\",\"\",INDIRECT(\"'\"&B58&\"'!$R$111\"))","v":{"$error":"#REF!"}},{"$f":"IF(B58=\"\",\"\",INDIRECT(\"'\"&B58&\"'!$U$111\"))","v":{"$error":"#REF!"}},{"$f":"IF(B58=\"\",\"\",INDIRECT(\"'\"&B58&\"'!$X$111\"))","v":{"$error":"#REF!"}},{"$f":"IF(B58=\"\",\"\",INDIRECT(\"'\"&B58&\"'!$Z$111\"))","v":{"$error":"#REF!"}},{"$f":"IF(B58=\"\",\"\",INDIRECT(\"'\"&B58&\"'!$AA$111\"))","v":{"$error":"#REF!"}},{"$error":"#REF!"}]
[{"$nulls":4},{"$f":"IF(B58=\"\",\"\",INDIRECT(\"'\"&B58&\"'!$A$113\"))","v":{"$error":"#REF!"}},{"$f":"IF(B58=\"\",\"\",INDIRECT(\"'\"&B58&\"'!$K$120\"))","v":{"$error":"#REF!"}},{"$f":"IF(B58=\"\",\"\",INDIRECT(\"'\"&B58&\"'!$L$120\"))","v":{"$error":"#REF!"}},{"$f":"IF(B58=\"\",\"\",INDIRECT(\"'\"&B58&\"'!$H$120\"))","v":{"$error":"#REF!"}},{"$f":"IF(B58=\"\",\"\",INDIRECT(\"'\"&B58&\"'!$I$120\"))","v":{"$error":"#REF!"}},{"$f":"IF(B58=\"\",\"\",INDIRECT(\"'\"&B58&\"'!$R$120\"))","v":{"$error":"#REF!"}},{"$f":"IF(B58=\"\",\"\",INDIRECT(\"'\"&B58&\"'!$U$120\"))","v":{"$error":"#REF!"}},{"$f":"IF(B58=\"\",\"\",INDIRECT(\"'\"&B58&\"'!$X$120\"))","v":{"$error":"#REF!"}},{"$f":"IF(B58=\"\",\"\",INDIRECT(\"'\"&B58&\"'!$Z$120\"))","v":{"$error":"#REF!"}},{"$f":"IF(B58=\"\",\"\",INDIRECT(\"'\"&B58&\"'!$AA$120\"))","v":{"$error":"#REF!"}},{"$error":"#REF!"}]
[{"$nulls":4},{"$f":"IF(B58=\"\",\"\",INDIRECT(\"'\"&B58&\"'!$A$122\"))","v":{"$error":"#REF!"}},{"$f":"IF(B58=\"\",\"\",INDIRECT(\"'\"&B58&\"'!$K$129\"))","v":{"$error":"#REF!"}},{"$f":"IF(B58=\"\",\"\",INDIRECT(\"'\"&B58&\"'!$L$129\"))","v":{"$error":"#REF!"}},{"$f":"IF(B58=\"\",\"\",INDIRECT(\"'\"&B58&\"'!$H$129\"))","v":{"$error":"#REF!"}},{"$f":"IF(B58=\"\",\"\",INDIRECT(\"'\"&B58&\"'!$I$129\"))","v":{"$error":"#REF!"}},{"$f":"IF(B58=\"\",\"\",INDIRECT(\"'\"&B58&\"'!$R$129\"))","v":{"$error":"#REF!"}},{"$f":"IF(B58=\"\",\"\",INDIRECT(\"'\"&B58&\"'!$U$129\"))","v":{"$error":"#REF!"}},{"$f":"IF(B58=\"\",\"\",INDIRECT(\"'\"&B58&\"'!$X$129\"))","v":{"$error":"#REF!"}},{"$f":"IF(B58=\"\",\"\",INDIRECT(\"'\"&B58&\"'!$Z$129\"))","v":{"$error":"#REF!"}},{"$f":"IF(B58=\"\",\"\",INDIRECT(\"'\"&B58&\"'!$AA$129\"))","v":{"$error":"#REF!"}},{"$error":"#REF!"}]
[{"$nulls":4},{"$f":"IF(B58=\"\",\"\",INDIRECT(\"'\"&B58&\"'!$A$131\"))","v":{"$error":"#REF!"}},{"$f":"IF(B58=\"\",\"\",INDIRECT(\"'\"&B58&\"'!$K$167\"))","v":{"$error":"#REF!"}},{"$f":"IF(B58=\"\",\"\",INDIRECT(\"'\"&B58&\"'!$L$167\"))","v":{"$error":"#REF!"}},{"$f":"IF(B58=\"\",\"\",INDIRECT(\"'\"&B58&\"'!$H$167\"))","v":{"$error":"#REF!"}},{"$f":"IF(B58=\"\",\"\",INDIRECT(\"'\"&B58&\"'!$I$167\"))","v":{"$error":"#REF!"}},{"$f":"IF(B58=\"\",\"\",INDIRECT(\"'\"&B58&\"'!$R$167\"))","v":{"$error":"#REF!"}},{"$f":"IF(B58=\"\",\"\",INDIRECT(\"'\"&B58&\"'!$U$167\"))","v":{"$error":"#REF!"}},{"$f":"IF(B58=\"\",\"\",INDIRECT(\"'\"&B58&\"'!$X$167\"))","v":{"$error":"#REF!"}},{"$f":"IF(B58=\"\",\"\",INDIRECT(\"'\"&B58&\"'!$Z$167\"))","v":{"$error":"#REF!"}},{"$f":"IF(B58=\"\",\"\",INDIRECT(\"'\"&B58&\"'!$AA$167\"))","v":{"$error":"#REF!"}},{"$error":"#REF!"}]
[null,{"$f":"MID(INDEX(nom_feuilles,ROW(Masque!K12)),SEARCH(\"]\",INDEX(nom_feuilles,ROW(Masque!K12)))+1,30)","v":{"$error":"#REF!"}},{"$f":"IF(B66=\"\",\"\",INDIRECT(\"'\"&B66&\"'!$A$1\"))","v":{"$error":"#REF!"}},{"$f":"IF(B66=\"\",\"\",INDIRECT(\"'\"&B66&\"'!$A$2\"))","v":{"$error":"#REF!"}},{"$f":"IF(B66=\"\",\"\",INDIRECT(\"'\"&B66&\"'!$A$8\"))","v":{"$error":"#REF!"}},{"$f":"IF(B66=\"\",\"\",INDIRECT(\"'\"&B66&\"'!$K$30\"))","v":{"$error":"#REF!"}},{"$f":"IF(B66=\"\",\"\",INDIRECT(\"'\"&B66&\"'!$L$30\"))","v":{"$error":"#REF!"}},{"$f":"IF(B66=\"\",\"\",INDIRECT(\"'\"&B66&\"'!$H$30\"))","v":{"$error":"#REF!"}},{"$f":"IF(B66=\"\",\"\",INDIRECT(\"'\"&B66&\"'!$I$30\"))","v":{"$error":"#REF!"}},{"$f":"IF(B66=\"\",\"\",INDIRECT(\"'\"&B66&\"'!$R$30\"))","v":{"$error":"#REF!"}},{"$f":"IF(B66=\"\",\"\",INDIRECT(\"'\"&B66&\"'!$U$30\"))","v":{"$error":"#REF!"}},{"$f":"IF(B66=\"\",\"\",INDIRECT(\"'\"&B66&\"'!$X$30\"))","v":{"$error":"#REF!"}},{"$f":"IF(B66=\"\",\"\",INDIRECT(\"'\"&B66&\"'!$Z$30\"))","v":{"$error":"#REF!"}},{"$f":"IF(B66=\"\",\"\",INDIRECT(\"'\"&B66&\"'!$AA$30\"))","v":{"$error":"#REF!"}},{"$f":"SUM(F66:N66)","v":{"$error":"#REF!"}},{"$f":"SUM(O66:O73)","v":{"$error":"#REF!"}},{"$f":"IF(B66=\"\",\"\",INDIRECT(\"'\"&B66&\"'!$H$4\"))","v":{"$error":"#REF!"}},{"$f":"P66-Q66","v":{"$error":"#REF!"}}]
[{"$nulls":4},{"$f":"IF(B66=\"\",\"\",INDIRECT(\"'\"&B66&\"'!$A$32\"))","v":{"$error":"#REF!"}},{"$f":"IF(B66=\"\",\"\",INDIRECT(\"'\"&B66&\"'!$K$54\"))","v":{"$error":"#REF!"}},{"$f":"IF(B66=\"\",\"\",INDIRECT(\"'\"&B66&\"'!$L$54\"))","v":{"$error":"#REF!"}},{"$f":"IF(B66=\"\",\"\",INDIRECT(\"'\"&B66&\"'!$H$54\"))","v":{"$error":"#REF!"}},{"$f":"IF(B66=\"\",\"\",INDIRECT(\"'\"&B66&\"'!$I$54\"))","v":{"$error":"#REF!"}},{"$f":"IF(B66=\"\",\"\",INDIRECT(\"'\"&B66&\"'!$R$54\"))","v":{"$error":"#REF!"}},{"$f":"IF(B66=\"\",\"\",INDIRECT(\"'\"&B66&\"'!$U$54\"))","v":{"$error":"#REF!"}},{"$f":"IF(B66=\"\",\"\",INDIRECT(\"'\"&B66&\"'!$X$54\"))","v":{"$error":"#REF!"}},{"$f":"IF(B66=\"\",\"\",INDIRECT(\"'\"&B66&\"'!$Z$54\"))","v":{"$error":"#REF!"}},{"$f":"IF(B66=\"\",\"\",INDIRECT(\"'\"&B66&\"'!$AA$54\"))","v":{"$error":"#REF!"}},{"$f":"SUM(F67:N67)","v":{"$error":"#REF!"}}]
[{"$nulls":4},{"$f":"IF(B66=\"\",\"\",INDIRECT(\"'\"&B66&\"'!$A$56\"))","v":{"$error":"#REF!"}},{"$f":"IF(B66=\"\",\"\",INDIRECT(\"'\"&B66&\"'!$K$78\"))","v":{"$error":"#REF!"}},{"$f":"IF(B66=\"\",\"\",INDIRECT(\"'\"&B66&\"'!$L$78\"))","v":{"$error":"#REF!"}},{"$f":"IF(B66=\"\",\"\",INDIRECT(\"'\"&B66&\"'!$H$78\"))","v":{"$error":"#REF!"}},{"$f":"IF(B66=\"\",\"\",INDIRECT(\"'\"&B66&\"'!$I$78\"))","v":{"$error":"#REF!"}},{"$f":"IF(B66=\"\",\"\",INDIRECT(\"'\"&B66&\"'!$R$78\"))","v":{"$error":"#REF!"}},{"$f":"IF(B66=\"\",\"\",INDIRECT(\"'\"&B66&\"'!$U$78\"))","v":{"$error":"#REF!"}},{"$f":"IF(B66=\"\",\"\",INDIRECT(\"'\"&B66&\"'!$X$78\"))","v":{"$error":"#REF!"}},{"$f":"IF(B66=\"\",\"\",INDIRECT(\"'\"&B66&\"'!$Z$78\"))","v":{"$error":"#REF!"}},{"$f":"IF(B66=\"\",\"\",INDIRECT(\"'\"&B66&\"'!$AA$78\"))","v":{"$error":"#REF!"}},{"$f":"SUM(F68:N68)","v":{"$error":"#REF!"}}]
[{"$nulls":4},{"$f":"IF(B66=\"\",\"\",INDIRECT(\"'\"&B66&\"'!$A$80\"))","v":{"$error":"#REF!"}},{"$f":"IF(B66=\"\",\"\",INDIRECT(\"'\"&B66&\"'!$K$102\"))","v":{"$error":"#REF!"}},{"$f":"IF(B66=\"\",\"\",INDIRECT(\"'\"&B66&\"'!$L$102\"))","v":{"$error":"#REF!"}},{"$f":"IF(B66=\"\",\"\",INDIRECT(\"'\"&B66&\"'!$H$102\"))","v":{"$error":"#REF!"}},{"$f":"IF(B66=\"\",\"\",INDIRECT(\"'\"&B66&\"'!$I$102\"))","v":{"$error":"#REF!"}},{"$f":"IF(B66=\"\",\"\",INDIRECT(\"'\"&B66&\"'!$R$102\"))","v":{"$error":"#REF!"}},{"$f":"IF(B66=\"\",\"\",INDIRECT(\"'\"&B66&\"'!$U$102\"))","v":{"$error":"#REF!"}},{"$f":"IF(B66=\"\",\"\",INDIRECT(\"'\"&B66&\"'!$X$102\"))","v":{"$error":"#REF!"}},{"$f":"IF(B66=\"\",\"\",INDIRECT(\"'\"&B66&\"'!$Z$102\"))","v":{"$error":"#REF!"}},{"$f":"IF(B66=\"\",\"\",INDIRECT(\"'\"&B66&\"'!$AA$102\"))","v":{"$error":"#REF!"}},{"$error":"#REF!"}]
[{"$nulls":4},{"$f":"IF(B66=\"\",\"\",INDIRECT(\"'\"&B66&\"'!$A$104\"))","v":{"$error":"#REF!"}},{"$f":"IF(B66=\"\",\"\",INDIRECT(\"'\"&B66&\"'!$K$111\"))","v":{"$error":"#REF!"}},{"$f":"IF(B66=\"\",\"\",INDIRECT(\"'\"&B66&\"'!$L$111\"))","v":{"$error":"#REF!"}},{"$f":"IF(B66=\"\",\"\",INDIRECT(\"'\"&B66&\"'!$H$111\"))","v":{"$error":"#REF!"}},{"$f":"IF(B66=\"\",\"\",INDIRECT(\"'\"&B66&\"'!$I$111\"))","v":{"$error":"#REF!"}},{"$f":"IF(B66=\"\",\"\",INDIRECT(\"'\"&B66&\"'!$R$111\"))","v":{"$error":"#REF!"}},{"$f":"IF(B66=\"\",\"\",INDIRECT(\"'\"&B66&\"'!$U$111\"))","v":{"$error":"#REF!"}},{"$f":"IF(B66=\"\",\"\",INDIRECT(\"'\"&B66&\"'!$X$111\"))","v":{"$error":"#REF!"}},{"$f":"IF(B66=\"\",\"\",INDIRECT(\"'\"&B66&\"'!$Z$111\"))","v":{"$error":"#REF!"}},{"$f":"IF(B66=\"\",\"\",INDIRECT(\"'\"&B66&\"'!$AA$111\"))","v":{"$error":"#REF!"}},{"$error":"#REF!"}]
[{"$nulls":4},{"$f":"IF(B66=\"\",\"\",INDIRECT(\"'\"&B66&\"'!$A$113\"))","v":{"$error":"#REF!"}},{"$f":"IF(B66=\"\",\"\",INDIRECT(\"'\"&B66&\"'!$K$120\"))","v":{"$error":"#REF!"}},{"$f":"IF(B66=\"\",\"\",INDIRECT(\"'\"&B66&\"'!$L$120\"))","v":{"$error":"#REF!"}},{"$f":"IF(B66=\"\",\"\",INDIRECT(\"'\"&B66&\"'!$H$120\"))","v":{"$error":"#REF!"}},{"$f":"IF(B66=\"\",\"\",INDIRECT(\"'\"&B66&\"'!$I$120\"))","v":{"$error":"#REF!"}},{"$f":"IF(B66=\"\",\"\",INDIRECT(\"'\"&B66&\"'!$R$120\"))","v":{"$error":"#REF!"}},{"$f":"IF(B66=\"\",\"\",INDIRECT(\"'\"&B66&\"'!$U$120\"))","v":{"$error":"#REF!"}},{"$f":"IF(B66=\"\",\"\",INDIRECT(\"'\"&B66&\"'!$X$120\"))","v":{"$error":"#REF!"}},{"$f":"IF(B66=\"\",\"\",INDIRECT(\"'\"&B66&\"'!$Z$120\"))","v":{"$error":"#REF!"}},{"$f":"IF(B66=\"\",\"\",INDIRECT(\"'\"&B66&\"'!$AA$120\"))","v":{"$error":"#REF!"}},{"$error":"#REF!"}]
[{"$nulls":4},{"$f":"IF(B66=\"\",\"\",INDIRECT(\"'\"&B66&\"'!$A$122\"))","v":{"$error":"#REF!"}},{"$f":"IF(B66=\"\",\"\",INDIRECT(\"'\"&B66&\"'!$K$129\"))","v":{"$error":"#REF!"}},{"$f":"IF(B66=\"\",\"\",INDIRECT(\"'\"&B66&\"'!$L$129\"))","v":{"$error":"#REF!"}},{"$f":"IF(B66=\"\",\"\",INDIRECT(\"'\"&B66&\"'!$H$129\"))","v":{"$error":"#REF!"}},{"$f":"IF(B66=\"\",\"\",INDIRECT(\"'\"&B66&\"'!$I$129\"))","v":{"$error":"#REF!"}},{"$f":"IF(B66=\"\",\"\",INDIRECT(\"'\"&B66&\"'!$R$129\"))","v":{"$error":"#REF!"}},{"$f":"IF(B66=\"\",\"\",INDIRECT(\"'\"&B66&\"'!$U$129\"))","v":{"$error":"#REF!"}},{"$f":"IF(B66=\"\",\"\",INDIRECT(\"'\"&B66&\"'!$X$129\"))","v":{"$error":"#REF!"}},{"$f":"IF(B66=\"\",\"\",INDIRECT(\"'\"&B66&\"'!$Z$129\"))","v":{"$error":"#REF!"}},{"$f":"IF(B66=\"\",\"\",INDIRECT(\"'\"&B66&\"'!$AA$129\"))","v":{"$error":"#REF!"}},{"$error":"#REF!"}]
[{"$nulls":4},{"$f":"IF(B66=\"\",\"\",INDIRECT(\"'\"&B66&\"'!$A$131\"))","v":{"$error":"#REF!"}},{"$f":"IF(B66=\"\",\"\",INDIRECT(\"'\"&B66&\"'!$K$167\"))","v":{"$error":"#REF!"}},{"$f":"IF(B66=\"\",\"\",INDIRECT(\"'\"&B66&\"'!$L$167\"))","v":{"$error":"#REF!"}},{"$f":"IF(B66=\"\",\"\",INDIRECT(\"'\"&B66&\"'!$H$167\"))","v":{"$error":"#REF!"}},{"$f":"IF(B66=\"\",\"\",INDIRECT(\"'\"&B66&\"'!$I$167\"))","v":{"$error":"#REF!"}},{"$f":"IF(B66=\"\",\"\",INDIRECT(\"'\"&B66&\"'!$R$167\"))","v":{"$error":"#REF!"}},{"$f":"IF(B66=\"\",\"\",INDIRECT(\"'\"&B66&\"'!$U$167\"))","v":{"$error":"#REF!"}},{"$f":"IF(B66=\"\",\"\",INDIRECT(\"'\"&B66&\"'!$X$167\"))","v":{"$error":"#REF!"}},{"$f":"IF(B66=\"\",\"\",INDIRECT(\"'\"&B66&\"'!$Z$167\"))","v":{"$error":"#REF!"}},{"$f":"IF(B66=\"\",\"\",INDIRECT(\"'\"&B66&\"'!$AA$167\"))","v":{"$error":"#REF!"}},{"$error":"#REF!"}]
[null,{"$f":"MID(INDEX(nom_feuilles,ROW(Masque!K13)),SEARCH(\"]\",INDEX(nom_feuilles,ROW(Masque!K13)))+1,30)","v":{"$error":"#REF!"}},{"$f":"IF(B74=\"\",\"\",INDIRECT(\"'\"&B74&\"'!$A$1\"))","v":{"$error":"#REF!"}},{"$f":"IF(B74=\"\",\"\",INDIRECT(\"'\"&B74&\"'!$A$2\"))","v":{"$error":"#REF!"}},{"$f":"IF(B74=\"\",\"\",INDIRECT(\"'\"&B74&\"'!$A$8\"))","v":{"$error":"#REF!"}},{"$f":"IF(B74=\"\",\"\",INDIRECT(\"'\"&B74&\"'!$K$30\"))","v":{"$error":"#REF!"}},{"$f":"IF(B74=\"\",\"\",INDIRECT(\"'\"&B74&\"'!$L$30\"))","v":{"$error":"#REF!"}},{"$f":"IF(B74=\"\",\"\",INDIRECT(\"'\"&B74&\"'!$H$30\"))","v":{"$error":"#REF!"}},{"$f":"IF(B74=\"\",\"\",INDIRECT(\"'\"&B74&\"'!$I$30\"))","v":{"$error":"#REF!"}},{"$f":"IF(B74=\"\",\"\",INDIRECT(\"'\"&B74&\"'!$R$30\"))","v":{"$error":"#REF!"}},{"$f":"IF(B74=\"\",\"\",INDIRECT(\"'\"&B74&\"'!$U$30\"))","v":{"$error":"#REF!"}},{"$f":"IF(B74=\"\",\"\",INDIRECT(\"'\"&B74&\"'!$X$30\"))","v":{"$error":"#REF!"}},{"$f":"IF(B74=\"\",\"\",INDIRECT(\"'\"&B74&\"'!$Z$30\"))","v":{"$error":"#REF!"}},{"$f":"IF(B74=\"\",\"\",INDIRECT(\"'\"&B74&\"'!$AA$30\"))","v":{"$error":"#REF!"}},{"$f":"SUM(F74:N74)","v":{"$error":"#REF!"}},{"$f":"SUM(O74:O81)","v":{"$error":"#REF!"}},{"$f":"IF(B74=\"\",\"\",INDIRECT(\"'\"&B74&\"'!$H$4\"))","v":{"$error":"#REF!"}},{"$f":"P74-Q74","v":{"$error":"#REF!"}}]
[{"$nulls":4},{"$f":"IF(B74=\"\",\"\",INDIRECT(\"'\"&B74&\"'!$A$32\"))","v":{"$error":"#REF!"}},{"$f":"IF(B74=\"\",\"\",INDIRECT(\"'\"&B74&\"'!$K$54\"))","v":{"$error":"#REF!"}},{"$f":"IF(B74=\"\",\"\",INDIRECT(\"'\"&B74&\"'!$L$54\"))","v":{"$error":"#REF!"}},{"$f":"IF(B74=\"\",\"\",INDIRECT(\"'\"&B74&\"'!$H$54\"))","v":{"$error":"#REF!"}},{"$f":"IF(B74=\"\",\"\",INDIRECT(\"'\"&B74&\"'!$I$54\"))","v":{"$error":"#REF!"}},{"$f":"IF(B74=\"\",\"\",INDIRECT(\"'\"&B74&\"'!$R$54\"))","v":{"$error":"#REF!"}},{"$f":"IF(B74=\"\",\"\",INDIRECT(\"'\"&B74&\"'!$U$54\"))","v":{"$error":"#REF!"}},{"$f":"IF(B74=\"\",\"\",INDIRECT(\"'\"&B74&\"'!$X$54\"))","v":{"$error":"#REF!"}},{"$f":"IF(B74=\"\",\"\",INDIRECT(\"'\"&B74&\"'!$Z$54\"))","v":{"$error":"#REF!"}},{"$f":"IF(B74=\"\",\"\",INDIRECT(\"'\"&B74&\"'!$AA$54\"))","v":{"$error":"#REF!"}},{"$f":"SUM(F75:N75)","v":{"$error":"#REF!"}}]
[{"$nulls":4},{"$f":"IF(B74=\"\",\"\",INDIRECT(\"'\"&B74&\"'!$A$56\"))","v":{"$error":"#REF!"}},{"$f":"IF(B74=\"\",\"\",INDIRECT(\"'\"&B74&\"'!$K$78\"))","v":{"$error":"#REF!"}},{"$f":"IF(B74=\"\",\"\",INDIRECT(\"'\"&B74&\"'!$L$78\"))","v":{"$error":"#REF!"}},{"$f":"IF(B74=\"\",\"\",INDIRECT(\"'\"&B74&\"'!$H$78\"))","v":{"$error":"#REF!"}},{"$f":"IF(B74=\"\",\"\",INDIRECT(\"'\"&B74&\"'!$I$78\"))","v":{"$error":"#REF!"}},{"$f":"IF(B74=\"\",\"\",INDIRECT(\"'\"&B74&\"'!$R$78\"))","v":{"$error":"#REF!"}},{"$f":"IF(B74=\"\",\"\",INDIRECT(\"'\"&B74&\"'!$U$78\"))","v":{"$error":"#REF!"}},{"$f":"IF(B74=\"\",\"\",INDIRECT(\"'\"&B74&\"'!$X$78\"))","v":{"$error":"#REF!"}},{"$f":"IF(B74=\"\",\"\",INDIRECT(\"'\"&B74&\"'!$Z$78\"))","v":{"$error":"#REF!"}},{"$f":"IF(B74=\"\",\"\",INDIRECT(\"'\"&B74&\"'!$AA$78\"))","v":{"$error":"#REF!"}},{"$f":"SUM(F76:N76)","v":{"$error":"#REF!"}}]
[{"$nulls":4},{"$f":"IF(B74=\"\",\"\",INDIRECT(\"'\"&B74&\"'!$A$80\"))","v":{"$error":"#REF!"}},{"$f":"IF(B74=\"\",\"\",INDIRECT(\"'\"&B74&\"'!$K$102\"))","v":{"$error":"#REF!"}},{"$f":"IF(B74=\"\",\"\",INDIRECT(\"'\"&B74&\"'!$L$102\"))","v":{"$error":"#REF!"}},{"$f":"IF(B74=\"\",\"\",INDIRECT(\"'\"&B74&\"'!$H$102\"))","v":{"$error":"#REF!"}},{"$f":"IF(B74=\"\",\"\",INDIRECT(\"'\"&B74&\"'!$I$102\"))","v":{"$error":"#REF!"}},{"$f":"IF(B74=\"\",\"\",INDIRECT(\"'\"&B74&\"'!$R$102\"))","v":{"$error":"#REF!"}},{"$f":"IF(B74=\"\",\"\",INDIRECT(\"'\"&B74&\"'!$U$102\"))","v":{"$error":"#REF!"}},{"$f":"IF(B74=\"\",\"\",INDIRECT(\"'\"&B74&\"'!$X$102\"))","v":{"$error":"#REF!"}},{"$f":"IF(B74=\"\",\"\",INDIRECT(\"'\"&B74&\"'!$Z$102\"))","v":{"$error":"#REF!"}},{"$f":"IF(B74=\"\",\"\",INDIRECT(\"'\"&B74&\"'!$AA$102\"))","v":{"$error":"#REF!"}},{"$error":"#REF!"}]
[{"$nulls":4},{"$f":"IF(B74=\"\",\"\",INDIRECT(\"'\"&B74&\"'!$A$104\"))","v":{"$error":"#REF!"}},{"$f":"IF(B74=\"\",\"\",INDIRECT(\"'\"&B74&\"'!$K$111\"))","v":{"$error":"#REF!"}},{"$f":"IF(B74=\"\",\"\",INDIRECT(\"'\"&B74&\"'!$L$111\"))","v":{"$error":"#REF!"}},{"$f":"IF(B74=\"\",\"\",INDIRECT(\"'\"&B74&\"'!$H$111\"))","v":{"$error":"#REF!"}},{"$f":"IF(B74=\"\",\"\",INDIRECT(\"'\"&B74&\"'!$I$111\"))","v":{"$error":"#REF!"}},{"$f":"IF(B74=\"\",\"\",INDIRECT(\"'\"&B74&\"'!$R$111\"))","v":{"$error":"#REF!"}},{"$f":"IF(B74=\"\",\"\",INDIRECT(\"'\"&B74&\"'!$U$111\"))","v":{"$error":"#REF!"}},{"$f":"IF(B74=\"\",\"\",INDIRECT(\"'\"&B74&\"'!$X$111\"))","v":{"$error":"#REF!"}},{"$f":"IF(B74=\"\",\"\",INDIRECT(\"'\"&B74&\"'!$Z$111\"))","v":{"$error":"#REF!"}},{"$f":"IF(B74=\"\",\"\",INDIRECT(\"'\"&B74&\"'!$AA$111\"))","v":{"$error":"#REF!"}},{"$error":"#REF!"}]
[{"$nulls":4},{"$f":"IF(B74=\"\",\"\",INDIRECT(\"'\"&B74&\"'!$A$113\"))","v":{"$error":"#REF!"}},{"$f":"IF(B74=\"\",\"\",INDIRECT(\"'\"&B74&\"'!$K$120\"))","v":{"$error":"#REF!"}},{"$f":"IF(B74=\"\",\"\",INDIRECT(\"'\"&B74&\"'!$L$120\"))","v":{"$error":"#REF!"}},{"$f":"IF(B74=\"\",\"\",INDIRECT(\"'\"&B74&\"'!$H$120\"))","v":{"$error":"#REF!"}},{"$f":"IF(B74=\"\",\"\",INDIRECT(\"'\"&B74&\"'!$I$120\"))","v":{"$error":"#REF!"}},{"$f":"IF(B74=\"\",\"\",INDIRECT(\"'\"&B74&\"'!$R$120\"))","v":{"$error":"#REF!"}},{"$f":"IF(B74=\"\",\"\",INDIRECT(\"'\"&B74&\"'!$U$120\"))","v":{"$error":"#REF!"}},{"$f":"IF(B74=\"\",\"\",INDIRECT(\"'\"&B74&\"'!$X$120\"))","v":{"$error":"#REF!"}},{"$f":"IF(B74=\"\",\"\",INDIRECT(\"'\"&B74&\"'!$Z$120\"))","v":{"$error":"#REF!"}},{"$f":"IF(B74=\"\",\"\",INDIRECT(\"'\"&B74&\"'!$AA$120\"))","v":{"$error":"#REF!"}},{"$error":"#REF!"}]
[{"$nulls":4},{"$f":"IF(B74=\"\",\"\",INDIRECT(\"'\"&B74&\"'!$A$122\"))","v":{"$error":"#REF!"}},{"$f":"IF(B74=\"\",\"\",INDIRECT(\"'\"&B74&\"'!$K$129\"))","v":{"$error":"#REF!"}},{"$f":"IF(B74=\"\",\"\",INDIRECT(\"'\"&B74&\"'!$L$129\"))","v":{"$error":"#REF!"}},{"$f":"IF(B74=\"\",\"\",INDIRECT(\"'\"&B74&\"'!$H$129\"))","v":{"$error":"#REF!"}},{"$f":"IF(B74=\"\",\"\",INDIRECT(\"'\"&B74&\"'!$I$129\"))","v":{"$error":"#REF!"}},{"$f":"IF(B74=\"\",\"\",INDIRECT(\"'\"&B74&\"'!$R$129\"))","v":{"$error":"#REF!"}},{"$f":"IF(B74=\"\",\"\",INDIRECT(\"'\"&B74&\"'!$U$129\"))","v":{"$error":"#REF!"}},{"$f":"IF(B74=\"\",\"\",INDIRECT(\"'\"&B74&\"'!$X$129\"))","v":{"$error":"#REF!"}},{"$f":"IF(B74=\"\",\"\",INDIRECT(\"'\"&B74&\"'!$Z$129\"))","v":{"$error":"#REF!"}},{"$f":"IF(B74=\"\",\"\",INDIRECT(\"'\"&B74&\"'!$AA$129\"))","v":{"$error":"#REF!"}},{"$error":"#REF!"}]
[{"$nulls":4},{"$f":"IF(B74=\"\",\"\",INDIRECT(\"'\"&B74&\"'!$A$131\"))","v":{"$error":"#REF!"}},{"$f":"IF(B74=\"\",\"\",INDIRECT(\"'\"&B74&\"'!$K$167\"))","v":{"$error":"#REF!"}},{"$f":"IF(B74=\"\",\"\",INDIRECT(\"'\"&B74&\"'!$L$167\"))","v":{"$error":"#REF!"}},{"$f":"IF(B74=\"\",\"\",INDIRECT(\"'\"&B74&\"'!$H$167\"))","v":{"$error":"#REF!"}},{"$f":"IF(B74=\"\",\"\",INDIRECT(\"'\"&B74&\"'!$I$167\"))","v":{"$error":"#REF!"}},{"$f":"IF(B74=\"\",\"\",INDIRECT(\"'\"&B74&\"'!$R$167\"))","v":{"$error":"#REF!"}},{"$f":"IF(B74=\"\",\"\",INDIRECT(\"'\"&B74&\"'!$U$167\"))","v":{"$error":"#REF!"}},{"$f":"IF(B74=\"\",\"\",INDIRECT(\"'\"&B74&\"'!$X$167\"))","v":{"$error":"#REF!"}},{"$f":"IF(B74=\"\",\"\",INDIRECT(\"'\"&B74&\"'!$Z$167\"))","v":{"$error":"#REF!"}},{"$f":"IF(B74=\"\",\"\",INDIRECT(\"'\"&B74&\"'!$AA$167\"))","v":{"$error":"#REF!"}},{"$error":"#REF!"}]
[null,{"$f":"MID(INDEX(nom_feuilles,ROW(Masque!K14)),SEARCH(\"]\",INDEX(nom_feuilles,ROW(Masque!K14)))+1,30)","v":{"$error":"#REF!"}},{"$f":"IF(B82=\"\",\"\",INDIRECT(\"'\"&B82&\"'!$A$1\"))","v":{"$error":"#REF!"}},{"$f":"IF(B82=\"\",\"\",INDIRECT(\"'\"&B82&\"'!$A$2\"))","v":{"$error":"#REF!"}},{"$f":"IF(B82=\"\",\"\",INDIRECT(\"'\"&B82&\"'!$A$8\"))","v":{"$error":"#REF!"}},{"$f":"IF(B82=\"\",\"\",INDIRECT(\"'\"&B82&\"'!$K$30\"))","v":{"$error":"#REF!"}},{"$f":"IF(B82=\"\",\"\",INDIRECT(\"'\"&B82&\"'!$L$30\"))","v":{"$error":"#REF!"}},{"$f":"IF(B82=\"\",\"\",INDIRECT(\"'\"&B82&\"'!$H$30\"))","v":{"$error":"#REF!"}},{"$f":"IF(B82=\"\",\"\",INDIRECT(\"'\"&B82&\"'!$I$30\"))","v":{"$error":"#REF!"}},{"$f":"IF(B82=\"\",\"\",INDIRECT(\"'\"&B82&\"'!$R$30\"))","v":{"$error":"#REF!"}},{"$f":"IF(B82=\"\",\"\",INDIRECT(\"'\"&B82&\"'!$U$30\"))","v":{"$error":"#REF!"}},{"$f":"IF(B82=\"\",\"\",INDIRECT(\"'\"&B82&\"'!$X$30\"))","v":{"$error":"#REF!"}},{"$f":"IF(B82=\"\",\"\",INDIRECT(\"'\"&B82&\"'!$Z$30\"))","v":{"$error":"#REF!"}},{"$f":"IF(B82=\"\",\"\",INDIRECT(\"'\"&B82&\"'!$AA$30\"))","v":{"$error":"#REF!"}},{"$f":"SUM(F82:N82)","v":{"$error":"#REF!"}},{"$f":"SUM(O82:O89)","v":{"$error":"#REF!"}},{"$f":"IF(B82=\"\",\"\",INDIRECT(\"'\"&B82&\"'!$H$4\"))","v":{"$error":"#REF!"}},{"$f":"P82-Q82","v":{"$error":"#REF!"}}]
[{"$nulls":4},{"$f":"IF(B82=\"\",\"\",INDIRECT(\"'\"&B82&\"'!$A$32\"))","v":{"$error":"#REF!"}},{"$f":"IF(B82=\"\",\"\",INDIRECT(\"'\"&B82&\"'!$K$54\"))","v":{"$error":"#REF!"}},{"$f":"IF(B82=\"\",\"\",INDIRECT(\"'\"&B82&\"'!$L$54\"))","v":{"$error":"#REF!"}},{"$f":"IF(B82=\"\",\"\",INDIRECT(\"'\"&B82&\"'!$H$54\"))","v":{"$error":"#REF!"}},{"$f":"IF(B82=\"\",\"\",INDIRECT(\"'\"&B82&\"'!$I$54\"))","v":{"$error":"#REF!"}},{"$f":"IF(B82=\"\",\"\",INDIRECT(\"'\"&B82&\"'!$R$54\"))","v":{"$error":"#REF!"}},{"$f":"IF(B82=\"\",\"\",INDIRECT(\"'\"&B82&\"'!$U$54\"))","v":{"$error":"#REF!"}},{"$f":"IF(B82=\"\",\"\",INDIRECT(\"'\"&B82&\"'!$X$54\"))","v":{"$error":"#REF!"}},{"$f":"IF(B82=\"\",\"\",INDIRECT(\"'\"&B82&\"'!$Z$54\"))","v":{"$error":"#REF!"}},{"$f":"IF(B82=\"\",\"\",INDIRECT(\"'\"&B82&\"'!$AA$54\"))","v":{"$error":"#REF!"}},{"$f":"SUM(F83:N83)","v":{"$error":"#REF!"}}]
[{"$nulls":4},{"$f":"IF(B82=\"\",\"\",INDIRECT(\"'\"&B82&\"'!$A$56\"))","v":{"$error":"#REF!"}},{"$f":"IF(B82=\"\",\"\",INDIRECT(\"'\"&B82&\"'!$K$78\"))","v":{"$error":"#REF!"}},{"$f":"IF(B82=\"\",\"\",INDIRECT(\"'\"&B82&\"'!$L$78\"))","v":{"$error":"#REF!"}},{"$f":"IF(B82=\"\",\"\",INDIRECT(\"'\"&B82&\"'!$H$78\"))","v":{"$error":"#REF!"}},{"$f":"IF(B82=\"\",\"\",INDIRECT(\"'\"&B82&\"'!$I$78\"))","v":{"$error":"#REF!"}},{"$f":"IF(B82=\"\",\"\",INDIRECT(\"'\"&B82&\"'!$R$78\"))","v":{"$error":"#REF!"}},{"$f":"IF(B82=\"\",\"\",INDIRECT(\"'\"&B82&\"'!$U$78\"))","v":{"$error":"#REF!"}},{"$f":"IF(B82=\"\",\"\",INDIRECT(\"'\"&B82&\"'!$X$78\"))","v":{"$error":"#REF!"}},{"$f":"IF(B82=\"\",\"\",INDIRECT(\"'\"&B82&\"'!$Z$78\"))","v":{"$error":"#REF!"}},{"$f":"IF(B82=\"\",\"\",INDIRECT(\"'\"&B82&\"'!$AA$78\"))","v":{"$error":"#REF!"}},{"$f":"SUM(F84:N84)","v":{"$error":"#REF!"}}]
[{"$nulls":4},{"$f":"IF(B82=\"\",\"\",INDIRECT(\"'\"&B82&\"'!$A$80\"))","v":{"$error":"#REF!"}},{"$f":"IF(B82=\"\",\"\",INDIRECT(\"'\"&B82&\"'!$K$102\"))","v":{"$error":"#REF!"}},{"$f":"IF(B82=\"\",\"\",INDIRECT(\"'\"&B82&\"'!$L$102\"))","v":{"$error":"#REF!"}},{"$f":"IF(B82=\"\",\"\",INDIRECT(\"'\"&B82&\"'!$H$102\"))","v":{"$error":"#REF!"}},{"$f":"IF(B82=\"\",\"\",INDIRECT(\"'\"&B82&\"'!$I$102\"))","v":{"$error":"#REF!"}},{"$f":"IF(B82=\"\",\"\",INDIRECT(\"'\"&B82&\"'!$R$102\"))","v":{"$error":"#REF!"}},{"$f":"IF(B82=\"\",\"\",INDIRECT(\"'\"&B82&\"'!$U$102\"))","v":{"$error":"#REF!"}},{"$f":"IF(B82=\"\",\"\",INDIRECT(\"'\"&B82&\"'!$X$102\"))","v":{"$error":"#REF!"}},{"$f":"IF(B82=\"\",\"\",INDIRECT(\"'\"&B82&\"'!$Z$102\"))","v":{"$error":"#REF!"}},{"$f":"IF(B82=\"\",\"\",INDIRECT(\"'\"&B82&\"'!$AA$102\"))","v":{"$error":"#REF!"}},{"$error":"#REF!"}]
[{"$nulls":4},{"$f":"IF(B82=\"\",\"\",INDIRECT(\"'\"&B82&\"'!$A$104\"))","v":{"$error":"#REF!"}},{"$f":"IF(B82=\"\",\"\",INDIRECT(\"'\"&B82&\"'!$K$111\"))","v":{"$error":"#REF!"}},{"$f":"IF(B82=\"\",\"\",INDIRECT(\"'\"&B82&\"'!$L$111\"))","v":{"$error":"#REF!"}},{"$f":"IF(B82=\"\",\"\",INDIRECT(\"'\"&B82&\"'!$H$111\"))","v":{"$error":"#REF!"}},{"$f":"IF(B82=\"\",\"\",INDIRECT(\"'\"&B82&\"'!$I$111\"))","v":{"$error":"#REF!"}},{"$f":"IF(B82=\"\",\"\",INDIRECT(\"'\"&B82&\"'!$R$111\"))","v":{"$error":"#REF!"}},{"$f":"IF(B82=\"\",\"\",INDIRECT(\"'\"&B82&\"'!$U$111\"))","v":{"$error":"#REF!"}},{"$f":"IF(B82=\"\",\"\",INDIRECT(\"'\"&B82&\"'!$X$111\"))","v":{"$error":"#REF!"}},{"$f":"IF(B82=\"\",\"\",INDIRECT(\"'\"&B82&\"'!$Z$111\"))","v":{"$error":"#REF!"}},{"$f":"IF(B82=\"\",\"\",INDIRECT(\"'\"&B82&\"'!$AA$111\"))","v":{"$error":"#REF!"}},{"$error":"#REF!"}]
[{"$nulls":4},{"$f":"IF(B82=\"\",\"\",INDIRECT(\"'\"&B82&\"'!$A$113\"))","v":{"$error":"#REF!"}},{"$f":"IF(B82=\"\",\"\",INDIRECT(\"'\"&B82&\"'!$K$120\"))","v":{"$error":"#REF!"}},{"$f":"IF(B82=\"\",\"\",INDIRECT(\"'\"&B82&\"'!$L$120\"))","v":{"$error":"#REF!"}},{"$f":"IF(B82=\"\",\"\",INDIRECT(\"'\"&B82&\"'!$H$120\"))","v":{"$error":"#REF!"}},{"$f":"IF(B82=\"\",\"\",INDIRECT(\"'\"&B82&\"'!$I$120\"))","v":{"$error":"#REF!"}},{"$f":"IF(B82=\"\",\"\",INDIRECT(\"'\"&B82&\"'!$R$120\"))","v":{"$error":"#REF!"}},{"$f":"IF(B82=\"\",\"\",INDIRECT(\"'\"&B82&\"'!$U$120\"))","v":{"$error":"#REF!"}},{"$f":"IF(B82=\"\",\"\",INDIRECT(\"'\"&B82&\"'!$X$120\"))","v":{"$error":"#REF!"}},{"$f":"IF(B82=\"\",\"\",INDIRECT(\"'\"&B82&\"'!$Z$120\"))","v":{"$error":"#REF!"}},{"$f":"IF(B82=\"\",\"\",INDIRECT(\"'\"&B82&\"'!$AA$120\"))","v":{"$error":"#REF!"}},{"$error":"#REF!"}]
[{"$nulls":4},{"$f":"IF(B82=\"\",\"\",INDIRECT(\"'\"&B82&\"'!$A$122\"))","v":{"$error":"#REF!"}},{"$f":"IF(B82=\"\",\"\",INDIRECT(\"'\"&B82&\"'!$K$129\"))","v":{"$error":"#REF!"}},{"$f":"IF(B82=\"\",\"\",INDIRECT(\"'\"&B82&\"'!$L$129\"))","v":{"$error":"#REF!"}},{"$f":"IF(B82=\"\",\"\",INDIRECT(\"'\"&B82&\"'!$H$129\"))","v":{"$error":"#REF!"}},{"$f":"IF(B82=\"\",\"\",INDIRECT(\"'\"&B82&\"'!$I$129\"))","v":{"$error":"#REF!"}},{"$f":"IF(B82=\"\",\"\",INDIRECT(\"'\"&B82&\"'!$R$129\"))","v":{"$error":"#REF!"}},{"$f":"IF(B82=\"\",\"\",INDIRECT(\"'\"&B82&\"'!$U$129\"))","v":{"$error":"#REF!"}},{"$f":"IF(B82=\"\",\"\",INDIRECT(\"'\"&B82&\"'!$X$129\"))","v":{"$error":"#REF!"}},{"$f":"IF(B82=\"\",\"\",INDIRECT(\"'\"&B82&\"'!$Z$129\"))","v":{"$error":"#REF!"}},{"$f":"IF(B82=\"\",\"\",INDIRECT(\"'\"&B82&\"'!$AA$129\"))","v":{"$error":"#REF!"}},{"$error":"#REF!"}]
[{"$nulls":4},{"$f":"IF(B82=\"\",\"\",INDIRECT(\"'\"&B82&\"'!$A$131\"))","v":{"$error":"#REF!"}},{"$f":"IF(B82=\"\",\"\",INDIRECT(\"'\"&B82&\"'!$K$167\"))","v":{"$error":"#REF!"}},{"$f":"IF(B82=\"\",\"\",INDIRECT(\"'\"&B82&\"'!$L$167\"))","v":{"$error":"#REF!"}},{"$f":"IF(B82=\"\",\"\",INDIRECT(\"'\"&B82&\"'!$H$167\"))","v":{"$error":"#REF!"}},{"$f":"IF(B82=\"\",\"\",INDIRECT(\"'\"&B82&\"'!$I$167\"))","v":{"$error":"#REF!"}},{"$f":"IF(B82=\"\",\"\",INDIRECT(\"'\"&B82&\"'!$R$167\"))","v":{"$error":"#REF!"}},{"$f":"IF(B82=\"\",\"\",INDIRECT(\"'\"&B82&\"'!$U$167\"))","v":{"$error":"#REF!"}},{"$f":"IF(B82=\"\",\"\",INDIRECT(\"'\"&B82&\"'!$X$167\"))","v":{"$error":"#REF!"}},{"$f":"IF(B82=\"\",\"\",INDIRECT(\"'\"&B82&\"'!$Z$167\"))","v":{"$error":"#REF!"}},{"$f":"IF(B82=\"\",\"\",INDIRECT(\"'\"&B82&\"'!$AA$167\"))","v":{"$error":"#REF!"}},{"$error":"#REF!"}]
[null,{"$f":"MID(INDEX(nom_feuilles,ROW(Masque!K15)),SEARCH(\"]\",INDEX(nom_feuilles,ROW(Masque!K15)))+1,30)","v":{"$error":"#REF!"}},{"$f":"IF(B90=\"\",\"\",INDIRECT(\"'\"&B90&\"'!$A$1\"))","v":{"$error":"#REF!"}},{"$f":"IF(B90=\"\",\"\",INDIRECT(\"'\"&B90&\"'!$A$2\"))","v":{"$error":"#REF!"}},{"$f":"IF(B90=\"\",\"\",INDIRECT(\"'\"&B90&\"'!$A$8\"))","v":{"$error":"#REF!"}},{"$f":"IF(B90=\"\",\"\",INDIRECT(\"'\"&B90&\"'!$K$30\"))","v":{"$error":"#REF!"}},{"$f":"IF(B90=\"\",\"\",INDIRECT(\"'\"&B90&\"'!$L$30\"))","v":{"$error":"#REF!"}},{"$f":"IF(B90=\"\",\"\",INDIRECT(\"'\"&B90&\"'!$H$30\"))","v":{"$error":"#REF!"}},{"$f":"IF(B90=\"\",\"\",INDIRECT(\"'\"&B90&\"'!$I$30\"))","v":{"$error":"#REF!"}},{"$f":"IF(B90=\"\",\"\",INDIRECT(\"'\"&B90&\"'!$R$30\"))","v":{"$error":"#REF!"}},{"$f":"IF(B90=\"\",\"\",INDIRECT(\"'\"&B90&\"'!$U$30\"))","v":{"$error":"#REF!"}},{"$f":"IF(B90=\"\",\"\",INDIRECT(\"'\"&B90&\"'!$X$30\"))","v":{"$error":"#REF!"}},{"$f":"IF(B90=\"\",\"\",INDIRECT(\"'\"&B90&\"'!$Z$30\"))","v":{"$error":"#REF!"}},{"$f":"IF(B90=\"\",\"\",INDIRECT(\"'\"&B90&\"'!$AA$30\"))","v":{"$error":"#REF!"}},{"$f":"SUM(F90:N90)","v":{"$error":"#REF!"}},{"$f":"SUM(O90:O97)","v":{"$error":"#REF!"}},{"$f":"IF(B90=\"\",\"\",INDIRECT(\"'\"&B90&\"'!$H$4\"))","v":{"$error":"#REF!"}},{"$f":"P90-Q90","v":{"$error":"#REF!"}}]
[{"$nulls":4},{"$f":"IF(B90=\"\",\"\",INDIRECT(\"'\"&B90&\"'!$A$32\"))","v":{"$error":"#REF!"}},{"$f":"IF(B90=\"\",\"\",INDIRECT(\"'\"&B90&\"'!$K$54\"))","v":{"$error":"#REF!"}},{"$f":"IF(B90=\"\",\"\",INDIRECT(\"'\"&B90&\"'!$L$54\"))","v":{"$error":"#REF!"}},{"$f":"IF(B90=\"\",\"\",INDIRECT(\"'\"&B90&\"'!$H$54\"))","v":{"$error":"#REF!"}},{"$f":"IF(B90=\"\",\"\",INDIRECT(\"'\"&B90&\"'!$I$54\"))","v":{"$error":"#REF!"}},{"$f":"IF(B90=\"\",\"\",INDIRECT(\"'\"&B90&\"'!$R$54\"))","v":{"$error":"#REF!"}},{"$f":"IF(B90=\"\",\"\",INDIRECT(\"'\"&B90&\"'!$U$54\"))","v":{"$error":"#REF!"}},{"$f":"IF(B90=\"\",\"\",INDIRECT(\"'\"&B90&\"'!$X$54\"))","v":{"$error":"#REF!"}},{"$f":"IF(B90=\"\",\"\",INDIRECT(\"'\"&B90&\"'!$Z$54\"))","v":{"$error":"#REF!"}},{"$f":"IF(B90=\"\",\"\",INDIRECT(\"'\"&B90&\"'!$AA$54\"))","v":{"$error":"#REF!"}},{"$f":"SUM(F91:N91)","v":{"$error":"#REF!"}}]
[{"$nulls":4},{"$f":"IF(B90=\"\",\"\",INDIRECT(\"'\"&B90&\"'!$A$56\"))","v":{"$error":"#REF!"}},{"$f":"IF(B90=\"\",\"\",INDIRECT(\"'\"&B90&\"'!$K$78\"))","v":{"$error":"#REF!"}},{"$f":"IF(B90=\"\",\"\",INDIRECT(\"'\"&B90&\"'!$L$78\"))","v":{"$error":"#REF!"}},{"$f":"IF(B90=\"\",\"\",INDIRECT(\"'\"&B90&\"'!$H$78\"))","v":{"$error":"#REF!"}},{"$f":"IF(B90=\"\",\"\",INDIRECT(\"'\"&B90&\"'!$I$78\"))","v":{"$error":"#REF!"}},{"$f":"IF(B90=\"\",\"\",INDIRECT(\"'\"&B90&\"'!$R$78\"))","v":{"$error":"#REF!"}},{"$f":"IF(B90=\"\",\"\",INDIRECT(\"'\"&B90&\"'!$U$78\"))","v":{"$error":"#REF!"}},{"$f":"IF(B90=\"\",\"\",INDIRECT(\"'\"&B90&\"'!$X$78\"))","v":{"$error":"#REF!"}},{"$f":"IF(B90=\"\",\"\",INDIRECT(\"'\"&B90&\"'!$Z$78\"))","v":{"$error":"#REF!"}},{"$f":"IF(B90=\"\",\"\",INDIRECT(\"'\"&B90&\"'!$AA$78\"))","v":{"$error":"#REF!"}},{"$f":"SUM(F92:N92)","v":{"$error":"#REF!"}}]
[{"$nulls":4},{"$f":"IF(B90=\"\",\"\",INDIRECT(\"'\"&B90&\"'!$A$80\"))","v":{"$error":"#REF!"}},{"$f":"IF(B90=\"\",\"\",INDIRECT(\"'\"&B90&\"'!$K$102\"))","v":{"$error":"#REF!"}},{"$f":"IF(B90=\"\",\"\",INDIRECT(\"'\"&B90&\"'!$L$102\"))","v":{"$error":"#REF!"}},{"$f":"IF(B90=\"\",\"\",INDIRECT(\"'\"&B90&\"'!$H$102\"))","v":{"$error":"#REF!"}},{"$f":"IF(B90=\"\",\"\",INDIRECT(\"'\"&B90&\"'!$I$102\"))","v":{"$error":"#REF!"}},{"$f":"IF(B90=\"\",\"\",INDIRECT(\"'\"&B90&\"'!$R$102\"))","v":{"$error":"#REF!"}},{"$f":"IF(B90=\"\",\"\",INDIRECT(\"'\"&B90&\"'!$U$102\"))","v":{"$error":"#REF!"}},{"$f":"IF(B90=\"\",\"\",INDIRECT(\"'\"&B90&\"'!$X$102\"))","v":{"$error":"#REF!"}},{"$f":"IF(B90=\"\",\"\",INDIRECT(\"'\"&B90&\"'!$Z$102\"))","v":{"$error":"#REF!"}},{"$f":"IF(B90=\"\",\"\",INDIRECT(\"'\"&B90&\"'!$AA$102\"))","v":{"$error":"#REF!"}},{"$error":"#REF!"}]
[{"$nulls":4},{"$f":"IF(B90=\"\",\"\",INDIRECT(\"'\"&B90&\"'!$A$104\"))","v":{"$error":"#REF!"}},{"$f":"IF(B90=\"\",\"\",INDIRECT(\"'\"&B90&\"'!$K$111\"))","v":{"$error":"#REF!"}},{"$f":"IF(B90=\"\",\"\",INDIRECT(\"'\"&B90&\"'!$L$111\"))","v":{"$error":"#REF!"}},{"$f":"IF(B90=\"\",\"\",INDIRECT(\"'\"&B90&\"'!$H$111\"))","v":{"$error":"#REF!"}},{"$f":"IF(B90=\"\",\"\",INDIRECT(\"'\"&B90&\"'!$I$111\"))","v":{"$error":"#REF!"}},{"$f":"IF(B90=\"\",\"\",INDIRECT(\"'\"&B90&\"'!$R$111\"))","v":{"$error":"#REF!"}},{"$f":"IF(B90=\"\",\"\",INDIRECT(\"'\"&B90&\"'!$U$111\"))","v":{"$error":"#REF!"}},{"$f":"IF(B90=\"\",\"\",INDIRECT(\"'\"&B90&\"'!$X$111\"))","v":{"$error":"#REF!"}},{"$f":"IF(B90=\"\",\"\",INDIRECT(\"'\"&B90&\"'!$Z$111\"))","v":{"$error":"#REF!"}},{"$f":"IF(B90=\"\",\"\",INDIRECT(\"'\"&B90&\"'!$AA$111\"))","v":{"$error":"#REF!"}},{"$error":"#REF!"}]
[{"$nulls":4},{"$f":"IF(B90=\"\",\"\",INDIRECT(\"'\"&B90&\"'!$A$113\"))","v":{"$error":"#REF!"}},{"$f":"IF(B90=\"\",\"\",INDIRECT(\"'\"&B90&\"'!$K$120\"))","v":{"$error":"#REF!"}},{"$f":"IF(B90=\"\",\"\",INDIRECT(\"'\"&B90&\"'!$L$120\"))","v":{"$error":"#REF!"}},{"$f":"IF(B90=\"\",\"\",INDIRECT(\"'\"&B90&\"'!$H$120\"))","v":{"$error":"#REF!"}},{"$f":"IF(B90=\"\",\"\",INDIRECT(\"'\"&B90&\"'!$I$120\"))","v":{"$error":"#REF!"}},{"$f":"IF(B90=\"\",\"\",INDIRECT(\"'\"&B90&\"'!$R$120\"))","v":{"$error":"#REF!"}},{"$f":"IF(B90=\"\",\"\",INDIRECT(\"'\"&B90&\"'!$U$120\"))","v":{"$error":"#REF!"}},{"$f":"IF(B90=\"\",\"\",INDIRECT(\"'\"&B90&\"'!$X$120\"))","v":{"$error":"#REF!"}},{"$f":"IF(B90=\"\",\"\",INDIRECT(\"'\"&B90&\"'!$Z$120\"))","v":{"$error":"#REF!"}},{"$f":"IF(B90=\"\",\"\",INDIRECT(\"'\"&B90&\"'!$AA$120\"))","v":{"$error":"#REF!"}},{"$error":"#REF!"}]
[{"$nulls":4},{"$f":"IF(B90=\"\",\"\",INDIRECT(\"'\"&B90&\"'!$A$122\"))","v":{"$error":"#REF!"}},{"$f":"IF(B90=\"\",\"\",INDIRECT(\"'\"&B90&\"'!$K$129\"))","v":{"$error":"#REF!"}},{"$f":"IF(B90=\"\",\"\",INDIRECT(\"'\"&B90&\"'!$L$129\"))","v":{"$error":"#REF!"}},{"$f":"IF(B90=\"\",\"\",INDIRECT(\"'\"&B90&\"'!$H$129\"))","v":{"$error":"#REF!"}},{"$f":"IF(B90=\"\",\"\",INDIRECT(\"'\"&B90&\"'!$I$129\"))","v":{"$error":"#REF!"}},{"$f":"IF(B90=\"\",\"\",INDIRECT(\"'\"&B90&\"'!$R$129\"))","v":{"$error":"#REF!"}},{"$f":"IF(B90=\"\",\"\",INDIRECT(\"'\"&B90&\"'!$U$129\"))","v":{"$error":"#REF!"}},{"$f":"IF(B90=\"\",\"\",INDIRECT(\"'\"&B90&\"'!$X$129\"))","v":{"$error":"#REF!"}},{"$f":"IF(B90=\"\",\"\",INDIRECT(\"'\"&B90&\"'!$Z$129\"))","v":{"$error":"#REF!"}},{"$f":"IF(B90=\"\",\"\",INDIRECT(\"'\"&B90&\"'!$AA$129\"))","v":{"$error":"#REF!"}},{"$error":"#REF!"}]
[{"$nulls":4},{"$f":"IF(B90=\"\",\"\",INDIRECT(\"'\"&B90&\"'!$A$131\"))","v":{"$error":"#REF!"}},{"$f":"IF(B90=\"\",\"\",INDIRECT(\"'\"&B90&\"'!$K$167\"))","v":{"$error":"#REF!"}},{"$f":"IF(B90=\"\",\"\",INDIRECT(\"'\"&B90&\"'!$L$167\"))","v":{"$error":"#REF!"}},{"$f":"IF(B90=\"\",\"\",INDIRECT(\"'\"&B90&\"'!$H$167\"))","v":{"$error":"#REF!"}},{"$f":"IF(B90=\"\",\"\",INDIRECT(\"'\"&B90&\"'!$I$167\"))","v":{"$error":"#REF!"}},{"$f":"IF(B90=\"\",\"\",INDIRECT(\"'\"&B90&\"'!$R$167\"))","v":{"$error":"#REF!"}},{"$f":"IF(B90=\"\",\"\",INDIRECT(\"'\"&B90&\"'!$U$167\"))","v":{"$error":"#REF!"}},{"$f":"IF(B90=\"\",\"\",INDIRECT(\"'\"&B90&\"'!$X$167\"))","v":{"$error":"#REF!"}},{"$f":"IF(B90=\"\",\"\",INDIRECT(\"'\"&B90&\"'!$Z$167\"))","v":{"$error":"#REF!"}},{"$f":"IF(B90=\"\",\"\",INDIRECT(\"'\"&B90&\"'!$AA$167\"))","v":{"$error":"#REF!"}},{"$error":"#REF!"}]
[null,{"$f":"MID(INDEX(nom_feuilles,ROW(Masque!K16)),SEARCH(\"]\",INDEX(nom_feuilles,ROW(Masque!K16)))+1,30)","v":{"$error":"#REF!"}},{"$f":"IF(B98=\"\",\"\",INDIRECT(\"'\"&B98&\"'!$A$1\"))","v":{"$error":"#REF!"}},{"$f":"IF(B98=\"\",\"\",INDIRECT(\"'\"&B98&\"'!$A$2\"))","v":{"$error":"#REF!"}},{"$f":"IF(B98=\"\",\"\",INDIRECT(\"'\"&B98&\"'!$A$8\"))","v":{"$error":"#REF!"}},{"$f":"IF(B98=\"\",\"\",INDIRECT(\"'\"&B98&\"'!$K$30\"))","v":{"$error":"#REF!"}},{"$f":"IF(B98=\"\",\"\",INDIRECT(\"'\"&B98&\"'!$L$30\"))","v":{"$error":"#REF!"}},{"$f":"IF(B98=\"\",\"\",INDIRECT(\"'\"&B98&\"'!$H$30\"))","v":{"$error":"#REF!"}},{"$f":"IF(B98=\"\",\"\",INDIRECT(\"'\"&B98&\"'!$I$30\"))","v":{"$error":"#REF!"}},{"$f":"IF(B98=\"\",\"\",INDIRECT(\"'\"&B98&\"'!$R$30\"))","v":{"$error":"#REF!"}},{"$f":"IF(B98=\"\",\"\",INDIRECT(\"'\"&B98&\"'!$U$30\"))","v":{"$error":"#REF!"}},{"$f":"IF(B98=\"\",\"\",INDIRECT(\"'\"&B98&\"'!$X$30\"))","v":{"$error":"#REF!"}},{"$f":"IF(B98=\"\",\"\",INDIRECT(\"'\"&B98&\"'!$Z$30\"))","v":{"$error":"#REF!"}},{"$f":"IF(B98=\"\",\"\",INDIRECT(\"'\"&B98&\"'!$AA$30\"))","v":{"$error":"#REF!"}},{"$f":"SUM(F98:N98)","v":{"$error":"#REF!"}},{"$f":"SUM(O98:O105)","v":{"$error":"#REF!"}},{"$f":"IF(B98=\"\",\"\",INDIRECT(\"'\"&B98&\"'!$H$4\"))","v":{"$error":"#REF!"}},{"$f":"P98-Q98","v":{"$error":"#REF!"}}]
[{"$nulls":4},{"$f":"IF(B98=\"\",\"\",INDIRECT(\"'\"&B98&\"'!$A$32\"))","v":{"$error":"#REF!"}},{"$f":"IF(B98=\"\",\"\",INDIRECT(\"'\"&B98&\"'!$K$54\"))","v":{"$error":"#REF!"}},{"$f":"IF(B98=\"\",\"\",INDIRECT(\"'\"&B98&\"'!$L$54\"))","v":{"$error":"#REF!"}},{"$f":"IF(B98=\"\",\"\",INDIRECT(\"'\"&B98&\"'!$H$54\"))","v":{"$error":"#REF!"}},{"$f":"IF(B98=\"\",\"\",INDIRECT(\"'\"&B98&\"'!$I$54\"))","v":{"$error":"#REF!"}},{"$f":"IF(B98=\"\",\"\",INDIRECT(\"'\"&B98&\"'!$R$54\"))","v":{"$error":"#REF!"}},{"$f":"IF(B98=\"\",\"\",INDIRECT(\"'\"&B98&\"'!$U$54\"))","v":{"$error":"#REF!"}},{"$f":"IF(B98=\"\",\"\",INDIRECT(\"'\"&B98&\"'!$X$54\"))","v":{"$error":"#REF!"}},{"$f":"IF(B98=\"\",\"\",INDIRECT(\"'\"&B98&\"'!$Z$54\"))","v":{"$error":"#REF!"}},{"$f":"IF(B98=\"\",\"\",INDIRECT(\"'\"&B98&\"'!$AA$54\"))","v":{"$error":"#REF!"}},{"$f":"SUM(F99:N99)","v":{"$error":"#REF!"}}]
[{"$nulls":4},{"$f":"IF(B98=\"\",\"\",INDIRECT(\"'\"&B98&\"'!$A$56\"))","v":{"$error":"#REF!"}},{"$f":"IF(B98=\"\",\"\",INDIRECT(\"'\"&B98&\"'!$K$78\"))","v":{"$error":"#REF!"}},{"$f":"IF(B98=\"\",\"\",INDIRECT(\"'\"&B98&\"'!$L$78\"))","v":{"$error":"#REF!"}},{"$f":"IF(B98=\"\",\"\",INDIRECT(\"'\"&B98&\"'!$H$78\"))","v":{"$error":"#REF!"}},{"$f":"IF(B98=\"\",\"\",INDIRECT(\"'\"&B98&\"'!$I$78\"))","v":{"$error":"#REF!"}},{"$f":"IF(B98=\"\",\"\",INDIRECT(\"'\"&B98&\"'!$R$78\"))","v":{"$error":"#REF!"}},{"$f":"IF(B98=\"\",\"\",INDIRECT(\"'\"&B98&\"'!$U$78\"))","v":{"$error":"#REF!"}},{"$f":"IF(B98=\"\",\"\",INDIRECT(\"'\"&B98&\"'!$X$78\"))","v":{"$error":"#REF!"}},{"$f":"IF(B98=\"\",\"\",INDIRECT(\"'\"&B98&\"'!$Z$78\"))","v":{"$error":"#REF!"}},{"$f":"IF(B98=\"\",\"\",INDIRECT(\"'\"&B98&\"'!$AA$78\"))","v":{"$error":"#REF!"}},{"$f":"SUM(F100:N100)","v":{"$error":"#REF!"}}]
[{"$nulls":4},{"$f":"IF(B98=\"\",\"\",INDIRECT(\"'\"&B98&\"'!$A$80\"))","v":{"$error":"#REF!"}},{"$f":"IF(B98=\"\",\"\",INDIRECT(\"'\"&B98&\"'!$K$102\"))","v":{"$error":"#REF!"}},{"$f":"IF(B98=\"\",\"\",INDIRECT(\"'\"&B98&\"'!$L$102\"))","v":{"$error":"#REF!"}},{"$f":"IF(B98=\"\",\"\",INDIRECT(\"'\"&B98&\"'!$H$102\"))","v":{"$error":"#REF!"}},{"$f":"IF(B98=\"\",\"\",INDIRECT(\"'\"&B98&\"'!$I$102\"))","v":{"$error":"#REF!"}},{"$f":"IF(B98=\"\",\"\",INDIRECT(\"'\"&B98&\"'!$R$102\"))","v":{"$error":"#REF!"}},{"$f":"IF(B98=\"\",\"\",INDIRECT(\"'\"&B98&\"'!$U$102\"))","v":{"$error":"#REF!"}},{"$f":"IF(B98=\"\",\"\",INDIRECT(\"'\"&B98&\"'!$X$102\"))","v":{"$error":"#REF!"}},{"$f":"IF(B98=\"\",\"\",INDIRECT(\"'\"&B98&\"'!$Z$102\"))","v":{"$error":"#REF!"}},{"$f":"IF(B98=\"\",\"\",INDIRECT(\"'\"&B98&\"'!$AA$102\"))","v":{"$error":"#REF!"}},{"$error":"#REF!"}]
[{"$nulls":4},{"$f":"IF(B98=\"\",\"\",INDIRECT(\"'\"&B98&\"'!$A$104\"))","v":{"$error":"#REF!"}},{"$f":"IF(B98=\"\",\"\",INDIRECT(\"'\"&B98&\"'!$K$111\"))","v":{"$error":"#REF!"}},{"$f":"IF(B98=\"\",\"\",INDIRECT(\"'\"&B98&\"'!$L$111\"))","v":{"$error":"#REF!"}},{"$f":"IF(B98=\"\",\"\",INDIRECT(\"'\"&B98&\"'!$H$111\"))","v":{"$error":"#REF!"}},{"$f":"IF(B98=\"\",\"\",INDIRECT(\"'\"&B98&\"'!$I$111\"))","v":{"$error":"#REF!"}},{"$f":"IF(B98=\"\",\"\",INDIRECT(\"'\"&B98&\"'!$R$111\"))","v":{"$error":"#REF!"}},{"$f":"IF(B98=\"\",\"\",INDIRECT(\"'\"&B98&\"'!$U$111\"))","v":{"$error":"#REF!"}},{"$f":"IF(B98=\"\",\"\",INDIRECT(\"'\"&B98&\"'!$X$111\"))","v":{"$error":"#REF!"}},{"$f":"IF(B98=\"\",\"\",INDIRECT(\"'\"&B98&\"'!$Z$111\"))","v":{"$error":"#REF!"}},{"$f":"IF(B98=\"\",\"\",INDIRECT(\"'\"&B98&\"'!$AA$111\"))","v":{"$error":"#REF!"}},{"$error":"#REF!"}]
[{"$nulls":4},{"$f":"IF(B98=\"\",\"\",INDIRECT(\"'\"&B98&\"'!$A$113\"))","v":{"$error":"#REF!"}},{"$f":"IF(B98=\"\",\"\",INDIRECT(\"'\"&B98&\"'!$K$120\"))","v":{"$error":"#REF!"}},{"$f":"IF(B98=\"\",\"\",INDIRECT(\"'\"&B98&\"'!$L$120\"))","v":{"$error":"#REF!"}},{"$f":"IF(B98=\"\",\"\",INDIRECT(\"'\"&B98&\"'!$H$120\"))","v":{"$error":"#REF!"}},{"$f":"IF(B98=\"\",\"\",INDIRECT(\"'\"&B98&\"'!$I$120\"))","v":{"$error":"#REF!"}},{"$f":"IF(B98=\"\",\"\",INDIRECT(\"'\"&B98&\"'!$R$120\"))","v":{"$error":"#REF!"}},{"$f":"IF(B98=\"\",\"\",INDIRECT(\"'\"&B98&\"'!$U$120\"))","v":{"$error":"#REF!"}},{"$f":"IF(B98=\"\",\"\",INDIRECT(\"'\"&B98&\"'!$X$120\"))","v":{"$error":"#REF!"}},{"$f":"IF(B98=\"\",\"\",INDIRECT(\"'\"&B98&\"'!$Z$120\"))","v":{"$error":"#REF!"}},{"$f":"IF(B98=\"\",\"\",INDIRECT(\"'\"&B98&\"'!$AA$120\"))","v":{"$error":"#REF!"}},{"$error":"#REF!"}]
[{"$nulls":4},{"$f":"IF(B98=\"\",\"\",INDIRECT(\"'\"&B98&\"'!$A$122\"))","v":{"$error":"#REF!"}},{"$f":"IF(B98=\"\",\"\",INDIRECT(\"'\"&B98&\"'!$K$129\"))","v":{"$error":"#REF!"}},{"$f":"IF(B98=\"\",\"\",INDIRECT(\"'\"&B98&\"'!$L$129\"))","v":{"$error":"#REF!"}},{"$f":"IF(B98=\"\",\"\",INDIRECT(\"'\"&B98&\"'!$H$129\"))","v":{"$error":"#REF!"}},{"$f":"IF(B98=\"\",\"\",INDIRECT(\"'\"&B98&\"'!$I$129\"))","v":{"$error":"#REF!"}},{"$f":"IF(B98=\"\",\"\",INDIRECT(\"'\"&B98&\"'!$R$129\"))","v":{"$error":"#REF!"}},{"$f":"IF(B98=\"\",\"\",INDIRECT(\"'\"&B98&\"'!$U$129\"))","v":{"$error":"#REF!"}},{"$f":"IF(B98=\"\",\"\",INDIRECT(\"'\"&B98&\"'!$X$129\"))","v":{"$error":"#REF!"}},{"$f":"IF(B98=\"\",\"\",INDIRECT(\"'\"&B98&\"'!$Z$129\"))","v":{"$error":"#REF!"}},{"$f":"IF(B98=\"\",\"\",INDIRECT(\"'\"&B98&\"'!$AA$129\"))","v":{"$error":"#REF!"}},{"$error":"#REF!"}]
[{"$nulls":4},{"$f":"IF(B98=\"\",\"\",INDIRECT(\"'\"&B98&\"'!$A$131\"))","v":{"$error":"#REF!"}},{"$f":"IF(B98=\"\",\"\",INDIRECT(\"'\"&B98&\"'!$K$167\"))","v":{"$error":"#REF!"}},{"$f":"IF(B98=\"\",\"\",INDIRECT(\"'\"&B98&\"'!$L$167\"))","v":{"$error":"#REF!"}},{"$f":"IF(B98=\"\",\"\",INDIRECT(\"'\"&B98&\"'!$H$167\"))","v":{"$error":"#REF!"}},{"$f":"IF(B98=\"\",\"\",INDIRECT(\"'\"&B98&\"'!$I$167\"))","v":{"$error":"#REF!"}},{"$f":"IF(B98=\"\",\"\",INDIRECT(\"'\"&B98&\"'!$R$167\"))","v":{"$error":"#REF!"}},{"$f":"IF(B98=\"\",\"\",INDIRECT(\"'\"&B98&\"'!$U$167\"))","v":{"$error":"#REF!"}},{"$f":"IF(B98=\"\",\"\",INDIRECT(\"'\"&B98&\"'!$X$167\"))","v":{"$error":"#REF!"}},{"$f":"IF(B98=\"\",\"\",INDIRECT(\"'\"&B98&\"'!$Z$167\"))","v":{"$error":"#REF!"}},{"$f":"IF(B98=\"\",\"\",INDIRECT(\"'\"&B98&\"'!$AA$167\"))","v":{"$error":"#REF!"}},{"$error":"#REF!"}]
[null,{"$f":"MID(INDEX(nom_feuilles,ROW(Masque!K17)),SEARCH(\"]\",INDEX(nom_feuilles,ROW(Masque!K17)))+1,30)","v":{"$error":"#REF!"}},{"$f":"IF(B106=\"\",\"\",INDIRECT(\"'\"&B106&\"'!$A$1\"))","v":{"$error":"#REF!"}},{"$f":"IF(B106=\"\",\"\",INDIRECT(\"'\"&B106&\"'!$A$2\"))","v":{"$error":"#REF!"}},{"$f":"IF(B106=\"\",\"\",INDIRECT(\"'\"&B106&\"'!$A$8\"))","v":{"$error":"#REF!"}},{"$f":"IF(B106=\"\",\"\",INDIRECT(\"'\"&B106&\"'!$K$30\"))","v":{"$error":"#REF!"}},{"$f":"IF(B106=\"\",\"\",INDIRECT(\"'\"&B106&\"'!$L$30\"))","v":{"$error":"#REF!"}},{"$f":"IF(B106=\"\",\"\",INDIRECT(\"'\"&B106&\"'!$H$30\"))","v":{"$error":"#REF!"}},{"$f":"IF(B106=\"\",\"\",INDIRECT(\"'\"&B106&\"'!$I$30\"))","v":{"$error":"#REF!"}},{"$f":"IF(B106=\"\",\"\",INDIRECT(\"'\"&B106&\"'!$R$30\"))","v":{"$error":"#REF!"}},{"$f":"IF(B106=\"\",\"\",INDIRECT(\"'\"&B106&\"'!$U$30\"))","v":{"$error":"#REF!"}},{"$f":"IF(B106=\"\",\"\",INDIRECT(\"'\"&B106&\"'!$X$30\"))","v":{"$error":"#REF!"}},{"$f":"IF(B106=\"\",\"\",INDIRECT(\"'\"&B106&\"'!$Z$30\"))","v":{"$error":"#REF!"}},{"$f":"IF(B106=\"\",\"\",INDIRECT(\"'\"&B106&\"'!$AA$30\"))","v":{"$error":"#REF!"}},{"$f":"SUM(F106:N106)","v":{"$error":"#REF!"}},{"$f":"SUM(O106:O113)","v":{"$error":"#REF!"}},{"$f":"IF(B106=\"\",\"\",INDIRECT(\"'\"&B106&\"'!$H$4\"))","v":{"$error":"#REF!"}},{"$f":"P106-Q106","v":{"$error":"#REF!"}}]
[{"$nulls":4},{"$f":"IF(B106=\"\",\"\",INDIRECT(\"'\"&B106&\"'!$A$32\"))","v":{"$error":"#REF!"}},{"$f":"IF(B106=\"\",\"\",INDIRECT(\"'\"&B106&\"'!$K$54\"))","v":{"$error":"#REF!"}},{"$f":"IF(B106=\"\",\"\",INDIRECT(\"'\"&B106&\"'!$L$54\"))","v":{"$error":"#REF!"}},{"$f":"IF(B106=\"\",\"\",INDIRECT(\"'\"&B106&\"'!$H$54\"))","v":{"$error":"#REF!"}},{"$f":"IF(B106=\"\",\"\",INDIRECT(\"'\"&B106&\"'!$I$54\"))","v":{"$error":"#REF!"}},{"$f":"IF(B106=\"\",\"\",INDIRECT(\"'\"&B106&\"'!$R$54\"))","v":{"$error":"#REF!"}},{"$f":"IF(B106=\"\",\"\",INDIRECT(\"'\"&B106&\"'!$U$54\"))","v":{"$error":"#REF!"}},{"$f":"IF(B106=\"\",\"\",INDIRECT(\"'\"&B106&\"'!$X$54\"))","v":{"$error":"#REF!"}},{"$f":"IF(B106=\"\",\"\",INDIRECT(\"'\"&B106&\"'!$Z$54\"))","v":{"$error":"#REF!"}},{"$f":"IF(B106=\"\",\"\",INDIRECT(\"'\"&B106&\"'!$AA$54\"))","v":{"$error":"#REF!"}},{"$f":"SUM(F107:N107)","v":{"$error":"#REF!"}}]
[{"$nulls":4},{"$f":"IF(B106=\"\",\"\",INDIRECT(\"'\"&B106&\"'!$A$56\"))","v":{"$error":"#REF!"}},{"$f":"IF(B106=\"\",\"\",INDIRECT(\"'\"&B106&\"'!$K$78\"))","v":{"$error":"#REF!"}},{"$f":"IF(B106=\"\",\"\",INDIRECT(\"'\"&B106&\"'!$L$78\"))","v":{"$error":"#REF!"}},{"$f":"IF(B106=\"\",\"\",INDIRECT(\"'\"&B106&\"'!$H$78\"))","v":{"$error":"#REF!"}},{"$f":"IF(B106=\"\",\"\",INDIRECT(\"'\"&B106&\"'!$I$78\"))","v":{"$error":"#REF!"}},{"$f":"IF(B106=\"\",\"\",INDIRECT(\"'\"&B106&\"'!$R$78\"))","v":{"$error":"#REF!"}},{"$f":"IF(B106=\"\",\"\",INDIRECT(\"'\"&B106&\"'!$U$78\"))","v":{"$error":"#REF!"}},{"$f":"IF(B106=\"\",\"\",INDIRECT(\"'\"&B106&\"'!$X$78\"))","v":{"$error":"#REF!"}},{"$f":"IF(B106=\"\",\"\",INDIRECT(\"'\"&B106&\"'!$Z$78\"))","v":{"$error":"#REF!"}},{"$f":"IF(B106=\"\",\"\",INDIRECT(\"'\"&B106&\"'!$AA$78\"))","v":{"$error":"#REF!"}},{"$f":"SUM(F108:N108)","v":{"$error":"#REF!"}}]
[{"$nulls":4},{"$f":"IF(B106=\"\",\"\",INDIRECT(\"'\"&B106&\"'!$A$80\"))","v":{"$error":"#REF!"}},{"$f":"IF(B106=\"\",\"\",INDIRECT(\"'\"&B106&\"'!$K$102\"))","v":{"$error":"#REF!"}},{"$f":"IF(B106=\"\",\"\",INDIRECT(\"'\"&B106&\"'!$L$102\"))","v":{"$error":"#REF!"}},{"$f":"IF(B106=\"\",\"\",INDIRECT(\"'\"&B106&\"'!$H$102\"))","v":{"$error":"#REF!"}},{"$f":"IF(B106=\"\",\"\",INDIRECT(\"'\"&B106&\"'!$I$102\"))","v":{"$error":"#REF!"}},{"$f":"IF(B106=\"\",\"\",INDIRECT(\"'\"&B106&\"'!$R$102\"))","v":{"$error":"#REF!"}},{"$f":"IF(B106=\"\",\"\",INDIRECT(\"'\"&B106&\"'!$U$102\"))","v":{"$error":"#REF!"}},{"$f":"IF(B106=\"\",\"\",INDIRECT(\"'\"&B106&\"'!$X$102\"))","v":{"$error":"#REF!"}},{"$f":"IF(B106=\"\",\"\",INDIRECT(\"'\"&B106&\"'!$Z$102\"))","v":{"$error":"#REF!"}},{"$f":"IF(B106=\"\",\"\",INDIRECT(\"'\"&B106&\"'!$AA$102\"))","v":{"$error":"#REF!"}},{"$error":"#REF!"}]
[{"$nulls":4},{"$f":"IF(B106=\"\",\"\",INDIRECT(\"'\"&B106&\"'!$A$104\"))","v":{"$error":"#REF!"}},{"$f":"IF(B106=\"\",\"\",INDIRECT(\"'\"&B106&\"'!$K$111\"))","v":{"$error":"#REF!"}},{"$f":"IF(B106=\"\",\"\",INDIRECT(\"'\"&B106&\"'!$L$111\"))","v":{"$error":"#REF!"}},{"$f":"IF(B106=\"\",\"\",INDIRECT(\"'\"&B106&\"'!$H$111\"))","v":{"$error":"#REF!"}},{"$f":"IF(B106=\"\",\"\",INDIRECT(\"'\"&B106&\"'!$I$111\"))","v":{"$error":"#REF!"}},{"$f":"IF(B106=\"\",\"\",INDIRECT(\"'\"&B106&\"'!$R$111\"))","v":{"$error":"#REF!"}},{"$f":"IF(B106=\"\",\"\",INDIRECT(\"'\"&B106&\"'!$U$111\"))","v":{"$error":"#REF!"}},{"$f":"IF(B106=\"\",\"\",INDIRECT(\"'\"&B106&\"'!$X$111\"))","v":{"$error":"#REF!"}},{"$f":"IF(B106=\"\",\"\",INDIRECT(\"'\"&B106&\"'!$Z$111\"))","v":{"$error":"#REF!"}},{"$f":"IF(B106=\"\",\"\",INDIRECT(\"'\"&B106&\"'!$AA$111\"))","v":{"$error":"#REF!"}},{"$error":"#REF!"}]
[{"$nulls":4},{"$f":"IF(B106=\"\",\"\",INDIRECT(\"'\"&B106&\"'!$A$113\"))","v":{"$error":"#REF!"}},{"$f":"IF(B106=\"\",\"\",INDIRECT(\"'\"&B106&\"'!$K$120\"))","v":{"$error":"#REF!"}},{"$f":"IF(B106=\"\",\"\",INDIRECT(\"'\"&B106&\"'!$L$120\"))","v":{"$error":"#REF!"}},{"$f":"IF(B106=\"\",\"\",INDIRECT(\"'\"&B106&\"'!$H$120\"))","v":{"$error":"#REF!"}},{"$f":"IF(B106=\"\",\"\",INDIRECT(\"'\"&B106&\"'!$I$120\"))","v":{"$error":"#REF!"}},{"$f":"IF(B106=\"\",\"\",INDIRECT(\"'\"&B106&\"'!$R$120\"))","v":{"$error":"#REF!"}},{"$f":"IF(B106=\"\",\"\",INDIRECT(\"'\"&B106&\"'!$U$120\"))","v":{"$error":"#REF!"}},{"$f":"IF(B106=\"\",\"\",INDIRECT(\"'\"&B106&\"'!$X$120\"))","v":{"$error":"#REF!"}},{"$f":"IF(B106=\"\",\"\",INDIRECT(\"'\"&B106&\"'!$Z$120\"))","v":{"$error":"#REF!"}},{"$f":"IF(B106=\"\",\"\",INDIRECT(\"'\"&B106&\"'!$AA$120\"))","v":{"$error":"#REF!"}},{"$error":"#REF!"}]
[{"$nulls":4},{"$f":"IF(B106=\"\",\"\",INDIRECT(\"'\"&B106&\"'!$A$122\"))","v":{"$error":"#REF!"}},{"$f":"IF(B106=\"\",\"\",INDIRECT(\"'\"&B106&\"'!$K$129\"))","v":{"$error":"#REF!"}},{"$f":"IF(B106=\"\",\"\",INDIRECT(\"'\"&B106&\"'!$L$129\"))","v":{"$error":"#REF!"}},{"$f":"IF(B106=\"\",\"\",INDIRECT(\"'\"&B106&\"'!$H$129\"))","v":{"$error":"#REF!"}},{"$f":"IF(B106=\"\",\"\",INDIRECT(\"'\"&B106&\"'!$I$129\"))","v":{"$error":"#REF!"}},{"$f":"IF(B106=\"\",\"\",INDIRECT(\"'\"&B106&\"'!$R$129\"))","v":{"$error":"#REF!"}},{"$f":"IF(B106=\"\",\"\",INDIRECT(\"'\"&B106&\"'!$U$129\"))","v":{"$error":"#REF!"}},{"$f":"IF(B106=\"\",\"\",INDIRECT(\"'\"&B106&\"'!$X$129\"))","v":{"$error":"#REF!"}},{"$f":"IF(B106=\"\",\"\",INDIRECT(\"'\"&B106&\"'!$Z$129\"))","v":{"$error":"#REF!"}},{"$f":"IF(B106=\"\",\"\",INDIRECT(\"'\"&B106&\"'!$AA$129\"))","v":{"$error":"#REF!"}},{"$error":"#REF!"}]
[{"$nulls":4},{"$f":"IF(B106=\"\",\"\",INDIRECT(\"'\"&B106&\"'!$A$131\"))","v":{"$error":"#REF!"}},{"$f":"IF(B106=\"\",\"\",INDIRECT(\"'\"&B106&\"'!$K$167\"))","v":{"$error":"#REF!"}},{"$f":"IF(B106=\"\",\"\",INDIRECT(\"'\"&B106&\"'!$L$167\"))","v":{"$error":"#REF!"}},{"$f":"IF(B106=\"\",\"\",INDIRECT(\"'\"&B106&\"'!$H$167\"))","v":{"$error":"#REF!"}},{"$f":"IF(B106=\"\",\"\",INDIRECT(\"'\"&B106&\"'!$I$167\"))","v":{"$error":"#REF!"}},{"$f":"IF(B106=\"\",\"\",INDIRECT(\"'\"&B106&\"'!$R$167\"))","v":{"$error":"#REF!"}},{"$f":"IF(B106=\"\",\"\",INDIRECT(\"'\"&B106&\"'!$U$167\"))","v":{"$error":"#REF!"}},{"$f":"IF(B106=\"\",\"\",INDIRECT(\"'\"&B106&\"'!$X$167\"))","v":{"$error":"#REF!"}},{"$f":"IF(B106=\"\",\"\",INDIRECT(\"'\"&B106&\"'!$Z$167\"))","v":{"$error":"#REF!"}},{"$f":"IF(B106=\"\",\"\",INDIRECT(\"'\"&B106&\"'!$AA$167\"))","v":{"$error":"#REF!"}},{"$error":"#REF!"}]
[null,{"$f":"MID(INDEX(nom_feuilles,ROW(Masque!K18)),SEARCH(\"]\",INDEX(nom_feuilles,ROW(Masque!K18)))+1,30)","v":{"$error":"#REF!"}},{"$f":"IF(B114=\"\",\"\",INDIRECT(\"'\"&B114&\"'!$A$1\"))","v":{"$error":"#REF!"}},{"$f":"IF(B114=\"\",\"\",INDIRECT(\"'\"&B114&\"'!$A$2\"))","v":{"$error":"#REF!"}},{"$f":"IF(B114=\"\",\"\",INDIRECT(\"'\"&B114&\"'!$A$8\"))","v":{"$error":"#REF!"}},{"$f":"IF(B114=\"\",\"\",INDIRECT(\"'\"&B114&\"'!$K$30\"))","v":{"$error":"#REF!"}},{"$f":"IF(B114=\"\",\"\",INDIRECT(\"'\"&B114&\"'!$L$30\"))","v":{"$error":"#REF!"}},{"$f":"IF(B114=\"\",\"\",INDIRECT(\"'\"&B114&\"'!$H$30\"))","v":{"$error":"#REF!"}},{"$f":"IF(B114=\"\",\"\",INDIRECT(\"'\"&B114&\"'!$I$30\"))","v":{"$error":"#REF!"}},{"$f":"IF(B114=\"\",\"\",INDIRECT(\"'\"&B114&\"'!$R$30\"))","v":{"$error":"#REF!"}},{"$f":"IF(B114=\"\",\"\",INDIRECT(\"'\"&B114&\"'!$U$30\"))","v":{"$error":"#REF!"}},{"$f":"IF(B114=\"\",\"\",INDIRECT(\"'\"&B114&\"'!$X$30\"))","v":{"$error":"#REF!"}},{"$f":"IF(B114=\"\",\"\",INDIRECT(\"'\"&B114&\"'!$Z$30\"))","v":{"$error":"#REF!"}},{"$f":"IF(B114=\"\",\"\",INDIRECT(\"'\"&B114&\"'!$AA$30\"))","v":{"$error":"#REF!"}},{"$f":"SUM(F114:N114)","v":{"$error":"#REF!"}},{"$f":"SUM(O114:O121)","v":{"$error":"#REF!"}},{"$f":"IF(B114=\"\",\"\",INDIRECT(\"'\"&B114&\"'!$H$4\"))","v":{"$error":"#REF!"}},{"$f":"P114-Q114","v":{"$error":"#REF!"}}]
[{"$nulls":4},{"$f":"IF(B114=\"\",\"\",INDIRECT(\"'\"&B114&\"'!$A$32\"))","v":{"$error":"#REF!"}},{"$f":"IF(B114=\"\",\"\",INDIRECT(\"'\"&B114&\"'!$K$54\"))","v":{"$error":"#REF!"}},{"$f":"IF(B114=\"\",\"\",INDIRECT(\"'\"&B114&\"'!$L$54\"))","v":{"$error":"#REF!"}},{"$f":"IF(B114=\"\",\"\",INDIRECT(\"'\"&B114&\"'!$H$54\"))","v":{"$error":"#REF!"}},{"$f":"IF(B114=\"\",\"\",INDIRECT(\"'\"&B114&\"'!$I$54\"))","v":{"$error":"#REF!"}},{"$f":"IF(B114=\"\",\"\",INDIRECT(\"'\"&B114&\"'!$R$54\"))","v":{"$error":"#REF!"}},{"$f":"IF(B114=\"\",\"\",INDIRECT(\"'\"&B114&\"'!$U$54\"))","v":{"$error":"#REF!"}},{"$f":"IF(B114=\"\",\"\",INDIRECT(\"'\"&B114&\"'!$X$54\"))","v":{"$error":"#REF!"}},{"$f":"IF(B114=\"\",\"\",INDIRECT(\"'\"&B114&\"'!$Z$54\"))","v":{"$error":"#REF!"}},{"$f":"IF(B114=\"\",\"\",INDIRECT(\"'\"&B114&\"'!$AA$54\"))","v":{"$error":"#REF!"}},{"$f":"SUM(F115:N115)","v":{"$error":"#REF!"}}]
[{"$nulls":4},{"$f":"IF(B114=\"\",\"\",INDIRECT(\"'\"&B114&\"'!$A$56\"))","v":{"$error":"#REF!"}},{"$f":"IF(B114=\"\",\"\",INDIRECT(\"'\"&B114&\"'!$K$78\"))","v":{"$error":"#REF!"}},{"$f":"IF(B114=\"\",\"\",INDIRECT(\"'\"&B114&\"'!$L$78\"))","v":{"$error":"#REF!"}},{"$f":"IF(B114=\"\",\"\",INDIRECT(\"'\"&B114&\"'!$H$78\"))","v":{"$error":"#REF!"}},{"$f":"IF(B114=\"\",\"\",INDIRECT(\"'\"&B114&\"'!$I$78\"))","v":{"$error":"#REF!"}},{"$f":"IF(B114=\"\",\"\",INDIRECT(\"'\"&B114&\"'!$R$78\"))","v":{"$error":"#REF!"}},{"$f":"IF(B114=\"\",\"\",INDIRECT(\"'\"&B114&\"'!$U$78\"))","v":{"$error":"#REF!"}},{"$f":"IF(B114=\"\",\"\",INDIRECT(\"'\"&B114&\"'!$X$78\"))","v":{"$error":"#REF!"}},{"$f":"IF(B114=\"\",\"\",INDIRECT(\"'\"&B114&\"'!$Z$78\"))","v":{"$error":"#REF!"}},{"$f":"IF(B114=\"\",\"\",INDIRECT(\"'\"&B114&\"'!$AA$78\"))","v":{"$error":"#REF!"}},{"$f":"SUM(F116:N116)","v":{"$error":"#REF!"}}]
[{"$nulls":4},{"$f":"IF(B114=\"\",\"\",INDIRECT(\"'\"&B114&\"'!$A$80\"))","v":{"$error":"#REF!"}},{"$f":"IF(B114=\"\",\"\",INDIRECT(\"'\"&B114&\"'!$K$102\"))","v":{"$error":"#REF!"}},{"$f":"IF(B114=\"\",\"\",INDIRECT(\"'\"&B114&\"'!$L$102\"))","v":{"$error":"#REF!"}},{"$f":"IF(B114=\"\",\"\",INDIRECT(\"'\"&B114&\"'!$H$102\"))","v":{"$error":"#REF!"}},{"$f":"IF(B114=\"\",\"\",INDIRECT(\"'\"&B114&\"'!$I$102\"))","v":{"$error":"#REF!"}},{"$f":"IF(B114=\"\",\"\",INDIRECT(\"'\"&B114&\"'!$R$102\"))","v":{"$error":"#REF!"}},{"$f":"IF(B114=\"\",\"\",INDIRECT(\"'\"&B114&\"'!$U$102\"))","v":{"$error":"#REF!"}},{"$f":"IF(B114=\"\",\"\",INDIRECT(\"'\"&B114&\"'!$X$102\"))","v":{"$error":"#REF!"}},{"$f":"IF(B114=\"\",\"\",INDIRECT(\"'\"&B114&\"'!$Z$102\"))","v":{"$error":"#REF!"}},{"$f":"IF(B114=\"\",\"\",INDIRECT(\"'\"&B114&\"'!$AA$102\"))","v":{"$error":"#REF!"}},{"$error":"#REF!"}]
[{"$nulls":4},{"$f":"IF(B114=\"\",\"\",INDIRECT(\"'\"&B114&\"'!$A$104\"))","v":{"$error":"#REF!"}},{"$f":"IF(B114=\"\",\"\",INDIRECT(\"'\"&B114&\"'!$K$111\"))","v":{"$error":"#REF!"}},{"$f":"IF(B114=\"\",\"\",INDIRECT(\"'\"&B114&\"'!$L$111\"))","v":{"$error":"#REF!"}},{"$f":"IF(B114=\"\",\"\",INDIRECT(\"'\"&B114&\"'!$H$111\"))","v":{"$error":"#REF!"}},{"$f":"IF(B114=\"\",\"\",INDIRECT(\"'\"&B114&\"'!$I$111\"))","v":{"$error":"#REF!"}},{"$f":"IF(B114=\"\",\"\",INDIRECT(\"'\"&B114&\"'!$R$111\"))","v":{"$error":"#REF!"}},{"$f":"IF(B114=\"\",\"\",INDIRECT(\"'\"&B114&\"'!$U$111\"))","v":{"$error":"#REF!"}},{"$f":"IF(B114=\"\",\"\",INDIRECT(\"'\"&B114&\"'!$X$111\"))","v":{"$error":"#REF!"}},{"$f":"IF(B114=\"\",\"\",INDIRECT(\"'\"&B114&\"'!$Z$111\"))","v":{"$error":"#REF!"}},{"$f":"IF(B114=\"\",\"\",INDIRECT(\"'\"&B114&\"'!$AA$111\"))","v":{"$error":"#REF!"}},{"$error":"#REF!"}]
[{"$nulls":4},{"$f":"IF(B114=\"\",\"\",INDIRECT(\"'\"&B114&\"'!$A$113\"))","v":{"$error":"#REF!"}},{"$f":"IF(B114=\"\",\"\",INDIRECT(\"'\"&B114&\"'!$K$120\"))","v":{"$error":"#REF!"}},{"$f":"IF(B114=\"\",\"\",INDIRECT(\"'\"&B114&\"'!$L$120\"))","v":{"$error":"#REF!"}},{"$f":"IF(B114=\"\",\"\",INDIRECT(\"'\"&B114&\"'!$H$120\"))","v":{"$error":"#REF!"}},{"$f":"IF(B114=\"\",\"\",INDIRECT(\"'\"&B114&\"'!$I$120\"))","v":{"$error":"#REF!"}},{"$f":"IF(B114=\"\",\"\",INDIRECT(\"'\"&B114&\"'!$R$120\"))","v":{"$error":"#REF!"}},{"$f":"IF(B114=\"\",\"\",INDIRECT(\"'\"&B114&\"'!$U$120\"))","v":{"$error":"#REF!"}},{"$f":"IF(B114=\"\",\"\",INDIRECT(\"'\"&B114&\"'!$X$120\"))","v":{"$error":"#REF!"}},{"$f":"IF(B114=\"\",\"\",INDIRECT(\"'\"&B114&\"'!$Z$120\"))","v":{"$error":"#REF!"}},{"$f":"IF(B114=\"\",\"\",INDIRECT(\"'\"&B114&\"'!$AA$120\"))","v":{"$error":"#REF!"}},{"$error":"#REF!"}]
[{"$nulls":4},{"$f":"IF(B114=\"\",\"\",INDIRECT(\"'\"&B114&\"'!$A$122\"))","v":{"$error":"#REF!"}},{"$f":"IF(B114=\"\",\"\",INDIRECT(\"'\"&B114&\"'!$K$129\"))","v":{"$error":"#REF!"}},{"$f":"IF(B114=\"\",\"\",INDIRECT(\"'\"&B114&\"'!$L$129\"))","v":{"$error":"#REF!"}},{"$f":"IF(B114=\"\",\"\",INDIRECT(\"'\"&B114&\"'!$H$129\"))","v":{"$error":"#REF!"}},{"$f":"IF(B114=\"\",\"\",INDIRECT(\"'\"&B114&\"'!$I$129\"))","v":{"$error":"#REF!"}},{"$f":"IF(B114=\"\",\"\",INDIRECT(\"'\"&B114&\"'!$R$129\"))","v":{"$error":"#REF!"}},{"$f":"IF(B114=\"\",\"\",INDIRECT(\"'\"&B114&\"'!$U$129\"))","v":{"$error":"#REF!"}},{"$f":"IF(B114=\"\",\"\",INDIRECT(\"'\"&B114&\"'!$X$129\"))","v":{"$error":"#REF!"}},{"$f":"IF(B114=\"\",\"\",INDIRECT(\"'\"&B114&\"'!$Z$129\"))","v":{"$error":"#REF!"}},{"$f":"IF(B114=\"\",\"\",INDIRECT(\"'\"&B114&\"'!$AA$129\"))","v":{"$error":"#REF!"}},{"$error":"#REF!"}]
[{"$nulls":4},{"$f":"IF(B114=\"\",\"\",INDIRECT(\"'\"&B114&\"'!$A$131\"))","v":{"$error":"#REF!"}},{"$f":"IF(B114=\"\",\"\",INDIRECT(\"'\"&B114&\"'!$K$167\"))","v":{"$error":"#REF!"}},{"$f":"IF(B114=\"\",\"\",INDIRECT(\"'\"&B114&\"'!$L$167\"))","v":{"$error":"#REF!"}},{"$f":"IF(B114=\"\",\"\",INDIRECT(\"'\"&B114&\"'!$H$167\"))","v":{"$error":"#REF!"}},{"$f":"IF(B114=\"\",\"\",INDIRECT(\"'\"&B114&\"'!$I$167\"))","v":{"$error":"#REF!"}},{"$f":"IF(B114=\"\",\"\",INDIRECT(\"'\"&B114&\"'!$R$167\"))","v":{"$error":"#REF!"}},{"$f":"IF(B114=\"\",\"\",INDIRECT(\"'\"&B114&\"'!$U$167\"))","v":{"$error":"#REF!"}},{"$f":"IF(B114=\"\",\"\",INDIRECT(\"'\"&B114&\"'!$X$167\"))","v":{"$error":"#REF!"}},{"$f":"IF(B114=\"\",\"\",INDIRECT(\"'\"&B114&\"'!$Z$167\"))","v":{"$error":"#REF!"}},{"$f":"IF(B114=\"\",\"\",INDIRECT(\"'\"&B114&\"'!$AA$167\"))","v":{"$error":"#REF!"}},{"$error":"#REF!"}]
[null,{"$f":"MID(INDEX(nom_feuilles,ROW(Masque!K19)),SEARCH(\"]\",INDEX(nom_feuilles,ROW(Masque!K19)))+1,30)","v":{"$error":"#REF!"}},{"$f":"IF(B122=\"\",\"\",INDIRECT(\"'\"&B122&\"'!$A$1\"))","v":{"$error":"#REF!"}},{"$f":"IF(B122=\"\",\"\",INDIRECT(\"'\"&B122&\"'!$A$2\"))","v":{"$error":"#REF!"}},{"$f":"IF(B122=\"\",\"\",INDIRECT(\"'\"&B122&\"'!$A$8\"))","v":{"$error":"#REF!"}},{"$f":"IF(B122=\"\",\"\",INDIRECT(\"'\"&B122&\"'!$K$30\"))","v":{"$error":"#REF!"}},{"$f":"IF(B122=\"\",\"\",INDIRECT(\"'\"&B122&\"'!$L$30\"))","v":{"$error":"#REF!"}},{"$f":"IF(B122=\"\",\"\",INDIRECT(\"'\"&B122&\"'!$H$30\"))","v":{"$error":"#REF!"}},{"$f":"IF(B122=\"\",\"\",INDIRECT(\"'\"&B122&\"'!$I$30\"))","v":{"$error":"#REF!"}},{"$f":"IF(B122=\"\",\"\",INDIRECT(\"'\"&B122&\"'!$R$30\"))","v":{"$error":"#REF!"}},{"$f":"IF(B122=\"\",\"\",INDIRECT(\"'\"&B122&\"'!$U$30\"))","v":{"$error":"#REF!"}},{"$f":"IF(B122=\"\",\"\",INDIRECT(\"'\"&B122&\"'!$X$30\"))","v":{"$error":"#REF!"}},{"$f":"IF(B122=\"\",\"\",INDIRECT(\"'\"&B122&\"'!$Z$30\"))","v":{"$error":"#REF!"}},{"$f":"IF(B122=\"\",\"\",INDIRECT(\"'\"&B122&\"'!$AA$30\"))","v":{"$error":"#REF!"}},{"$f":"SUM(F122:N122)","v":{"$error":"#REF!"}},{"$f":"SUM(O122:O129)","v":{"$error":"#REF!"}},{"$f":"IF(B122=\"\",\"\",INDIRECT(\"'\"&B122&\"'!$H$4\"))","v":{"$error":"#REF!"}},{"$f":"P122-Q122","v":{"$error":"#REF!"}}]
[{"$nulls":4},{"$f":"IF(B122=\"\",\"\",INDIRECT(\"'\"&B122&\"'!$A$32\"))","v":{"$error":"#REF!"}},{"$f":"IF(B122=\"\",\"\",INDIRECT(\"'\"&B122&\"'!$K$54\"))","v":{"$error":"#REF!"}},{"$f":"IF(B122=\"\",\"\",INDIRECT(\"'\"&B122&\"'!$L$54\"))","v":{"$error":"#REF!"}},{"$f":"IF(B122=\"\",\"\",INDIRECT(\"'\"&B122&\"'!$H$54\"))","v":{"$error":"#REF!"}},{"$f":"IF(B122=\"\",\"\",INDIRECT(\"'\"&B122&\"'!$I$54\"))","v":{"$error":"#REF!"}},{"$f":"IF(B122=\"\",\"\",INDIRECT(\"'\"&B122&\"'!$R$54\"))","v":{"$error":"#REF!"}},{"$f":"IF(B122=\"\",\"\",INDIRECT(\"'\"&B122&\"'!$U$54\"))","v":{"$error":"#REF!"}},{"$f":"IF(B122=\"\",\"\",INDIRECT(\"'\"&B122&\"'!$X$54\"))","v":{"$error":"#REF!"}},{"$f":"IF(B122=\"\",\"\",INDIRECT(\"'\"&B122&\"'!$Z$54\"))","v":{"$error":"#REF!"}},{"$f":"IF(B122=\"\",\"\",INDIRECT(\"'\"&B122&\"'!$AA$54\"))","v":{"$error":"#REF!"}},{"$f":"SUM(F123:N123)","v":{"$error":"#REF!"}}]
[{"$nulls":4},{"$f":"IF(B122=\"\",\"\",INDIRECT(\"'\"&B122&\"'!$A$56\"))","v":{"$error":"#REF!"}},{"$f":"IF(B122=\"\",\"\",INDIRECT(\"'\"&B122&\"'!$K$78\"))","v":{"$error":"#REF!"}},{"$f":"IF(B122=\"\",\"\",INDIRECT(\"'\"&B122&\"'!$L$78\"))","v":{"$error":"#REF!"}},{"$f":"IF(B122=\"\",\"\",INDIRECT(\"'\"&B122&\"'!$H$78\"))","v":{"$error":"#REF!"}},{"$f":"IF(B122=\"\",\"\",INDIRECT(\"'\"&B122&\"'!$I$78\"))","v":{"$error":"#REF!"}},{"$f":"IF(B122=\"\",\"\",INDIRECT(\"'\"&B122&\"'!$R$78\"))","v":{"$error":"#REF!"}},{"$f":"IF(B122=\"\",\"\",INDIRECT(\"'\"&B122&\"'!$U$78\"))","v":{"$error":"#REF!"}},{"$f":"IF(B122=\"\",\"\",INDIRECT(\"'\"&B122&\"'!$X$78\"))","v":{"$error":"#REF!"}},{"$f":"IF(B122=\"\",\"\",INDIRECT(\"'\"&B122&\"'!$Z$78\"))","v":{"$error":"#REF!"}},{"$f":"IF(B122=\"\",\"\",INDIRECT(\"'\"&B122&\"'!$AA$78\"))","v":{"$error":"#REF!"}},{"$f":"SUM(F124:N124)","v":{"$error":"#REF!"}}]
[{"$nulls":4},{"$f":"IF(B122=\"\",\"\",INDIRECT(\"'\"&B122&\"'!$A$80\"))","v":{"$error":"#REF!"}},{"$f":"IF(B122=\"\",\"\",INDIRECT(\"'\"&B122&\"'!$K$102\"))","v":{"$error":"#REF!"}},{"$f":"IF(B122=\"\",\"\",INDIRECT(\"'\"&B122&\"'!$L$102\"))","v":{"$error":"#REF!"}},{"$f":"IF(B122=\"\",\"\",INDIRECT(\"'\"&B122&\"'!$H$102\"))","v":{"$error":"#REF!"}},{"$f":"IF(B122=\"\",\"\",INDIRECT(\"'\"&B122&\"'!$I$102\"))","v":{"$error":"#REF!"}},{"$f":"IF(B122=\"\",\"\",INDIRECT(\"'\"&B122&\"'!$R$102\"))","v":{"$error":"#REF!"}},{"$f":"IF(B122=\"\",\"\",INDIRECT(\"'\"&B122&\"'!$U$102\"))","v":{"$error":"#REF!"}},{"$f":"IF(B122=\"\",\"\",INDIRECT(\"'\"&B122&\"'!$X$102\"))","v":{"$error":"#REF!"}},{"$f":"IF(B122=\"\",\"\",INDIRECT(\"'\"&B122&\"'!$Z$102\"))","v":{"$error":"#REF!"}},{"$f":"IF(B122=\"\",\"\",INDIRECT(\"'\"&B122&\"'!$AA$102\"))","v":{"$error":"#REF!"}},{"$error":"#REF!"}]
[{"$nulls":4},{"$f":"IF(B122=\"\",\"\",INDIRECT(\"'\"&B122&\"'!$A$104\"))","v":{"$error":"#REF!"}},{"$f":"IF(B122=\"\",\"\",INDIRECT(\"'\"&B122&\"'!$K$111\"))","v":{"$error":"#REF!"}},{"$f":"IF(B122=\"\",\"\",INDIRECT(\"'\"&B122&\"'!$L$111\"))","v":{"$error":"#REF!"}},{"$f":"IF(B122=\"\",\"\",INDIRECT(\"'\"&B122&\"'!$H$111\"))","v":{"$error":"#REF!"}},{"$f":"IF(B122=\"\",\"\",INDIRECT(\"'\"&B122&\"'!$I$111\"))","v":{"$error":"#REF!"}},{"$f":"IF(B122=\"\",\"\",INDIRECT(\"'\"&B122&\"'!$R$111\"))","v":{"$error":"#REF!"}},{"$f":"IF(B122=\"\",\"\",INDIRECT(\"'\"&B122&\"'!$U$111\"))","v":{"$error":"#REF!"}},{"$f":"IF(B122=\"\",\"\",INDIRECT(\"'\"&B122&\"'!$X$111\"))","v":{"$error":"#REF!"}},{"$f":"IF(B122=\"\",\"\",INDIRECT(\"'\"&B122&\"'!$Z$111\"))","v":{"$error":"#REF!"}},{"$f":"IF(B122=\"\",\"\",INDIRECT(\"'\"&B122&\"'!$AA$111\"))","v":{"$error":"#REF!"}},{"$error":"#REF!"}]
[{"$nulls":4},{"$f":"IF(B122=\"\",\"\",INDIRECT(\"'\"&B122&\"'!$A$113\"))","v":{"$error":"#REF!"}},{"$f":"IF(B122=\"\",\"\",INDIRECT(\"'\"&B122&\"'!$K$120\"))","v":{"$error":"#REF!"}},{"$f":"IF(B122=\"\",\"\",INDIRECT(\"'\"&B122&\"'!$L$120\"))","v":{"$error":"#REF!"}},{"$f":"IF(B122=\"\",\"\",INDIRECT(\"'\"&B122&\"'!$H$120\"))","v":{"$error":"#REF!"}},{"$f":"IF(B122=\"\",\"\",INDIRECT(\"'\"&B122&\"'!$I$120\"))","v":{"$error":"#REF!"}},{"$f":"IF(B122=\"\",\"\",INDIRECT(\"'\"&B122&\"'!$R$120\"))","v":{"$error":"#REF!"}},{"$f":"IF(B122=\"\",\"\",INDIRECT(\"'\"&B122&\"'!$U$120\"))","v":{"$error":"#REF!"}},{"$f":"IF(B122=\"\",\"\",INDIRECT(\"'\"&B122&\"'!$X$120\"))","v":{"$error":"#REF!"}},{"$f":"IF(B122=\"\",\"\",INDIRECT(\"'\"&B122&\"'!$Z$120\"))","v":{"$error":"#REF!"}},{"$f":"IF(B122=\"\",\"\",INDIRECT(\"'\"&B122&\"'!$AA$120\"))","v":{"$error":"#REF!"}},{"$error":"#REF!"}]
[{"$nulls":4},{"$f":"IF(B122=\"\",\"\",INDIRECT(\"'\"&B122&\"'!$A$122\"))","v":{"$error":"#REF!"}},{"$f":"IF(B122=\"\",\"\",INDIRECT(\"'\"&B122&\"'!$K$129\"))","v":{"$error":"#REF!"}},{"$f":"IF(B122=\"\",\"\",INDIRECT(\"'\"&B122&\"'!$L$129\"))","v":{"$error":"#REF!"}},{"$f":"IF(B122=\"\",\"\",INDIRECT(\"'\"&B122&\"'!$H$129\"))","v":{"$error":"#REF!"}},{"$f":"IF(B122=\"\",\"\",INDIRECT(\"'\"&B122&\"'!$I$129\"))","v":{"$error":"#REF!"}},{"$f":"IF(B122=\"\",\"\",INDIRECT(\"'\"&B122&\"'!$R$129\"))","v":{"$error":"#REF!"}},{"$f":"IF(B122=\"\",\"\",INDIRECT(\"'\"&B122&\"'!$U$129\"))","v":{"$error":"#REF!"}},{"$f":"IF(B122=\"\",\"\",INDIRECT(\"'\"&B122&\"'!$X$129\"))","v":{"$error":"#REF!"}},{"$f":"IF(B122=\"\",\"\",INDIRECT(\"'\"&B122&\"'!$Z$129\"))","v":{"$error":"#REF!"}},{"$f":"IF(B122=\"\",\"\",INDIRECT(\"'\"&B122&\"'!$AA$129\"))","v":{"$error":"#REF!"}},{"$error":"#REF!"}]
[{"$nulls":4},{"$f":"IF(B122=\"\",\"\",INDIRECT(\"'\"&B122&\"'!$A$131\"))","v":{"$error":"#REF!"}},{"$f":"IF(B122=\"\",\"\",INDIRECT(\"'\"&B122&\"'!$K$167\"))","v":{"$error":"#REF!"}},{"$f":"IF(B122=\"\",\"\",INDIRECT(\"'\"&B122&\"'!$L$167\"))","v":{"$error":"#REF!"}},{"$f":"IF(B122=\"\",\"\",INDIRECT(\"'\"&B122&\"'!$H$167\"))","v":{"$error":"#REF!"}},{"$f":"IF(B122=\"\",\"\",INDIRECT(\"'\"&B122&\"'!$I$167\"))","v":{"$error":"#REF!"}},{"$f":"IF(B122=\"\",\"\",INDIRECT(\"'\"&B122&\"'!$R$167\"))","v":{"$error":"#REF!"}},{"$f":"IF(B122=\"\",\"\",INDIRECT(\"'\"&B122&\"'!$U$167\"))","v":{"$error":"#REF!"}},{"$f":"IF(B122=\"\",\"\",INDIRECT(\"'\"&B122&\"'!$X$167\"))","v":{"$error":"#REF!"}},{"$f":"IF(B122=\"\",\"\",INDIRECT(\"'\"&B122&\"'!$Z$167\"))","v":{"$error":"#REF!"}},{"$f":"IF(B122=\"\",\"\",INDIRECT(\"'\"&B122&\"'!$AA$167\"))","v":{"$error":"#REF!"}},{"$error":"#REF!"}]
[null,{"$f":"MID(INDEX(nom_feuilles,ROW(Masque!K20)),SEARCH(\"]\",INDEX(nom_feuilles,ROW(Masque!K20)))+1,30)","v":{"$error":"#REF!"}},{"$f":"IF(B130=\"\",\"\",INDIRECT(\"'\"&B130&\"'!$A$1\"))","v":{"$error":"#REF!"}},{"$f":"IF(B130=\"\",\"\",INDIRECT(\"'\"&B130&\"'!$A$2\"))","v":{"$error":"#REF!"}},{"$f":"IF(B130=\"\",\"\",INDIRECT(\"'\"&B130&\"'!$A$8\"))","v":{"$error":"#REF!"}},{"$f":"IF(B130=\"\",\"\",INDIRECT(\"'\"&B130&\"'!$K$30\"))","v":{"$error":"#REF!"}},{"$f":"IF(B130=\"\",\"\",INDIRECT(\"'\"&B130&\"'!$L$30\"))","v":{"$error":"#REF!"}},{"$f":"IF(B130=\"\",\"\",INDIRECT(\"'\"&B130&\"'!$H$30\"))","v":{"$error":"#REF!"}},{"$f":"IF(B130=\"\",\"\",INDIRECT(\"'\"&B130&\"'!$I$30\"))","v":{"$error":"#REF!"}},{"$f":"IF(B130=\"\",\"\",INDIRECT(\"'\"&B130&\"'!$R$30\"))","v":{"$error":"#REF!"}},{"$f":"IF(B130=\"\",\"\",INDIRECT(\"'\"&B130&\"'!$U$30\"))","v":{"$error":"#REF!"}},{"$f":"IF(B130=\"\",\"\",INDIRECT(\"'\"&B130&\"'!$X$30\"))","v":{"$error":"#REF!"}},{"$f":"IF(B130=\"\",\"\",INDIRECT(\"'\"&B130&\"'!$Z$30\"))","v":{"$error":"#REF!"}},{"$f":"IF(B130=\"\",\"\",INDIRECT(\"'\"&B130&\"'!$AA$30\"))","v":{"$error":"#REF!"}},{"$f":"SUM(F130:N130)","v":{"$error":"#REF!"}},{"$f":"SUM(O130:O137)","v":{"$error":"#REF!"}},{"$f":"IF(B130=\"\",\"\",INDIRECT(\"'\"&B130&\"'!$H$4\"))","v":{"$error":"#REF!"}},{"$f":"P130-Q130","v":{"$error":"#REF!"}}]
[{"$nulls":4},{"$f":"IF(B130=\"\",\"\",INDIRECT(\"'\"&B130&\"'!$A$32\"))","v":{"$error":"#REF!"}},{"$f":"IF(B130=\"\",\"\",INDIRECT(\"'\"&B130&\"'!$K$54\"))","v":{"$error":"#REF!"}},{"$f":"IF(B130=\"\",\"\",INDIRECT(\"'\"&B130&\"'!$L$54\"))","v":{"$error":"#REF!"}},{"$f":"IF(B130=\"\",\"\",INDIRECT(\"'\"&B130&\"'!$H$54\"))","v":{"$error":"#REF!"}},{"$f":"IF(B130=\"\",\"\",INDIRECT(\"'\"&B130&\"'!$I$54\"))","v":{"$error":"#REF!"}},{"$f":"IF(B130=\"\",\"\",INDIRECT(\"'\"&B130&\"'!$R$54\"))","v":{"$error":"#REF!"}},{"$f":"IF(B130=\"\",\"\",INDIRECT(\"'\"&B130&\"'!$U$54\"))","v":{"$error":"#REF!"}},{"$f":"IF(B130=\"\",\"\",INDIRECT(\"'\"&B130&\"'!$X$54\"))","v":{"$error":"#REF!"}},{"$f":"IF(B130=\"\",\"\",INDIRECT(\"'\"&B130&\"'!$Z$54\"))","v":{"$error":"#REF!"}},{"$f":"IF(B130=\"\",\"\",INDIRECT(\"'\"&B130&\"'!$AA$54\"))","v":{"$error":"#REF!"}},{"$f":"SUM(F131:N131)","v":{"$error":"#REF!"}}]
[{"$nulls":4},{"$f":"IF(B130=\"\",\"\",INDIRECT(\"'\"&B130&\"'!$A$56\"))","v":{"$error":"#REF!"}},{"$f":"IF(B130=\"\",\"\",INDIRECT(\"'\"&B130&\"'!$K$78\"))","v":{"$error":"#REF!"}},{"$f":"IF(B130=\"\",\"\",INDIRECT(\"'\"&B130&\"'!$L$78\"))","v":{"$error":"#REF!"}},{"$f":"IF(B130=\"\",\"\",INDIRECT(\"'\"&B130&\"'!$H$78\"))","v":{"$error":"#REF!"}},{"$f":"IF(B130=\"\",\"\",INDIRECT(\"'\"&B130&\"'!$I$78\"))","v":{"$error":"#REF!"}},{"$f":"IF(B130=\"\",\"\",INDIRECT(\"'\"&B130&\"'!$R$78\"))","v":{"$error":"#REF!"}},{"$f":"IF(B130=\"\",\"\",INDIRECT(\"'\"&B130&\"'!$U$78\"))","v":{"$error":"#REF!"}},{"$f":"IF(B130=\"\",\"\",INDIRECT(\"'\"&B130&\"'!$X$78\"))","v":{"$error":"#REF!"}},{"$f":"IF(B130=\"\",\"\",INDIRECT(\"'\"&B130&\"'!$Z$78\"))","v":{"$error":"#REF!"}},{"$f":"IF(B130=\"\",\"\",INDIRECT(\"'\"&B130&\"'!$AA$78\"))","v":{"$error":"#REF!"}},{"$f":"SUM(F132:N132)","v":{"$error":"#REF!"}}]
[{"$nulls":4},{"$f":"IF(B130=\"\",\"\",INDIRECT(\"'\"&B130&\"'!$A$80\"))","v":{"$error":"#REF!"}},{"$f":"IF(B130=\"\",\"\",INDIRECT(\"'\"&B130&\"'!$K$102\"))","v":{"$error":"#REF!"}},{"$f":"IF(B130=\"\",\"\",INDIRECT(\"'\"&B130&\"'!$L$102\"))","v":{"$error":"#REF!"}},{"$f":"IF(B130=\"\",\"\",INDIRECT(\"'\"&B130&\"'!$H$102\"))","v":{"$error":"#REF!"}},{"$f":"IF(B130=\"\",\"\",INDIRECT(\"'\"&B130&\"'!$I$102\"))","v":{"$error":"#REF!"}},{"$f":"IF(B130=\"\",\"\",INDIRECT(\"'\"&B130&\"'!$R$102\"))","v":{"$error":"#REF!"}},{"$f":"IF(B130=\"\",\"\",INDIRECT(\"'\"&B130&\"'!$U$102\"))","v":{"$error":"#REF!"}},{"$f":"IF(B130=\"\",\"\",INDIRECT(\"'\"&B130&\"'!$X$102\"))","v":{"$error":"#REF!"}},{"$f":"IF(B130=\"\",\"\",INDIRECT(\"'\"&B130&\"'!$Z$102\"))","v":{"$error":"#REF!"}},{"$f":"IF(B130=\"\",\"\",INDIRECT(\"'\"&B130&\"'!$AA$102\"))","v":{"$error":"#REF!"}},{"$error":"#REF!"}]
[{"$nulls":4},{"$f":"IF(B130=\"\",\"\",INDIRECT(\"'\"&B130&\"'!$A$104\"))","v":{"$error":"#REF!"}},{"$f":"IF(B130=\"\",\"\",INDIRECT(\"'\"&B130&\"'!$K$111\"))","v":{"$error":"#REF!"}},{"$f":"IF(B130=\"\",\"\",INDIRECT(\"'\"&B130&\"'!$L$111\"))","v":{"$error":"#REF!"}},{"$f":"IF(B130=\"\",\"\",INDIRECT(\"'\"&B130&\"'!$H$111\"))","v":{"$error":"#REF!"}},{"$f":"IF(B130=\"\",\"\",INDIRECT(\"'\"&B130&\"'!$I$111\"))","v":{"$error":"#REF!"}},{"$f":"IF(B130=\"\",\"\",INDIRECT(\"'\"&B130&\"'!$R$111\"))","v":{"$error":"#REF!"}},{"$f":"IF(B130=\"\",\"\",INDIRECT(\"'\"&B130&\"'!$U$111\"))","v":{"$error":"#REF!"}},{"$f":"IF(B130=\"\",\"\",INDIRECT(\"'\"&B130&\"'!$X$111\"))","v":{"$error":"#REF!"}},{"$f":"IF(B130=\"\",\"\",INDIRECT(\"'\"&B130&\"'!$Z$111\"))","v":{"$error":"#REF!"}},{"$f":"IF(B130=\"\",\"\",INDIRECT(\"'\"&B130&\"'!$AA$111\"))","v":{"$error":"#REF!"}},{"$error":"#REF!"}]
[{"$nulls":4},{"$f":"IF(B130=\"\",\"\",INDIRECT(\"'\"&B130&\"'!$A$113\"))","v":{"$error":"#REF!"}},{"$f":"IF(B130=\"\",\"\",INDIRECT(\"'\"&B130&\"'!$K$120\"))","v":{"$error":"#REF!"}},{"$f":"IF(B130=\"\",\"\",INDIRECT(\"'\"&B130&\"'!$L$120\"))","v":{"$error":"#REF!"}},{"$f":"IF(B130=\"\",\"\",INDIRECT(\"'\"&B130&\"'!$H$120\"))","v":{"$error":"#REF!"}},{"$f":"IF(B130=\"\",\"\",INDIRECT(\"'\"&B130&\"'!$I$120\"))","v":{"$error":"#REF!"}},{"$f":"IF(B130=\"\",\"\",INDIRECT(\"'\"&B130&\"'!$R$120\"))","v":{"$error":"#REF!"}},{"$f":"IF(B130=\"\",\"\",INDIRECT(\"'\"&B130&\"'!$U$120\"))","v":{"$error":"#REF!"}},{"$f":"IF(B130=\"\",\"\",INDIRECT(\"'\"&B130&\"'!$X$120\"))","v":{"$error":"#REF!"}},{"$f":"IF(B130=\"\",\"\",INDIRECT(\"'\"&B130&\"'!$Z$120\"))","v":{"$error":"#REF!"}},{"$f":"IF(B130=\"\",\"\",INDIRECT(\"'\"&B130&\"'!$AA$120\"))","v":{"$error":"#REF!"}},{"$error":"#REF!"}]
[{"$nulls":4},{"$f":"IF(B130=\"\",\"\",INDIRECT(\"'\"&B130&\"'!$A$122\"))","v":{"$error":"#REF!"}},{"$f":"IF(B130=\"\",\"\",INDIRECT(\"'\"&B130&\"'!$K$129\"))","v":{"$error":"#REF!"}},{"$f":"IF(B130=\"\",\"\",INDIRECT(\"'\"&B130&\"'!$L$129\"))","v":{"$error":"#REF!"}},{"$f":"IF(B130=\"\",\"\",INDIRECT(\"'\"&B130&\"'!$H$129\"))","v":{"$error":"#REF!"}},{"$f":"IF(B130=\"\",\"\",INDIRECT(\"'\"&B130&\"'!$I$129\"))","v":{"$error":"#REF!"}},{"$f":"IF(B130=\"\",\"\",INDIRECT(\"'\"&B130&\"'!$R$129\"))","v":{"$error":"#REF!"}},{"$f":"IF(B130=\"\",\"\",INDIRECT(\"'\"&B130&\"'!$U$129\"))","v":{"$error":"#REF!"}},{"$f":"IF(B130=\"\",\"\",INDIRECT(\"'\"&B130&\"'!$X$129\"))","v":{"$error":"#REF!"}},{"$f":"IF(B130=\"\",\"\",INDIRECT(\"'\"&B130&\"'!$Z$129\"))","v":{"$error":"#REF!"}},{"$f":"IF(B130=\"\",\"\",INDIRECT(\"'\"&B130&\"'!$AA$129\"))","v":{"$error":"#REF!"}},{"$error":"#REF!"}]
[{"$nulls":4},{"$f":"IF(B130=\"\",\"\",INDIRECT(\"'\"&B130&\"'!$A$131\"))","v":{"$error":"#REF!"}},{"$f":"IF(B130=\"\",\"\",INDIRECT(\"'\"&B130&\"'!$K$167\"))","v":{"$error":"#REF!"}},{"$f":"IF(B130=\"\",\"\",INDIRECT(\"'\"&B130&\"'!$L$167\"))","v":{"$error":"#REF!"}},{"$f":"IF(B130=\"\",\"\",INDIRECT(\"'\"&B130&\"'!$H$167\"))","v":{"$error":"#REF!"}},{"$f":"IF(B130=\"\",\"\",INDIRECT(\"'\"&B130&\"'!$I$167\"))","v":{"$error":"#REF!"}},{"$f":"IF(B130=\"\",\"\",INDIRECT(\"'\"&B130&\"'!$R$167\"))","v":{"$error":"#REF!"}},{"$f":"IF(B130=\"\",\"\",INDIRECT(\"'\"&B130&\"'!$U$167\"))","v":{"$error":"#REF!"}},{"$f":"IF(B130=\"\",\"\",INDIRECT(\"'\"&B130&\"'!$X$167\"))","v":{"$error":"#REF!"}},{"$f":"IF(B130=\"\",\"\",INDIRECT(\"'\"&B130&\"'!$Z$167\"))","v":{"$error":"#REF!"}},{"$f":"IF(B130=\"\",\"\",INDIRECT(\"'\"&B130&\"'!$AA$167\"))","v":{"$error":"#REF!"}},{"$error":"#REF!"}]
[null,{"$f":"MID(INDEX(nom_feuilles,ROW(Masque!K21)),SEARCH(\"]\",INDEX(nom_feuilles,ROW(Masque!K21)))+1,30)","v":{"$error":"#REF!"}},{"$f":"IF(B138=\"\",\"\",INDIRECT(\"'\"&B138&\"'!$A$1\"))","v":{"$error":"#REF!"}},{"$f":"IF(B138=\"\",\"\",INDIRECT(\"'\"&B138&\"'!$A$2\"))","v":{"$error":"#REF!"}},{"$f":"IF(B138=\"\",\"\",INDIRECT(\"'\"&B138&\"'!$A$8\"))","v":{"$error":"#REF!"}},{"$f":"IF(B138=\"\",\"\",INDIRECT(\"'\"&B138&\"'!$K$30\"))","v":{"$error":"#REF!"}},{"$f":"IF(B138=\"\",\"\",INDIRECT(\"'\"&B138&\"'!$L$30\"))","v":{"$error":"#REF!"}},{"$f":"IF(B138=\"\",\"\",INDIRECT(\"'\"&B138&\"'!$H$30\"))","v":{"$error":"#REF!"}},{"$f":"IF(B138=\"\",\"\",INDIRECT(\"'\"&B138&\"'!$I$30\"))","v":{"$error":"#REF!"}},{"$f":"IF(B138=\"\",\"\",INDIRECT(\"'\"&B138&\"'!$R$30\"))","v":{"$error":"#REF!"}},{"$f":"IF(B138=\"\",\"\",INDIRECT(\"'\"&B138&\"'!$U$30\"))","v":{"$error":"#REF!"}},{"$f":"IF(B138=\"\",\"\",INDIRECT(\"'\"&B138&\"'!$X$30\"))","v":{"$error":"#REF!"}},{"$f":"IF(B138=\"\",\"\",INDIRECT(\"'\"&B138&\"'!$Z$30\"))","v":{"$error":"#REF!"}},{"$f":"IF(B138=\"\",\"\",INDIRECT(\"'\"&B138&\"'!$AA$30\"))","v":{"$error":"#REF!"}},{"$f":"SUM(F138:N138)","v":{"$error":"#REF!"}},{"$f":"SUM(O138:O145)","v":{"$error":"#REF!"}},{"$f":"IF(B138=\"\",\"\",INDIRECT(\"'\"&B138&\"'!$H$4\"))","v":{"$error":"#REF!"}},{"$f":"P138-Q138","v":{"$error":"#REF!"}}]
[{"$nulls":4},{"$f":"IF(B138=\"\",\"\",INDIRECT(\"'\"&B138&\"'!$A$32\"))","v":{"$error":"#REF!"}},{"$f":"IF(B138=\"\",\"\",INDIRECT(\"'\"&B138&\"'!$K$54\"))","v":{"$error":"#REF!"}},{"$f":"IF(B138=\"\",\"\",INDIRECT(\"'\"&B138&\"'!$L$54\"))","v":{"$error":"#REF!"}},{"$f":"IF(B138=\"\",\"\",INDIRECT(\"'\"&B138&\"'!$H$54\"))","v":{"$error":"#REF!"}},{"$f":"IF(B138=\"\",\"\",INDIRECT(\"'\"&B138&\"'!$I$54\"))","v":{"$error":"#REF!"}},{"$f":"IF(B138=\"\",\"\",INDIRECT(\"'\"&B138&\"'!$R$54\"))","v":{"$error":"#REF!"}},{"$f":"IF(B138=\"\",\"\",INDIRECT(\"'\"&B138&\"'!$U$54\"))","v":{"$error":"#REF!"}},{"$f":"IF(B138=\"\",\"\",INDIRECT(\"'\"&B138&\"'!$X$54\"))","v":{"$error":"#REF!"}},{"$f":"IF(B138=\"\",\"\",INDIRECT(\"'\"&B138&\"'!$Z$54\"))","v":{"$error":"#REF!"}},{"$f":"IF(B138=\"\",\"\",INDIRECT(\"'\"&B138&\"'!$AA$54\"))","v":{"$error":"#REF!"}},{"$f":"SUM(F139:N139)","v":{"$error":"#REF!"}}]
[{"$nulls":4},{"$f":"IF(B138=\"\",\"\",INDIRECT(\"'\"&B138&\"'!$A$56\"))","v":{"$error":"#REF!"}},{"$f":"IF(B138=\"\",\"\",INDIRECT(\"'\"&B138&\"'!$K$78\"))","v":{"$error":"#REF!"}},{"$f":"IF(B138=\"\",\"\",INDIRECT(\"'\"&B138&\"'!$L$78\"))","v":{"$error":"#REF!"}},{"$f":"IF(B138=\"\",\"\",INDIRECT(\"'\"&B138&\"'!$H$78\"))","v":{"$error":"#REF!"}},{"$f":"IF(B138=\"\",\"\",INDIRECT(\"'\"&B138&\"'!$I$78\"))","v":{"$error":"#REF!"}},{"$f":"IF(B138=\"\",\"\",INDIRECT(\"'\"&B138&\"'!$R$78\"))","v":{"$error":"#REF!"}},{"$f":"IF(B138=\"\",\"\",INDIRECT(\"'\"&B138&\"'!$U$78\"))","v":{"$error":"#REF!"}},{"$f":"IF(B138=\"\",\"\",INDIRECT(\"'\"&B138&\"'!$X$78\"))","v":{"$error":"#REF!"}},{"$f":"IF(B138=\"\",\"\",INDIRECT(\"'\"&B138&\"'!$Z$78\"))","v":{"$error":"#REF!"}},{"$f":"IF(B138=\"\",\"\",INDIRECT(\"'\"&B138&\"'!$AA$78\"))","v":{"$error":"#REF!"}},{"$f":"SUM(F140:N140)","v":{"$error":"#REF!"}}]
[{"$nulls":4},{"$f":"IF(B138=\"\",\"\",INDIRECT(\"'\"&B138&\"'!$A$80\"))","v":{"$error":"#REF!"}},{"$f":"IF(B138=\"\",\"\",INDIRECT(\"'\"&B138&\"'!$K$102\"))","v":{"$error":"#REF!"}},{"$f":"IF(B138=\"\",\"\",INDIRECT(\"'\"&B138&\"'!$L$102\"))","v":{"$error":"#REF!"}},{"$f":"IF(B138=\"\",\"\",INDIRECT(\"'\"&B138&\"'!$H$102\"))","v":{"$error":"#REF!"}},{"$f":"IF(B138=\"\",\"\",INDIRECT(\"'\"&B138&\"'!$I$102\"))","v":{"$error":"#REF!"}},{"$f":"IF(B138=\"\",\"\",INDIRECT(\"'\"&B138&\"'!$R$102\"))","v":{"$error":"#REF!"}},{"$f":"IF(B138=\"\",\"\",INDIRECT(\"'\"&B138&\"'!$U$102\"))","v":{"$error":"#REF!"}},{"$f":"IF(B138=\"\",\"\",INDIRECT(\"'\"&B138&\"'!$X$102\"))","v":{"$error":"#REF!"}},{"$f":"IF(B138=\"\",\"\",INDIRECT(\"'\"&B138&\"'!$Z$102\"))","v":{"$error":"#REF!"}},{"$f":"IF(B138=\"\",\"\",INDIRECT(\"'\"&B138&\"'!$AA$102\"))","v":{"$error":"#REF!"}},{"$error":"#REF!"}]
[{"$nulls":4},{"$f":"IF(B138=\"\",\"\",INDIRECT(\"'\"&B138&\"'!$A$104\"))","v":{"$error":"#REF!"}},{"$f":"IF(B138=\"\",\"\",INDIRECT(\"'\"&B138&\"'!$K$111\"))","v":{"$error":"#REF!"}},{"$f":"IF(B138=\"\",\"\",INDIRECT(\"'\"&B138&\"'!$L$111\"))","v":{"$error":"#REF!"}},{"$f":"IF(B138=\"\",\"\",INDIRECT(\"'\"&B138&\"'!$H$111\"))","v":{"$error":"#REF!"}},{"$f":"IF(B138=\"\",\"\",INDIRECT(\"'\"&B138&\"'!$I$111\"))","v":{"$error":"#REF!"}},{"$f":"IF(B138=\"\",\"\",INDIRECT(\"'\"&B138&\"'!$R$111\"))","v":{"$error":"#REF!"}},{"$f":"IF(B138=\"\",\"\",INDIRECT(\"'\"&B138&\"'!$U$111\"))","v":{"$error":"#REF!"}},{"$f":"IF(B138=\"\",\"\",INDIRECT(\"'\"&B138&\"'!$X$111\"))","v":{"$error":"#REF!"}},{"$f":"IF(B138=\"\",\"\",INDIRECT(\"'\"&B138&\"'!$Z$111\"))","v":{"$error":"#REF!"}},{"$f":"IF(B138=\"\",\"\",INDIRECT(\"'\"&B138&\"'!$AA$111\"))","v":{"$error":"#REF!"}},{"$error":"#REF!"}]
[{"$nulls":4},{"$f":"IF(B138=\"\",\"\",INDIRECT(\"'\"&B138&\"'!$A$113\"))","v":{"$error":"#REF!"}},{"$f":"IF(B138=\"\",\"\",INDIRECT(\"'\"&B138&\"'!$K$120\"))","v":{"$error":"#REF!"}},{"$f":"IF(B138=\"\",\"\",INDIRECT(\"'\"&B138&\"'!$L$120\"))","v":{"$error":"#REF!"}},{"$f":"IF(B138=\"\",\"\",INDIRECT(\"'\"&B138&\"'!$H$120\"))","v":{"$error":"#REF!"}},{"$f":"IF(B138=\"\",\"\",INDIRECT(\"'\"&B138&\"'!$I$120\"))","v":{"$error":"#REF!"}},{"$f":"IF(B138=\"\",\"\",INDIRECT(\"'\"&B138&\"'!$R$120\"))","v":{"$error":"#REF!"}},{"$f":"IF(B138=\"\",\"\",INDIRECT(\"'\"&B138&\"'!$U$120\"))","v":{"$error":"#REF!"}},{"$f":"IF(B138=\"\",\"\",INDIRECT(\"'\"&B138&\"'!$X$120\"))","v":{"$error":"#REF!"}},{"$f":"IF(B138=\"\",\"\",INDIRECT(\"'\"&B138&\"'!$Z$120\"))","v":{"$error":"#REF!"}},{"$f":"IF(B138=\"\",\"\",INDIRECT(\"'\"&B138&\"'!$AA$120\"))","v":{"$error":"#REF!"}},{"$error":"#REF!"}]
[{"$nulls":4},{"$f":"IF(B138=\"\",\"\",INDIRECT(\"'\"&B138&\"'!$A$122\"))","v":{"$error":"#REF!"}},{"$f":"IF(B138=\"\",\"\",INDIRECT(\"'\"&B138&\"'!$K$129\"))","v":{"$error":"#REF!"}},{"$f":"IF(B138=\"\",\"\",INDIRECT(\"'\"&B138&\"'!$L$129\"))","v":{"$error":"#REF!"}},{"$f":"IF(B138=\"\",\"\",INDIRECT(\"'\"&B138&\"'!$H$129\"))","v":{"$error":"#REF!"}},{"$f":"IF(B138=\"\",\"\",INDIRECT(\"'\"&B138&\"'!$I$129\"))","v":{"$error":"#REF!"}},{"$f":"IF(B138=\"\",\"\",INDIRECT(\"'\"&B138&\"'!$R$129\"))","v":{"$error":"#REF!"}},{"$f":"IF(B138=\"\",\"\",INDIRECT(\"'\"&B138&\"'!$U$129\"))","v":{"$error":"#REF!"}},{"$f":"IF(B138=\"\",\"\",INDIRECT(\"'\"&B138&\"'!$X$129\"))","v":{"$error":"#REF!"}},{"$f":"IF(B138=\"\",\"\",INDIRECT(\"'\"&B138&\"'!$Z$129\"))","v":{"$error":"#REF!"}},{"$f":"IF(B138=\"\",\"\",INDIRECT(\"'\"&B138&\"'!$AA$129\"))","v":{"$error":"#REF!"}},{"$error":"#REF!"}]
[{"$nulls":4},{"$f":"IF(B138=\"\",\"\",INDIRECT(\"'\"&B138&\"'!$A$131\"))","v":{"$error":"#REF!"}},{"$f":"IF(B138=\"\",\"\",INDIRECT(\"'\"&B138&\"'!$K$167\"))","v":{"$error":"#REF!"}},{"$f":"IF(B138=\"\",\"\",INDIRECT(\"'\"&B138&\"'!$L$167\"))","v":{"$error":"#REF!"}},{"$f":"IF(B138=\"\",\"\",INDIRECT(\"'\"&B138&\"'!$H$167\"))","v":{"$error":"#REF!"}},{"$f":"IF(B138=\"\",\"\",INDIRECT(\"'\"&B138&\"'!$I$167\"))","v":{"$error":"#REF!"}},{"$f":"IF(B138=\"\",\"\",INDIRECT(\"'\"&B138&\"'!$R$167\"))","v":{"$error":"#REF!"}},{"$f":"IF(B138=\"\",\"\",INDIRECT(\"'\"&B138&\"'!$U$167\"))","v":{"$error":"#REF!"}},{"$f":"IF(B138=\"\",\"\",INDIRECT(\"'\"&B138&\"'!$X$167\"))","v":{"$error":"#REF!"}},{"$f":"IF(B138=\"\",\"\",INDIRECT(\"'\"&B138&\"'!$Z$167\"))","v":{"$error":"#REF!"}},{"$f":"IF(B138=\"\",\"\",INDIRECT(\"'\"&B138&\"'!$AA$167\"))","v":{"$error":"#REF!"}},{"$error":"#REF!"}]
[null,{"$f":"MID(INDEX(nom_feuilles,ROW(Masque!K22)),SEARCH(\"]\",INDEX(nom_feuilles,ROW(Masque!K22)))+1,30)","v":{"$error":"#REF!"}},{"$f":"IF(B146=\"\",\"\",INDIRECT(\"'\"&B146&\"'!$A$1\"))","v":{"$error":"#REF!"}},{"$f":"IF(B146=\"\",\"\",INDIRECT(\"'\"&B146&\"'!$A$2\"))","v":{"$error":"#REF!"}},{"$f":"IF(B146=\"\",\"\",INDIRECT(\"'\"&B146&\"'!$A$8\"))","v":{"$error":"#REF!"}},{"$f":"IF(B146=\"\",\"\",INDIRECT(\"'\"&B146&\"'!$K$30\"))","v":{"$error":"#REF!"}},{"$f":"IF(B146=\"\",\"\",INDIRECT(\"'\"&B146&\"'!$L$30\"))","v":{"$error":"#REF!"}},{"$f":"IF(B146=\"\",\"\",INDIRECT(\"'\"&B146&\"'!$H$30\"))","v":{"$error":"#REF!"}},{"$f":"IF(B146=\"\",\"\",INDIRECT(\"'\"&B146&\"'!$I$30\"))","v":{"$error":"#REF!"}},{"$f":"IF(B146=\"\",\"\",INDIRECT(\"'\"&B146&\"'!$R$30\"))","v":{"$error":"#REF!"}},{"$f":"IF(B146=\"\",\"\",INDIRECT(\"'\"&B146&\"'!$U$30\"))","v":{"$error":"#REF!"}},{"$f":"IF(B146=\"\",\"\",INDIRECT(\"'\"&B146&\"'!$X$30\"))","v":{"$error":"#REF!"}},{"$f":"IF(B146=\"\",\"\",INDIRECT(\"'\"&B146&\"'!$Z$30\"))","v":{"$error":"#REF!"}},{"$f":"IF(B146=\"\",\"\",INDIRECT(\"'\"&B146&\"'!$AA$30\"))","v":{"$error":"#REF!"}},{"$error":"#REF!"},{"$f":"SUM(O146:O153)","v":{"$error":"#REF!"}},{"$f":"IF(B146=\"\",\"\",INDIRECT(\"'\"&B146&\"'!$H$4\"))","v":{"$error":"#REF!"}},{"$f":"P146-Q146","v":{"$error":"#REF!"}}]
[{"$nulls":4},{"$f":"IF(B146=\"\",\"\",INDIRECT(\"'\"&B146&\"'!$A$32\"))","v":{"$error":"#REF!"}},{"$f":"IF(B146=\"\",\"\",INDIRECT(\"'\"&B146&\"'!$K$54\"))","v":{"$error":"#REF!"}},{"$f":"IF(B146=\"\",\"\",INDIRECT(\"'\"&B146&\"'!$L$54\"))","v":{"$error":"#REF!"}},{"$f":"IF(B146=\"\",\"\",INDIRECT(\"'\"&B146&\"'!$H$54\"))","v":{"$error":"#REF!"}},{"$f":"IF(B146=\"\",\"\",INDIRECT(\"'\"&B146&\"'!$I$54\"))","v":{"$error":"#REF!"}},{"$f":"IF(B146=\"\",\"\",INDIRECT(\"'\"&B146&\"'!$R$54\"))","v":{"$error":"#REF!"}},{"$f":"IF(B146=\"\",\"\",INDIRECT(\"'\"&B146&\"'!$U$54\"))","v":{"$error":"#REF!"}},{"$f":"IF(B146=\"\",\"\",INDIRECT(\"'\"&B146&\"'!$X$54\"))","v":{"$error":"#REF!"}},{"$f":"IF(B146=\"\",\"\",INDIRECT(\"'\"&B146&\"'!$Z$54\"))","v":{"$error":"#REF!"}},{"$f":"IF(B146=\"\",\"\",INDIRECT(\"'\"&B146&\"'!$AA$54\"))","v":{"$error":"#REF!"}},{"$error":"#REF!"}]
[{"$nulls":4},{"$f":"IF(B146=\"\",\"\",INDIRECT(\"'\"&B146&\"'!$A$56\"))","v":{"$error":"#REF!"}},{"$f":"IF(B146=\"\",\"\",INDIRECT(\"'\"&B146&\"'!$K$78\"))","v":{"$error":"#REF!"}},{"$f":"IF(B146=\"\",\"\",INDIRECT(\"'\"&B146&\"'!$L$78\"))","v":{"$error":"#REF!"}},{"$f":"IF(B146=\"\",\"\",INDIRECT(\"'\"&B146&\"'!$H$78\"))","v":{"$error":"#REF!"}},{"$f":"IF(B146=\"\",\"\",INDIRECT(\"'\"&B146&\"'!$I$78\"))","v":{"$error":"#REF!"}},{"$f":"IF(B146=\"\",\"\",INDIRECT(\"'\"&B146&\"'!$R$78\"))","v":{"$error":"#REF!"}},{"$f":"IF(B146=\"\",\"\",INDIRECT(\"'\"&B146&\"'!$U$78\"))","v":{"$error":"#REF!"}},{"$f":"IF(B146=\"\",\"\",INDIRECT(\"'\"&B146&\"'!$X$78\"))","v":{"$error":"#REF!"}},{"$f":"IF(B146=\"\",\"\",INDIRECT(\"'\"&B146&\"'!$Z$78\"))","v":{"$error":"#REF!"}},{"$f":"IF(B146=\"\",\"\",INDIRECT(\"'\"&B146&\"'!$AA$78\"))","v":{"$error":"#REF!"}},{"$f":"SUM(F148:N148)","v":{"$error":"#REF!"}}]
[{"$nulls":4},{"$f":"IF(B146=\"\",\"\",INDIRECT(\"'\"&B146&\"'!$A$80\"))","v":{"$error":"#REF!"}},{"$f":"IF(B146=\"\",\"\",INDIRECT(\"'\"&B146&\"'!$K$102\"))","v":{"$error":"#REF!"}},{"$f":"IF(B146=\"\",\"\",INDIRECT(\"'\"&B146&\"'!$L$102\"))","v":{"$error":"#REF!"}},{"$f":"IF(B146=\"\",\"\",INDIRECT(\"'\"&B146&\"'!$H$102\"))","v":{"$error":"#REF!"}},{"$f":"IF(B146=\"\",\"\",INDIRECT(\"'\"&B146&\"'!$I$102\"))","v":{"$error":"#REF!"}},{"$f":"IF(B146=\"\",\"\",INDIRECT(\"'\"&B146&\"'!$R$102\"))","v":{"$error":"#REF!"}},{"$f":"IF(B146=\"\",\"\",INDIRECT(\"'\"&B146&\"'!$U$102\"))","v":{"$error":"#REF!"}},{"$f":"IF(B146=\"\",\"\",INDIRECT(\"'\"&B146&\"'!$X$102\"))","v":{"$error":"#REF!"}},{"$f":"IF(B146=\"\",\"\",INDIRECT(\"'\"&B146&\"'!$Z$102\"))","v":{"$error":"#REF!"}},{"$f":"IF(B146=\"\",\"\",INDIRECT(\"'\"&B146&\"'!$AA$102\"))","v":{"$error":"#REF!"}},{"$error":"#REF!"}]
[{"$nulls":4},{"$f":"IF(B146=\"\",\"\",INDIRECT(\"'\"&B146&\"'!$A$104\"))","v":{"$error":"#REF!"}},{"$f":"IF(B146=\"\",\"\",INDIRECT(\"'\"&B146&\"'!$K$111\"))","v":{"$error":"#REF!"}},{"$f":"IF(B146=\"\",\"\",INDIRECT(\"'\"&B146&\"'!$L$111\"))","v":{"$error":"#REF!"}},{"$f":"IF(B146=\"\",\"\",INDIRECT(\"'\"&B146&\"'!$H$111\"))","v":{"$error":"#REF!"}},{"$f":"IF(B146=\"\",\"\",INDIRECT(\"'\"&B146&\"'!$I$111\"))","v":{"$error":"#REF!"}},{"$f":"IF(B146=\"\",\"\",INDIRECT(\"'\"&B146&\"'!$R$111\"))","v":{"$error":"#REF!"}},{"$f":"IF(B146=\"\",\"\",INDIRECT(\"'\"&B146&\"'!$U$111\"))","v":{"$error":"#REF!"}},{"$f":"IF(B146=\"\",\"\",INDIRECT(\"'\"&B146&\"'!$X$111\"))","v":{"$error":"#REF!"}},{"$f":"IF(B146=\"\",\"\",INDIRECT(\"'\"&B146&\"'!$Z$111\"))","v":{"$error":"#REF!"}},{"$f":"IF(B146=\"\",\"\",INDIRECT(\"'\"&B146&\"'!$AA$111\"))","v":{"$error":"#REF!"}},{"$error":"#REF!"}]
[{"$nulls":4},{"$f":"IF(B146=\"\",\"\",INDIRECT(\"'\"&B146&\"'!$A$113\"))","v":{"$error":"#REF!"}},{"$f":"IF(B146=\"\",\"\",INDIRECT(\"'\"&B146&\"'!$K$120\"))","v":{"$error":"#REF!"}},{"$f":"IF(B146=\"\",\"\",INDIRECT(\"'\"&B146&\"'!$L$120\"))","v":{"$error":"#REF!"}},{"$f":"IF(B146=\"\",\"\",INDIRECT(\"'\"&B146&\"'!$H$120\"))","v":{"$error":"#REF!"}},{"$f":"IF(B146=\"\",\"\",INDIRECT(\"'\"&B146&\"'!$I$120\"))","v":{"$error":"#REF!"}},{"$f":"IF(B146=\"\",\"\",INDIRECT(\"'\"&B146&\"'!$R$120\"))","v":{"$error":"#REF!"}},{"$f":"IF(B146=\"\",\"\",INDIRECT(\"'\"&B146&\"'!$U$120\"))","v":{"$error":"#REF!"}},{"$f":"IF(B146=\"\",\"\",INDIRECT(\"'\"&B146&\"'!$X$120\"))","v":{"$error":"#REF!"}},{"$f":"IF(B146=\"\",\"\",INDIRECT(\"'\"&B146&\"'!$Z$120\"))","v":{"$error":"#REF!"}},{"$f":"IF(B146=\"\",\"\",INDIRECT(\"'\"&B146&\"'!$AA$120\"))","v":{"$error":"#REF!"}},{"$error":"#REF!"}]
[{"$nulls":4},{"$f":"IF(B146=\"\",\"\",INDIRECT(\"'\"&B146&\"'!$A$122\"))","v":{"$error":"#REF!"}},{"$f":"IF(B146=\"\",\"\",INDIRECT(\"'\"&B146&\"'!$K$129\"))","v":{"$error":"#REF!"}},{"$f":"IF(B146=\"\",\"\",INDIRECT(\"'\"&B146&\"'!$L$129\"))","v":{"$error":"#REF!"}},{"$f":"IF(B146=\"\",\"\",INDIRECT(\"'\"&B146&\"'!$H$129\"))","v":{"$error":"#REF!"}},{"$f":"IF(B146=\"\",\"\",INDIRECT(\"'\"&B146&\"'!$I$129\"))","v":{"$error":"#REF!"}},{"$f":"IF(B146=\"\",\"\",INDIRECT(\"'\"&B146&\"'!$R$129\"))","v":{"$error":"#REF!"}},{"$f":"IF(B146=\"\",\"\",INDIRECT(\"'\"&B146&\"'!$U$129\"))","v":{"$error":"#REF!"}},{"$f":"IF(B146=\"\",\"\",INDIRECT(\"'\"&B146&\"'!$X$129\"))","v":{"$error":"#REF!"}},{"$f":"IF(B146=\"\",\"\",INDIRECT(\"'\"&B146&\"'!$Z$129\"))","v":{"$error":"#REF!"}},{"$f":"IF(B146=\"\",\"\",INDIRECT(\"'\"&B146&\"'!$AA$129\"))","v":{"$error":"#REF!"}},{"$error":"#REF!"}]
[{"$nulls":4},{"$f":"IF(B146=\"\",\"\",INDIRECT(\"'\"&B146&\"'!$A$131\"))","v":{"$error":"#REF!"}},{"$f":"IF(B146=\"\",\"\",INDIRECT(\"'\"&B146&\"'!$K$167\"))","v":{"$error":"#REF!"}},{"$f":"IF(B146=\"\",\"\",INDIRECT(\"'\"&B146&\"'!$L$167\"))","v":{"$error":"#REF!"}},{"$f":"IF(B146=\"\",\"\",INDIRECT(\"'\"&B146&\"'!$H$167\"))","v":{"$error":"#REF!"}},{"$f":"IF(B146=\"\",\"\",INDIRECT(\"'\"&B146&\"'!$I$167\"))","v":{"$error":"#REF!"}},{"$f":"IF(B146=\"\",\"\",INDIRECT(\"'\"&B146&\"'!$R$167\"))","v":{"$error":"#REF!"}},{"$f":"IF(B146=\"\",\"\",INDIRECT(\"'\"&B146&\"'!$U$167\"))","v":{"$error":"#REF!"}},{"$f":"IF(B146=\"\",\"\",INDIRECT(\"'\"&B146&\"'!$X$167\"))","v":{"$error":"#REF!"}},{"$f":"IF(B146=\"\",\"\",INDIRECT(\"'\"&B146&\"'!$Z$167\"))","v":{"$error":"#REF!"}},{"$f":"IF(B146=\"\",\"\",INDIRECT(\"'\"&B146&\"'!$AA$167\"))","v":{"$error":"#REF!"}},{"$error":"#REF!"}]
[null,{"$f":"MID(INDEX(nom_feuilles,ROW(Masque!K23)),SEARCH(\"]\",INDEX(nom_feuilles,ROW(Masque!K23)))+1,30)","v":{"$error":"#REF!"}},{"$f":"IF(B154=\"\",\"\",INDIRECT(\"'\"&B154&\"'!$A$1\"))","v":{"$error":"#REF!"}},{"$f":"IF(B154=\"\",\"\",INDIRECT(\"'\"&B154&\"'!$A$2\"))","v":{"$error":"#REF!"}},{"$f":"IF(B154=\"\",\"\",INDIRECT(\"'\"&B154&\"'!$A$8\"))","v":{"$error":"#REF!"}},{"$f":"IF(B154=\"\",\"\",INDIRECT(\"'\"&B154&\"'!$K$30\"))","v":{"$error":"#REF!"}},{"$f":"IF(B154=\"\",\"\",INDIRECT(\"'\"&B154&\"'!$L$30\"))","v":{"$error":"#REF!"}},{"$f":"IF(B154=\"\",\"\",INDIRECT(\"'\"&B154&\"'!$H$30\"))","v":{"$error":"#REF!"}},{"$f":"IF(B154=\"\",\"\",INDIRECT(\"'\"&B154&\"'!$I$30\"))","v":{"$error":"#REF!"}},{"$f":"IF(B154=\"\",\"\",INDIRECT(\"'\"&B154&\"'!$R$30\"))","v":{"$error":"#REF!"}},{"$f":"IF(B154=\"\",\"\",INDIRECT(\"'\"&B154&\"'!$U$30\"))","v":{"$error":"#REF!"}},{"$f":"IF(B154=\"\",\"\",INDIRECT(\"'\"&B154&\"'!$X$30\"))","v":{"$error":"#REF!"}},{"$f":"IF(B154=\"\",\"\",INDIRECT(\"'\"&B154&\"'!$Z$30\"))","v":{"$error":"#REF!"}},{"$f":"IF(B154=\"\",\"\",INDIRECT(\"'\"&B154&\"'!$AA$30\"))","v":{"$error":"#REF!"}},{"$error":"#REF!"},{"$f":"SUM(O154:O161)","v":{"$error":"#REF!"}},{"$f":"IF(B154=\"\",\"\",INDIRECT(\"'\"&B154&\"'!$H$4\"))","v":{"$error":"#REF!"}},{"$f":"P154-Q154","v":{"$error":"#REF!"}}]
[{"$nulls":4},{"$f":"IF(B154=\"\",\"\",INDIRECT(\"'\"&B154&\"'!$A$32\"))","v":{"$error":"#REF!"}},{"$f":"IF(B154=\"\",\"\",INDIRECT(\"'\"&B154&\"'!$K$54\"))","v":{"$error":"#REF!"}},{"$f":"IF(B154=\"\",\"\",INDIRECT(\"'\"&B154&\"'!$L$54\"))","v":{"$error":"#REF!"}},{"$f":"IF(B154=\"\",\"\",INDIRECT(\"'\"&B154&\"'!$H$54\"))","v":{"$error":"#REF!"}},{"$f":"IF(B154=\"\",\"\",INDIRECT(\"'\"&B154&\"'!$I$54\"))","v":{"$error":"#REF!"}},{"$f":"IF(B154=\"\",\"\",INDIRECT(\"'\"&B154&\"'!$R$54\"))","v":{"$error":"#REF!"}},{"$f":"IF(B154=\"\",\"\",INDIRECT(\"'\"&B154&\"'!$U$54\"))","v":{"$error":"#REF!"}},{"$f":"IF(B154=\"\",\"\",INDIRECT(\"'\"&B154&\"'!$X$54\"))","v":{"$error":"#REF!"}},{"$f":"IF(B154=\"\",\"\",INDIRECT(\"'\"&B154&\"'!$Z$54\"))","v":{"$error":"#REF!"}},{"$f":"IF(B154=\"\",\"\",INDIRECT(\"'\"&B154&\"'!$AA$54\"))","v":{"$error":"#REF!"}},{"$error":"#REF!"}]
[{"$nulls":4},{"$f":"IF(B154=\"\",\"\",INDIRECT(\"'\"&B154&\"'!$A$56\"))","v":{"$error":"#REF!"}},{"$f":"IF(B154=\"\",\"\",INDIRECT(\"'\"&B154&\"'!$K$78\"))","v":{"$error":"#REF!"}},{"$f":"IF(B154=\"\",\"\",INDIRECT(\"'\"&B154&\"'!$L$78\"))","v":{"$error":"#REF!"}},{"$f":"IF(B154=\"\",\"\",INDIRECT(\"'\"&B154&\"'!$H$78\"))","v":{"$error":"#REF!"}},{"$f":"IF(B154=\"\",\"\",INDIRECT(\"'\"&B154&\"'!$I$78\"))","v":{"$error":"#REF!"}},{"$f":"IF(B154=\"\",\"\",INDIRECT(\"'\"&B154&\"'!$R$78\"))","v":{"$error":"#REF!"}},{"$f":"IF(B154=\"\",\"\",INDIRECT(\"'\"&B154&\"'!$U$78\"))","v":{"$error":"#REF!"}},{"$f":"IF(B154=\"\",\"\",INDIRECT(\"'\"&B154&\"'!$X$78\"))","v":{"$error":"#REF!"}},{"$f":"IF(B154=\"\",\"\",INDIRECT(\"'\"&B154&\"'!$Z$78\"))","v":{"$error":"#REF!"}},{"$f":"IF(B154=\"\",\"\",INDIRECT(\"'\"&B154&\"'!$AA$78\"))","v":{"$error":"#REF!"}},{"$error":"#REF!"}]
[{"$nulls":4},{"$f":"IF(B154=\"\",\"\",INDIRECT(\"'\"&B154&\"'!$A$80\"))","v":{"$error":"#REF!"}},{"$f":"IF(B154=\"\",\"\",INDIRECT(\"'\"&B154&\"'!$K$102\"))","v":{"$error":"#REF!"}},{"$f":"IF(B154=\"\",\"\",INDIRECT(\"'\"&B154&\"'!$L$102\"))","v":{"$error":"#REF!"}},{"$f":"IF(B154=\"\",\"\",INDIRECT(\"'\"&B154&\"'!$H$102\"))","v":{"$error":"#REF!"}},{"$f":"IF(B154=\"\",\"\",INDIRECT(\"'\"&B154&\"'!$I$102\"))","v":{"$error":"#REF!"}},{"$f":"IF(B154=\"\",\"\",INDIRECT(\"'\"&B154&\"'!$R$102\"))","v":{"$error":"#REF!"}},{"$f":"IF(B154=\"\",\"\",INDIRECT(\"'\"&B154&\"'!$U$102\"))","v":{"$error":"#REF!"}},{"$f":"IF(B154=\"\",\"\",INDIRECT(\"'\"&B154&\"'!$X$102\"))","v":{"$error":"#REF!"}},{"$f":"IF(B154=\"\",\"\",INDIRECT(\"'\"&B154&\"'!$Z$102\"))","v":{"$error":"#REF!"}},{"$f":"IF(B154=\"\",\"\",INDIRECT(\"'\"&B154&\"'!$AA$102\"))","v":{"$error":"#REF!"}},{"$error":"#REF!"}]
[{"$nulls":4},{"$f":"IF(B154=\"\",\"\",INDIRECT(\"'\"&B154&\"'!$A$104\"))","v":{"$error":"#REF!"}},{"$f":"IF(B154=\"\",\"\",INDIRECT(\"'\"&B154&\"'!$K$111\"))","v":{"$error":"#REF!"}},{"$f":"IF(B154=\"\",\"\",INDIRECT(\"'\"&B154&\"'!$L$111\"))","v":{"$error":"#REF!"}},{"$f":"IF(B154=\"\",\"\",INDIRECT(\"'\"&B154&\"'!$H$111\"))","v":{"$error":"#REF!"}},{"$f":"IF(B154=\"\",\"\",INDIRECT(\"'\"&B154&\"'!$I$111\"))","v":{"$error":"#REF!"}},{"$f":"IF(B154=\"\",\"\",INDIRECT(\"'\"&B154&\"'!$R$111\"))","v":{"$error":"#REF!"}},{"$f":"IF(B154=\"\",\"\",INDIRECT(\"'\"&B154&\"'!$U$111\"))","v":{"$error":"#REF!"}},{"$f":"IF(B154=\"\",\"\",INDIRECT(\"'\"&B154&\"'!$X$111\"))","v":{"$error":"#REF!"}},{"$f":"IF(B154=\"\",\"\",INDIRECT(\"'\"&B154&\"'!$Z$111\"))","v":{"$error":"#REF!"}},{"$f":"IF(B154=\"\",\"\",INDIRECT(\"'\"&B154&\"'!$AA$111\"))","v":{"$error":"#REF!"}},{"$error":"#REF!"}]
[{"$nulls":4},{"$f":"IF(B154=\"\",\"\",INDIRECT(\"'\"&B154&\"'!$A$113\"))","v":{"$error":"#REF!"}},{"$f":"IF(B154=\"\",\"\",INDIRECT(\"'\"&B154&\"'!$K$120\"))","v":{"$error":"#REF!"}},{"$f":"IF(B154=\"\",\"\",INDIRECT(\"'\"&B154&\"'!$L$120\"))","v":{"$error":"#REF!"}},{"$f":"IF(B154=\"\",\"\",INDIRECT(\"'\"&B154&\"'!$H$120\"))","v":{"$error":"#REF!"}},{"$f":"IF(B154=\"\",\"\",INDIRECT(\"'\"&B154&\"'!$I$120\"))","v":{"$error":"#REF!"}},{"$f":"IF(B154=\"\",\"\",INDIRECT(\"'\"&B154&\"'!$R$120\"))","v":{"$error":"#REF!"}},{"$f":"IF(B154=\"\",\"\",INDIRECT(\"'\"&B154&\"'!$U$120\"))","v":{"$error":"#REF!"}},{"$f":"IF(B154=\"\",\"\",INDIRECT(\"'\"&B154&\"'!$X$120\"))","v":{"$error":"#REF!"}},{"$f":"IF(B154=\"\",\"\",INDIRECT(\"'\"&B154&\"'!$Z$120\"))","v":{"$error":"#REF!"}},{"$f":"IF(B154=\"\",\"\",INDIRECT(\"'\"&B154&\"'!$AA$120\"))","v":{"$error":"#REF!"}},{"$error":"#REF!"}]
[{"$nulls":4},{"$f":"IF(B154=\"\",\"\",INDIRECT(\"'\"&B154&\"'!$A$122\"))","v":{"$error":"#REF!"}},{"$f":"IF(B154=\"\",\"\",INDIRECT(\"'\"&B154&\"'!$K$129\"))","v":{"$error":"#REF!"}},{"$f":"IF(B154=\"\",\"\",INDIRECT(\"'\"&B154&\"'!$L$129\"))","v":{"$error":"#REF!"}},{"$f":"IF(B154=\"\",\"\",INDIRECT(\"'\"&B154&\"'!$H$129\"))","v":{"$error":"#REF!"}},{"$f":"IF(B154=\"\",\"\",INDIRECT(\"'\"&B154&\"'!$I$129\"))","v":{"$error":"#REF!"}},{"$f":"IF(B154=\"\",\"\",INDIRECT(\"'\"&B154&\"'!$R$129\"))","v":{"$error":"#REF!"}},{"$f":"IF(B154=\"\",\"\",INDIRECT(\"'\"&B154&\"'!$U$129\"))","v":{"$error":"#REF!"}},{"$f":"IF(B154=\"\",\"\",INDIRECT(\"'\"&B154&\"'!$X$129\"))","v":{"$error":"#REF!"}},{"$f":"IF(B154=\"\",\"\",INDIRECT(\"'\"&B154&\"'!$Z$129\"))","v":{"$error":"#REF!"}},{"$f":"IF(B154=\"\",\"\",INDIRECT(\"'\"&B154&\"'!$AA$129\"))","v":{"$error":"#REF!"}},{"$error":"#REF!"}]
[{"$nulls":4},{"$f":"IF(B154=\"\",\"\",INDIRECT(\"'\"&B154&\"'!$A$131\"))","v":{"$error":"#REF!"}},{"$f":"IF(B154=\"\",\"\",INDIRECT(\"'\"&B154&\"'!$K$167\"))","v":{"$error":"#REF!"}},{"$f":"IF(B154=\"\",\"\",INDIRECT(\"'\"&B154&\"'!$L$167\"))","v":{"$error":"#REF!"}},{"$f":"IF(B154=\"\",\"\",INDIRECT(\"'\"&B154&\"'!$H$167\"))","v":{"$error":"#REF!"}},{"$f":"IF(B154=\"\",\"\",INDIRECT(\"'\"&B154&\"'!$I$167\"))","v":{"$error":"#REF!"}},{"$f":"IF(B154=\"\",\"\",INDIRECT(\"'\"&B154&\"'!$R$167\"))","v":{"$error":"#REF!"}},{"$f":"IF(B154=\"\",\"\",INDIRECT(\"'\"&B154&\"'!$U$167\"))","v":{"$error":"#REF!"}},{"$f":"IF(B154=\"\",\"\",INDIRECT(\"'\"&B154&\"'!$X$167\"))","v":{"$error":"#REF!"}},{"$f":"IF(B154=\"\",\"\",INDIRECT(\"'\"&B154&\"'!$Z$167\"))","v":{"$error":"#REF!"}},{"$f":"IF(B154=\"\",\"\",INDIRECT(\"'\"&B154&\"'!$AA$167\"))","v":{"$error":"#REF!"}},{"$error":"#REF!"}]
[null,{"$f":"MID(INDEX(nom_feuilles,ROW(Masque!K24)),SEARCH(\"]\",INDEX(nom_feuilles,ROW(Masque!K24)))+1,30)","v":{"$error":"#REF!"}},{"$f":"IF(B162=\"\",\"\",INDIRECT(\"'\"&B162&\"'!$A$1\"))","v":{"$error":"#REF!"}},{"$f":"IF(B162=\"\",\"\",INDIRECT(\"'\"&B162&\"'!$A$2\"))","v":{"$error":"#REF!"}},{"$f":"IF(B162=\"\",\"\",INDIRECT(\"'\"&B162&\"'!$A$8\"))","v":{"$error":"#REF!"}},{"$f":"IF(B162=\"\",\"\",INDIRECT(\"'\"&B162&\"'!$K$30\"))","v":{"$error":"#REF!"}},{"$f":"IF(B162=\"\",\"\",INDIRECT(\"'\"&B162&\"'!$L$30\"))","v":{"$error":"#REF!"}},{"$f":"IF(B162=\"\",\"\",INDIRECT(\"'\"&B162&\"'!$H$30\"))","v":{"$error":"#REF!"}},{"$f":"IF(B162=\"\",\"\",INDIRECT(\"'\"&B162&\"'!$I$30\"))","v":{"$error":"#REF!"}},{"$f":"IF(B162=\"\",\"\",INDIRECT(\"'\"&B162&\"'!$R$30\"))","v":{"$error":"#REF!"}},{"$f":"IF(B162=\"\",\"\",INDIRECT(\"'\"&B162&\"'!$U$30\"))","v":{"$error":"#REF!"}},{"$f":"IF(B162=\"\",\"\",INDIRECT(\"'\"&B162&\"'!$X$30\"))","v":{"$error":"#REF!"}},{"$f":"IF(B162=\"\",\"\",INDIRECT(\"'\"&B162&\"'!$Z$30\"))","v":{"$error":"#REF!"}},{"$f":"IF(B162=\"\",\"\",INDIRECT(\"'\"&B162&\"'!$AA$30\"))","v":{"$error":"#REF!"}},{"$f":"SUM(F162:N162)","v":{"$error":"#REF!"}},{"$f":"SUM(O162:O169)","v":{"$error":"#REF!"}},{"$f":"IF(B162=\"\",\"\",INDIRECT(\"'\"&B162&\"'!$H$4\"))","v":{"$error":"#REF!"}},{"$f":"P162-Q162","v":{"$error":"#REF!"}}]
[{"$nulls":4},{"$f":"IF(B162=\"\",\"\",INDIRECT(\"'\"&B162&\"'!$A$32\"))","v":{"$error":"#REF!"}},{"$f":"IF(B162=\"\",\"\",INDIRECT(\"'\"&B162&\"'!$K$54\"))","v":{"$error":"#REF!"}},{"$f":"IF(B162=\"\",\"\",INDIRECT(\"'\"&B162&\"'!$L$54\"))","v":{"$error":"#REF!"}},{"$f":"IF(B162=\"\",\"\",INDIRECT(\"'\"&B162&\"'!$H$54\"))","v":{"$error":"#REF!"}},{"$f":"IF(B162=\"\",\"\",INDIRECT(\"'\"&B162&\"'!$I$54\"))","v":{"$error":"#REF!"}},{"$f":"IF(B162=\"\",\"\",INDIRECT(\"'\"&B162&\"'!$R$54\"))","v":{"$error":"#REF!"}},{"$f":"IF(B162=\"\",\"\",INDIRECT(\"'\"&B162&\"'!$U$54\"))","v":{"$error":"#REF!"}},{"$f":"IF(B162=\"\",\"\",INDIRECT(\"'\"&B162&\"'!$X$54\"))","v":{"$error":"#REF!"}},{"$f":"IF(B162=\"\",\"\",INDIRECT(\"'\"&B162&\"'!$Z$54\"))","v":{"$error":"#REF!"}},{"$f":"IF(B162=\"\",\"\",INDIRECT(\"'\"&B162&\"'!$AA$54\"))","v":{"$error":"#REF!"}},{"$f":"SUM(F163:N163)","v":{"$error":"#REF!"}}]
[{"$nulls":4},{"$f":"IF(B162=\"\",\"\",INDIRECT(\"'\"&B162&\"'!$A$56\"))","v":{"$error":"#REF!"}},{"$f":"IF(B162=\"\",\"\",INDIRECT(\"'\"&B162&\"'!$K$78\"))","v":{"$error":"#REF!"}},{"$f":"IF(B162=\"\",\"\",INDIRECT(\"'\"&B162&\"'!$L$78\"))","v":{"$error":"#REF!"}},{"$f":"IF(B162=\"\",\"\",INDIRECT(\"'\"&B162&\"'!$H$78\"))","v":{"$error":"#REF!"}},{"$f":"IF(B162=\"\",\"\",INDIRECT(\"'\"&B162&\"'!$I$78\"))","v":{"$error":"#REF!"}},{"$f":"IF(B162=\"\",\"\",INDIRECT(\"'\"&B162&\"'!$R$78\"))","v":{"$error":"#REF!"}},{"$f":"IF(B162=\"\",\"\",INDIRECT(\"'\"&B162&\"'!$U$78\"))","v":{"$error":"#REF!"}},{"$f":"IF(B162=\"\",\"\",INDIRECT(\"'\"&B162&\"'!$X$78\"))","v":{"$error":"#REF!"}},{"$f":"IF(B162=\"\",\"\",INDIRECT(\"'\"&B162&\"'!$Z$78\"))","v":{"$error":"#REF!"}},{"$f":"IF(B162=\"\",\"\",INDIRECT(\"'\"&B162&\"'!$AA$78\"))","v":{"$error":"#REF!"}},{"$f":"SUM(F164:N164)","v":{"$error":"#REF!"}}]
[{"$nulls":4},{"$f":"IF(B162=\"\",\"\",INDIRECT(\"'\"&B162&\"'!$A$80\"))","v":{"$error":"#REF!"}},{"$f":"IF(B162=\"\",\"\",INDIRECT(\"'\"&B162&\"'!$K$102\"))","v":{"$error":"#REF!"}},{"$f":"IF(B162=\"\",\"\",INDIRECT(\"'\"&B162&\"'!$L$102\"))","v":{"$error":"#REF!"}},{"$f":"IF(B162=\"\",\"\",INDIRECT(\"'\"&B162&\"'!$H$102\"))","v":{"$error":"#REF!"}},{"$f":"IF(B162=\"\",\"\",INDIRECT(\"'\"&B162&\"'!$I$102\"))","v":{"$error":"#REF!"}},{"$f":"IF(B162=\"\",\"\",INDIRECT(\"'\"&B162&\"'!$R$102\"))","v":{"$error":"#REF!"}},{"$f":"IF(B162=\"\",\"\",INDIRECT(\"'\"&B162&\"'!$U$102\"))","v":{"$error":"#REF!"}},{"$f":"IF(B162=\"\",\"\",INDIRECT(\"'\"&B162&\"'!$X$102\"))","v":{"$error":"#REF!"}},{"$f":"IF(B162=\"\",\"\",INDIRECT(\"'\"&B162&\"'!$Z$102\"))","v":{"$error":"#REF!"}},{"$f":"IF(B162=\"\",\"\",INDIRECT(\"'\"&B162&\"'!$AA$102\"))","v":{"$error":"#REF!"}},{"$error":"#REF!"}]
[{"$nulls":4},{"$f":"IF(B162=\"\",\"\",INDIRECT(\"'\"&B162&\"'!$A$104\"))","v":{"$error":"#REF!"}},{"$f":"IF(B162=\"\",\"\",INDIRECT(\"'\"&B162&\"'!$K$111\"))","v":{"$error":"#REF!"}},{"$f":"IF(B162=\"\",\"\",INDIRECT(\"'\"&B162&\"'!$L$111\"))","v":{"$error":"#REF!"}},{"$f":"IF(B162=\"\",\"\",INDIRECT(\"'\"&B162&\"'!$H$111\"))","v":{"$error":"#REF!"}},{"$f":"IF(B162=\"\",\"\",INDIRECT(\"'\"&B162&\"'!$I$111\"))","v":{"$error":"#REF!"}},{"$f":"IF(B162=\"\",\"\",INDIRECT(\"'\"&B162&\"'!$R$111\"))","v":{"$error":"#REF!"}},{"$f":"IF(B162=\"\",\"\",INDIRECT(\"'\"&B162&\"'!$U$111\"))","v":{"$error":"#REF!"}},{"$f":"IF(B162=\"\",\"\",INDIRECT(\"'\"&B162&\"'!$X$111\"))","v":{"$error":"#REF!"}},{"$f":"IF(B162=\"\",\"\",INDIRECT(\"'\"&B162&\"'!$Z$111\"))","v":{"$error":"#REF!"}},{"$f":"IF(B162=\"\",\"\",INDIRECT(\"'\"&B162&\"'!$AA$111\"))","v":{"$error":"#REF!"}},{"$error":"#REF!"}]
[{"$nulls":4},{"$f":"IF(B162=\"\",\"\",INDIRECT(\"'\"&B162&\"'!$A$113\"))","v":{"$error":"#REF!"}},{"$f":"IF(B162=\"\",\"\",INDIRECT(\"'\"&B162&\"'!$K$120\"))","v":{"$error":"#REF!"}},{"$f":"IF(B162=\"\",\"\",INDIRECT(\"'\"&B162&\"'!$L$120\"))","v":{"$error":"#REF!"}},{"$f":"IF(B162=\"\",\"\",INDIRECT(\"'\"&B162&\"'!$H$120\"))","v":{"$error":"#REF!"}},{"$f":"IF(B162=\"\",\"\",INDIRECT(\"'\"&B162&\"'!$I$120\"))","v":{"$error":"#REF!"}},{"$f":"IF(B162=\"\",\"\",INDIRECT(\"'\"&B162&\"'!$R$120\"))","v":{"$error":"#REF!"}},{"$f":"IF(B162=\"\",\"\",INDIRECT(\"'\"&B162&\"'!$U$120\"))","v":{"$error":"#REF!"}},{"$f":"IF(B162=\"\",\"\",INDIRECT(\"'\"&B162&\"'!$X$120\"))","v":{"$error":"#REF!"}},{"$f":"IF(B162=\"\",\"\",INDIRECT(\"'\"&B162&\"'!$Z$120\"))","v":{"$error":"#REF!"}},{"$f":"IF(B162=\"\",\"\",INDIRECT(\"'\"&B162&\"'!$AA$120\"))","v":{"$error":"#REF!"}},{"$error":"#REF!"}]
[{"$nulls":4},{"$f":"IF(B162=\"\",\"\",INDIRECT(\"'\"&B162&\"'!$A$122\"))","v":{"$error":"#REF!"}},{"$f":"IF(B162=\"\",\"\",INDIRECT(\"'\"&B162&\"'!$K$129\"))","v":{"$error":"#REF!"}},{"$f":"IF(B162=\"\",\"\",INDIRECT(\"'\"&B162&\"'!$L$129\"))","v":{"$error":"#REF!"}},{"$f":"IF(B162=\"\",\"\",INDIRECT(\"'\"&B162&\"'!$H$129\"))","v":{"$error":"#REF!"}},{"$f":"IF(B162=\"\",\"\",INDIRECT(\"'\"&B162&\"'!$I$129\"))","v":{"$error":"#REF!"}},{"$f":"IF(B162=\"\",\"\",INDIRECT(\"'\"&B162&\"'!$R$129\"))","v":{"$error":"#REF!"}},{"$f":"IF(B162=\"\",\"\",INDIRECT(\"'\"&B162&\"'!$U$129\"))","v":{"$error":"#REF!"}},{"$f":"IF(B162=\"\",\"\",INDIRECT(\"'\"&B162&\"'!$X$129\"))","v":{"$error":"#REF!"}},{"$f":"IF(B162=\"\",\"\",INDIRECT(\"'\"&B162&\"'!$Z$129\"))","v":{"$error":"#REF!"}},{"$f":"IF(B162=\"\",\"\",INDIRECT(\"'\"&B162&\"'!$AA$129\"))","v":{"$error":"#REF!"}},{"$error":"#REF!"}]
[{"$nulls":4},{"$f":"IF(B162=\"\",\"\",INDIRECT(\"'\"&B162&\"'!$A$131\"))","v":{"$error":"#REF!"}},{"$f":"IF(B162=\"\",\"\",INDIRECT(\"'\"&B162&\"'!$K$167\"))","v":{"$error":"#REF!"}},{"$f":"IF(B162=\"\",\"\",INDIRECT(\"'\"&B162&\"'!$L$167\"))","v":{"$error":"#REF!"}},{"$f":"IF(B162=\"\",\"\",INDIRECT(\"'\"&B162&\"'!$H$167\"))","v":{"$error":"#REF!"}},{"$f":"IF(B162=\"\",\"\",INDIRECT(\"'\"&B162&\"'!$I$167\"))","v":{"$error":"#REF!"}},{"$f":"IF(B162=\"\",\"\",INDIRECT(\"'\"&B162&\"'!$R$167\"))","v":{"$error":"#REF!"}},{"$f":"IF(B162=\"\",\"\",INDIRECT(\"'\"&B162&\"'!$U$167\"))","v":{"$error":"#REF!"}},{"$f":"IF(B162=\"\",\"\",INDIRECT(\"'\"&B162&\"'!$X$167\"))","v":{"$error":"#REF!"}},{"$f":"IF(B162=\"\",\"\",INDIRECT(\"'\"&B162&\"'!$Z$167\"))","v":{"$error":"#REF!"}},{"$f":"IF(B162=\"\",\"\",INDIRECT(\"'\"&B162&\"'!$AA$167\"))","v":{"$error":"#REF!"}},{"$error":"#REF!"}]
[null,{"$f":"MID(INDEX(nom_feuilles,ROW(Masque!K25)),SEARCH(\"]\",INDEX(nom_feuilles,ROW(Masque!K25)))+1,30)","v":{"$error":"#REF!"}},{"$f":"IF(B170=\"\",\"\",INDIRECT(\"'\"&B170&\"'!$A$1\"))","v":{"$error":"#REF!"}},{"$f":"IF(B170=\"\",\"\",INDIRECT(\"'\"&B170&\"'!$A$2\"))","v":{"$error":"#REF!"}},{"$f":"IF(B170=\"\",\"\",INDIRECT(\"'\"&B170&\"'!$A$8\"))","v":{"$error":"#REF!"}},{"$f":"IF(B170=\"\",\"\",INDIRECT(\"'\"&B170&\"'!$K$30\"))","v":{"$error":"#REF!"}},{"$f":"IF(B170=\"\",\"\",INDIRECT(\"'\"&B170&\"'!$L$30\"))","v":{"$error":"#REF!"}},{"$f":"IF(B170=\"\",\"\",INDIRECT(\"'\"&B170&\"'!$H$30\"))","v":{"$error":"#REF!"}},{"$f":"IF(B170=\"\",\"\",INDIRECT(\"'\"&B170&\"'!$I$30\"))","v":{"$error":"#REF!"}},{"$f":"IF(B170=\"\",\"\",INDIRECT(\"'\"&B170&\"'!$R$30\"))","v":{"$error":"#REF!"}},{"$f":"IF(B170=\"\",\"\",INDIRECT(\"'\"&B170&\"'!$U$30\"))","v":{"$error":"#REF!"}},{"$f":"IF(B170=\"\",\"\",INDIRECT(\"'\"&B170&\"'!$X$30\"))","v":{"$error":"#REF!"}},{"$f":"IF(B170=\"\",\"\",INDIRECT(\"'\"&B170&\"'!$Z$30\"))","v":{"$error":"#REF!"}},{"$f":"IF(B170=\"\",\"\",INDIRECT(\"'\"&B170&\"'!$AA$30\"))","v":{"$error":"#REF!"}},{"$error":"#REF!"},{"$f":"SUM(O170:O177)","v":{"$error":"#REF!"}},{"$f":"IF(B170=\"\",\"\",INDIRECT(\"'\"&B170&\"'!$H$4\"))","v":{"$error":"#REF!"}},{"$f":"P170-Q170","v":{"$error":"#REF!"}}]
[{"$nulls":4},{"$f":"IF(B170=\"\",\"\",INDIRECT(\"'\"&B170&\"'!$A$32\"))","v":{"$error":"#REF!"}},{"$f":"IF(B170=\"\",\"\",INDIRECT(\"'\"&B170&\"'!$K$54\"))","v":{"$error":"#REF!"}},{"$f":"IF(B170=\"\",\"\",INDIRECT(\"'\"&B170&\"'!$L$54\"))","v":{"$error":"#REF!"}},{"$f":"IF(B170=\"\",\"\",INDIRECT(\"'\"&B170&\"'!$H$54\"))","v":{"$error":"#REF!"}},{"$f":"IF(B170=\"\",\"\",INDIRECT(\"'\"&B170&\"'!$I$54\"))","v":{"$error":"#REF!"}},{"$f":"IF(B170=\"\",\"\",INDIRECT(\"'\"&B170&\"'!$R$54\"))","v":{"$error":"#REF!"}},{"$f":"IF(B170=\"\",\"\",INDIRECT(\"'\"&B170&\"'!$U$54\"))","v":{"$error":"#REF!"}},{"$f":"IF(B170=\"\",\"\",INDIRECT(\"'\"&B170&\"'!$X$54\"))","v":{"$error":"#REF!"}},{"$f":"IF(B170=\"\",\"\",INDIRECT(\"'\"&B170&\"'!$Z$54\"))","v":{"$error":"#REF!"}},{"$f":"IF(B170=\"\",\"\",INDIRECT(\"'\"&B170&\"'!$AA$54\"))","v":{"$error":"#REF!"}},{"$error":"#REF!"}]
[{"$nulls":4},{"$f":"IF(B170=\"\",\"\",INDIRECT(\"'\"&B170&\"'!$A$56\"))","v":{"$error":"#REF!"}},{"$f":"IF(B170=\"\",\"\",INDIRECT(\"'\"&B170&\"'!$K$78\"))","v":{"$error":"#REF!"}},{"$f":"IF(B170=\"\",\"\",INDIRECT(\"'\"&B170&\"'!$L$78\"))","v":{"$error":"#REF!"}},{"$f":"IF(B170=\"\",\"\",INDIRECT(\"'\"&B170&\"'!$H$78\"))","v":{"$error":"#REF!"}},{"$f":"IF(B170=\"\",\"\",INDIRECT(\"'\"&B170&\"'!$I$78\"))","v":{"$error":"#REF!"}},{"$f":"IF(B170=\"\",\"\",INDIRECT(\"'\"&B170&\"'!$R$78\"))","v":{"$error":"#REF!"}},{"$f":"IF(B170=\"\",\"\",INDIRECT(\"'\"&B170&\"'!$U$78\"))","v":{"$error":"#REF!"}},{"$f":"IF(B170=\"\",\"\",INDIRECT(\"'\"&B170&\"'!$X$78\"))","v":{"$error":"#REF!"}},{"$f":"IF(B170=\"\",\"\",INDIRECT(\"'\"&B170&\"'!$Z$78\"))","v":{"$error":"#REF!"}},{"$f":"IF(B170=\"\",\"\",INDIRECT(\"'\"&B170&\"'!$AA$78\"))","v":{"$error":"#REF!"}},{"$error":"#REF!"}]
[{"$nulls":4},{"$f":"IF(B170=\"\",\"\",INDIRECT(\"'\"&B170&\"'!$A$80\"))","v":{"$error":"#REF!"}},{"$f":"IF(B170=\"\",\"\",INDIRECT(\"'\"&B170&\"'!$K$102\"))","v":{"$error":"#REF!"}},{"$f":"IF(B170=\"\",\"\",INDIRECT(\"'\"&B170&\"'!$L$102\"))","v":{"$error":"#REF!"}},{"$f":"IF(B170=\"\",\"\",INDIRECT(\"'\"&B170&\"'!$H$102\"))","v":{"$error":"#REF!"}},{"$f":"IF(B170=\"\",\"\",INDIRECT(\"'\"&B170&\"'!$I$102\"))","v":{"$error":"#REF!"}},{"$f":"IF(B170=\"\",\"\",INDIRECT(\"'\"&B170&\"'!$R$102\"))","v":{"$error":"#REF!"}},{"$f":"IF(B170=\"\",\"\",INDIRECT(\"'\"&B170&\"'!$U$102\"))","v":{"$error":"#REF!"}},{"$f":"IF(B170=\"\",\"\",INDIRECT(\"'\"&B170&\"'!$X$102\"))","v":{"$error":"#REF!"}},{"$f":"IF(B170=\"\",\"\",INDIRECT(\"'\"&B170&\"'!$Z$102\"))","v":{"$error":"#REF!"}},{"$f":"IF(B170=\"\",\"\",INDIRECT(\"'\"&B170&\"'!$AA$102\"))","v":{"$error":"#REF!"}},{"$error":"#REF!"}]
[{"$nulls":4},{"$f":"IF(B170=\"\",\"\",INDIRECT(\"'\"&B170&\"'!$A$104\"))","v":{"$error":"#REF!"}},{"$f":"IF(B170=\"\",\"\",INDIRECT(\"'\"&B170&\"'!$K$111\"))","v":{"$error":"#REF!"}},{"$f":"IF(B170=\"\",\"\",INDIRECT(\"'\"&B170&\"'!$L$111\"))","v":{"$error":"#REF!"}},{"$f":"IF(B170=\"\",\"\",INDIRECT(\"'\"&B170&\"'!$H$111\"))","v":{"$error":"#REF!"}},{"$f":"IF(B170=\"\",\"\",INDIRECT(\"'\"&B170&\"'!$I$111\"))","v":{"$error":"#REF!"}},{"$f":"IF(B170=\"\",\"\",INDIRECT(\"'\"&B170&\"'!$R$111\"))","v":{"$error":"#REF!"}},{"$f":"IF(B170=\"\",\"\",INDIRECT(\"'\"&B170&\"'!$U$111\"))","v":{"$error":"#REF!"}},{"$f":"IF(B170=\"\",\"\",INDIRECT(\"'\"&B170&\"'!$X$111\"))","v":{"$error":"#REF!"}},{"$f":"IF(B170=\"\",\"\",INDIRECT(\"'\"&B170&\"'!$Z$111\"))","v":{"$error":"#REF!"}},{"$f":"IF(B170=\"\",\"\",INDIRECT(\"'\"&B170&\"'!$AA$111\"))","v":{"$error":"#REF!"}},{"$error":"#REF!"}]
[{"$nulls":4},{"$f":"IF(B170=\"\",\"\",INDIRECT(\"'\"&B170&\"'!$A$113\"))","v":{"$error":"#REF!"}},{"$f":"IF(B170=\"\",\"\",INDIRECT(\"'\"&B170&\"'!$K$120\"))","v":{"$error":"#REF!"}},{"$f":"IF(B170=\"\",\"\",INDIRECT(\"'\"&B170&\"'!$L$120\"))","v":{"$error":"#REF!"}},{"$f":"IF(B170=\"\",\"\",INDIRECT(\"'\"&B170&\"'!$H$120\"))","v":{"$error":"#REF!"}},{"$f":"IF(B170=\"\",\"\",INDIRECT(\"'\"&B170&\"'!$I$120\"))","v":{"$error":"#REF!"}},{"$f":"IF(B170=\"\",\"\",INDIRECT(\"'\"&B170&\"'!$R$120\"))","v":{"$error":"#REF!"}},{"$f":"IF(B170=\"\",\"\",INDIRECT(\"'\"&B170&\"'!$U$120\"))","v":{"$error":"#REF!"}},{"$f":"IF(B170=\"\",\"\",INDIRECT(\"'\"&B170&\"'!$X$120\"))","v":{"$error":"#REF!"}},{"$f":"IF(B170=\"\",\"\",INDIRECT(\"'\"&B170&\"'!$Z$120\"))","v":{"$error":"#REF!"}},{"$f":"IF(B170=\"\",\"\",INDIRECT(\"'\"&B170&\"'!$AA$120\"))","v":{"$error":"#REF!"}},{"$error":"#REF!"}]
[{"$nulls":4},{"$f":"IF(B170=\"\",\"\",INDIRECT(\"'\"&B170&\"'!$A$122\"))","v":{"$error":"#REF!"}},{"$f":"IF(B170=\"\",\"\",INDIRECT(\"'\"&B170&\"'!$K$129\"))","v":{"$error":"#REF!"}},{"$f":"IF(B170=\"\",\"\",INDIRECT(\"'\"&B170&\"'!$L$129\"))","v":{"$error":"#REF!"}},{"$f":"IF(B170=\"\",\"\",INDIRECT(\"'\"&B170&\"'!$H$129\"))","v":{"$error":"#REF!"}},{"$f":"IF(B170=\"\",\"\",INDIRECT(\"'\"&B170&\"'!$I$129\"))","v":{"$error":"#REF!"}},{"$f":"IF(B170=\"\",\"\",INDIRECT(\"'\"&B170&\"'!$R$129\"))","v":{"$error":"#REF!"}},{"$f":"IF(B170=\"\",\"\",INDIRECT(\"'\"&B170&\"'!$U$129\"))","v":{"$error":"#REF!"}},{"$f":"IF(B170=\"\",\"\",INDIRECT(\"'\"&B170&\"'!$X$129\"))","v":{"$error":"#REF!"}},{"$f":"IF(B170=\"\",\"\",INDIRECT(\"'\"&B170&\"'!$Z$129\"))","v":{"$error":"#REF!"}},{"$f":"IF(B170=\"\",\"\",INDIRECT(\"'\"&B170&\"'!$AA$129\"))","v":{"$error":"#REF!"}},{"$error":"#REF!"}]
[{"$nulls":4},{"$f":"IF(B170=\"\",\"\",INDIRECT(\"'\"&B170&\"'!$A$131\"))","v":{"$error":"#REF!"}},{"$f":"IF(B170=\"\",\"\",INDIRECT(\"'\"&B170&\"'!$K$167\"))","v":{"$error":"#REF!"}},{"$f":"IF(B170=\"\",\"\",INDIRECT(\"'\"&B170&\"'!$L$167\"))","v":{"$error":"#REF!"}},{"$f":"IF(B170=\"\",\"\",INDIRECT(\"'\"&B170&\"'!$H$167\"))","v":{"$error":"#REF!"}},{"$f":"IF(B170=\"\",\"\",INDIRECT(\"'\"&B170&\"'!$I$167\"))","v":{"$error":"#REF!"}},{"$f":"IF(B170=\"\",\"\",INDIRECT(\"'\"&B170&\"'!$R$167\"))","v":{"$error":"#REF!"}},{"$f":"IF(B170=\"\",\"\",INDIRECT(\"'\"&B170&\"'!$U$167\"))","v":{"$error":"#REF!"}},{"$f":"IF(B170=\"\",\"\",INDIRECT(\"'\"&B170&\"'!$X$167\"))","v":{"$error":"#REF!"}},{"$f":"IF(B170=\"\",\"\",INDIRECT(\"'\"&B170&\"'!$Z$167\"))","v":{"$error":"#REF!"}},{"$f":"IF(B170=\"\",\"\",INDIRECT(\"'\"&B170&\"'!$AA$167\"))","v":{"$error":"#REF!"}},{"$error":"#REF!"}]
[null,{"$f":"MID(INDEX(nom_feuilles,ROW(Masque!K26)),SEARCH(\"]\",INDEX(nom_feuilles,ROW(Masque!K26)))+1,30)","v":{"$error":"#REF!"}},{"$f":"IF(B178=\"\",\"\",INDIRECT(\"'\"&B178&\"'!$A$1\"))","v":{"$error":"#REF!"}},{"$f":"IF(B178=\"\",\"\",INDIRECT(\"'\"&B178&\"'!$A$2\"))","v":{"$error":"#REF!"}},{"$f":"IF(B178=\"\",\"\",INDIRECT(\"'\"&B178&\"'!$A$8\"))","v":{"$error":"#REF!"}},{"$f":"IF(B178=\"\",\"\",INDIRECT(\"'\"&B178&\"'!$K$30\"))","v":{"$error":"#REF!"}},{"$f":"IF(B178=\"\",\"\",INDIRECT(\"'\"&B178&\"'!$L$30\"))","v":{"$error":"#REF!"}},{"$f":"IF(B178=\"\",\"\",INDIRECT(\"'\"&B178&\"'!$H$30\"))","v":{"$error":"#REF!"}},{"$f":"IF(B178=\"\",\"\",INDIRECT(\"'\"&B178&\"'!$I$30\"))","v":{"$error":"#REF!"}},{"$f":"IF(B178=\"\",\"\",INDIRECT(\"'\"&B178&\"'!$R$30\"))","v":{"$error":"#REF!"}},{"$f":"IF(B178=\"\",\"\",INDIRECT(\"'\"&B178&\"'!$U$30\"))","v":{"$error":"#REF!"}},{"$f":"IF(B178=\"\",\"\",INDIRECT(\"'\"&B178&\"'!$X$30\"))","v":{"$error":"#REF!"}},{"$f":"IF(B178=\"\",\"\",INDIRECT(\"'\"&B178&\"'!$Z$30\"))","v":{"$error":"#REF!"}},{"$f":"IF(B178=\"\",\"\",INDIRECT(\"'\"&B178&\"'!$AA$30\"))","v":{"$error":"#REF!"}},{"$error":"#REF!"},{"$f":"SUM(O178:O185)","v":{"$error":"#REF!"}},{"$f":"IF(B178=\"\",\"\",INDIRECT(\"'\"&B178&\"'!$H$4\"))","v":{"$error":"#REF!"}},{"$f":"P178-Q178","v":{"$error":"#REF!"}}]
[{"$nulls":4},{"$f":"IF(B178=\"\",\"\",INDIRECT(\"'\"&B178&\"'!$A$32\"))","v":{"$error":"#REF!"}},{"$f":"IF(B178=\"\",\"\",INDIRECT(\"'\"&B178&\"'!$K$54\"))","v":{"$error":"#REF!"}},{"$f":"IF(B178=\"\",\"\",INDIRECT(\"'\"&B178&\"'!$L$54\"))","v":{"$error":"#REF!"}},{"$f":"IF(B178=\"\",\"\",INDIRECT(\"'\"&B178&\"'!$H$54\"))","v":{"$error":"#REF!"}},{"$f":"IF(B178=\"\",\"\",INDIRECT(\"'\"&B178&\"'!$I$54\"))","v":{"$error":"#REF!"}},{"$f":"IF(B178=\"\",\"\",INDIRECT(\"'\"&B178&\"'!$R$54\"))","v":{"$error":"#REF!"}},{"$f":"IF(B178=\"\",\"\",INDIRECT(\"'\"&B178&\"'!$U$54\"))","v":{"$error":"#REF!"}},{"$f":"IF(B178=\"\",\"\",INDIRECT(\"'\"&B178&\"'!$X$54\"))","v":{"$error":"#REF!"}},{"$f":"IF(B178=\"\",\"\",INDIRECT(\"'\"&B178&\"'!$Z$54\"))","v":{"$error":"#REF!"}},{"$f":"IF(B178=\"\",\"\",INDIRECT(\"'\"&B178&\"'!$AA$54\"))","v":{"$error":"#REF!"}},{"$error":"#REF!"}]
[{"$nulls":4},{"$f":"IF(B178=\"\",\"\",INDIRECT(\"'\"&B178&\"'!$A$56\"))","v":{"$error":"#REF!"}},{"$f":"IF(B178=\"\",\"\",INDIRECT(\"'\"&B178&\"'!$K$78\"))","v":{"$error":"#REF!"}},{"$f":"IF(B178=\"\",\"\",INDIRECT(\"'\"&B178&\"'!$L$78\"))","v":{"$error":"#REF!"}},{"$f":"IF(B178=\"\",\"\",INDIRECT(\"'\"&B178&\"'!$H$78\"))","v":{"$error":"#REF!"}},{"$f":"IF(B178=\"\",\"\",INDIRECT(\"'\"&B178&\"'!$I$78\"))","v":{"$error":"#REF!"}},{"$f":"IF(B178=\"\",\"\",INDIRECT(\"'\"&B178&\"'!$R$78\"))","v":{"$error":"#REF!"}},{"$f":"IF(B178=\"\",\"\",INDIRECT(\"'\"&B178&\"'!$U$78\"))","v":{"$error":"#REF!"}},{"$f":"IF(B178=\"\",\"\",INDIRECT(\"'\"&B178&\"'!$X$78\"))","v":{"$error":"#REF!"}},{"$f":"IF(B178=\"\",\"\",INDIRECT(\"'\"&B178&\"'!$Z$78\"))","v":{"$error":"#REF!"}},{"$f":"IF(B178=\"\",\"\",INDIRECT(\"'\"&B178&\"'!$AA$78\"))","v":{"$error":"#REF!"}},{"$error":"#REF!"}]
[{"$nulls":4},{"$f":"IF(B178=\"\",\"\",INDIRECT(\"'\"&B178&\"'!$A$80\"))","v":{"$error":"#REF!"}},{"$f":"IF(B178=\"\",\"\",INDIRECT(\"'\"&B178&\"'!$K$102\"))","v":{"$error":"#REF!"}},{"$f":"IF(B178=\"\",\"\",INDIRECT(\"'\"&B178&\"'!$L$102\"))","v":{"$error":"#REF!"}},{"$f":"IF(B178=\"\",\"\",INDIRECT(\"'\"&B178&\"'!$H$102\"))","v":{"$error":"#REF!"}},{"$f":"IF(B178=\"\",\"\",INDIRECT(\"'\"&B178&\"'!$I$102\"))","v":{"$error":"#REF!"}},{"$f":"IF(B178=\"\",\"\",INDIRECT(\"'\"&B178&\"'!$R$102\"))","v":{"$error":"#REF!"}},{"$f":"IF(B178=\"\",\"\",INDIRECT(\"'\"&B178&\"'!$U$102\"))","v":{"$error":"#REF!"}},{"$f":"IF(B178=\"\",\"\",INDIRECT(\"'\"&B178&\"'!$X$102\"))","v":{"$error":"#REF!"}},{"$f":"IF(B178=\"\",\"\",INDIRECT(\"'\"&B178&\"'!$Z$102\"))","v":{"$error":"#REF!"}},{"$f":"IF(B178=\"\",\"\",INDIRECT(\"'\"&B178&\"'!$AA$102\"))","v":{"$error":"#REF!"}},{"$error":"#REF!"}]
[{"$nulls":4},{"$f":"IF(B178=\"\",\"\",INDIRECT(\"'\"&B178&\"'!$A$104\"))","v":{"$error":"#REF!"}},{"$f":"IF(B178=\"\",\"\",INDIRECT(\"'\"&B178&\"'!$K$111\"))","v":{"$error":"#REF!"}},{"$f":"IF(B178=\"\",\"\",INDIRECT(\"'\"&B178&\"'!$L$111\"))","v":{"$error":"#REF!"}},{"$f":"IF(B178=\"\",\"\",INDIRECT(\"'\"&B178&\"'!$H$111\"))","v":{"$error":"#REF!"}},{"$f":"IF(B178=\"\",\"\",INDIRECT(\"'\"&B178&\"'!$I$111\"))","v":{"$error":"#REF!"}},{"$f":"IF(B178=\"\",\"\",INDIRECT(\"'\"&B178&\"'!$R$111\"))","v":{"$error":"#REF!"}},{"$f":"IF(B178=\"\",\"\",INDIRECT(\"'\"&B178&\"'!$U$111\"))","v":{"$error":"#REF!"}},{"$f":"IF(B178=\"\",\"\",INDIRECT(\"'\"&B178&\"'!$X$111\"))","v":{"$error":"#REF!"}},{"$f":"IF(B178=\"\",\"\",INDIRECT(\"'\"&B178&\"'!$Z$111\"))","v":{"$error":"#REF!"}},{"$f":"IF(B178=\"\",\"\",INDIRECT(\"'\"&B178&\"'!$AA$111\"))","v":{"$error":"#REF!"}},{"$error":"#REF!"}]
[{"$nulls":4},{"$f":"IF(B178=\"\",\"\",INDIRECT(\"'\"&B178&\"'!$A$113\"))","v":{"$error":"#REF!"}},{"$f":"IF(B178=\"\",\"\",INDIRECT(\"'\"&B178&\"'!$K$120\"))","v":{"$error":"#REF!"}},{"$f":"IF(B178=\"\",\"\",INDIRECT(\"'\"&B178&\"'!$L$120\"))","v":{"$error":"#REF!"}},{"$f":"IF(B178=\"\",\"\",INDIRECT(\"'\"&B178&\"'!$H$120\"))","v":{"$error":"#REF!"}},{"$f":"IF(B178=\"\",\"\",INDIRECT(\"'\"&B178&\"'!$I$120\"))","v":{"$error":"#REF!"}},{"$f":"IF(B178=\"\",\"\",INDIRECT(\"'\"&B178&\"'!$R$120\"))","v":{"$error":"#REF!"}},{"$f":"IF(B178=\"\",\"\",INDIRECT(\"'\"&B178&\"'!$U$120\"))","v":{"$error":"#REF!"}},{"$f":"IF(B178=\"\",\"\",INDIRECT(\"'\"&B178&\"'!$X$120\"))","v":{"$error":"#REF!"}},{"$f":"IF(B178=\"\",\"\",INDIRECT(\"'\"&B178&\"'!$Z$120\"))","v":{"$error":"#REF!"}},{"$f":"IF(B178=\"\",\"\",INDIRECT(\"'\"&B178&\"'!$AA$120\"))","v":{"$error":"#REF!"}},{"$error":"#REF!"}]
[{"$nulls":4},{"$f":"IF(B178=\"\",\"\",INDIRECT(\"'\"&B178&\"'!$A$122\"))","v":{"$error":"#REF!"}},{"$f":"IF(B178=\"\",\"\",INDIRECT(\"'\"&B178&\"'!$K$129\"))","v":{"$error":"#REF!"}},{"$f":"IF(B178=\"\",\"\",INDIRECT(\"'\"&B178&\"'!$L$129\"))","v":{"$error":"#REF!"}},{"$f":"IF(B178=\"\",\"\",INDIRECT(\"'\"&B178&\"'!$H$129\"))","v":{"$error":"#REF!"}},{"$f":"IF(B178=\"\",\"\",INDIRECT(\"'\"&B178&\"'!$I$129\"))","v":{"$error":"#REF!"}},{"$f":"IF(B178=\"\",\"\",INDIRECT(\"'\"&B178&\"'!$R$129\"))","v":{"$error":"#REF!"}},{"$f":"IF(B178=\"\",\"\",INDIRECT(\"'\"&B178&\"'!$U$129\"))","v":{"$error":"#REF!"}},{"$f":"IF(B178=\"\",\"\",INDIRECT(\"'\"&B178&\"'!$X$129\"))","v":{"$error":"#REF!"}},{"$f":"IF(B178=\"\",\"\",INDIRECT(\"'\"&B178&\"'!$Z$129\"))","v":{"$error":"#REF!"}},{"$f":"IF(B178=\"\",\"\",INDIRECT(\"'\"&B178&\"'!$AA$129\"))","v":{"$error":"#REF!"}},{"$error":"#REF!"}]
[{"$nulls":4},{"$f":"IF(B178=\"\",\"\",INDIRECT(\"'\"&B178&\"'!$A$131\"))","v":{"$error":"#REF!"}},{"$f":"IF(B178=\"\",\"\",INDIRECT(\"'\"&B178&\"'!$K$167\"))","v":{"$error":"#REF!"}},{"$f":"IF(B178=\"\",\"\",INDIRECT(\"'\"&B178&\"'!$L$167\"))","v":{"$error":"#REF!"}},{"$f":"IF(B178=\"\",\"\",INDIRECT(\"'\"&B178&\"'!$H$167\"))","v":{"$error":"#REF!"}},{"$f":"IF(B178=\"\",\"\",INDIRECT(\"'\"&B178&\"'!$I$167\"))","v":{"$error":"#REF!"}},{"$f":"IF(B178=\"\",\"\",INDIRECT(\"'\"&B178&\"'!$R$167\"))","v":{"$error":"#REF!"}},{"$f":"IF(B178=\"\",\"\",INDIRECT(\"'\"&B178&\"'!$U$167\"))","v":{"$error":"#REF!"}},{"$f":"IF(B178=\"\",\"\",INDIRECT(\"'\"&B178&\"'!$X$167\"))","v":{"$error":"#REF!"}},{"$f":"IF(B178=\"\",\"\",INDIRECT(\"'\"&B178&\"'!$Z$167\"))","v":{"$error":"#REF!"}},{"$f":"IF(B178=\"\",\"\",INDIRECT(\"'\"&B178&\"'!$AA$167\"))","v":{"$error":"#REF!"}},{"$error":"#REF!"}]
[null,{"$f":"MID(INDEX(nom_feuilles,ROW(Masque!K27)),SEARCH(\"]\",INDEX(nom_feuilles,ROW(Masque!K27)))+1,30)","v":{"$error":"#REF!"}},{"$f":"IF(B186=\"\",\"\",INDIRECT(\"'\"&B186&\"'!$A$1\"))","v":{"$error":"#REF!"}},{"$f":"IF(B186=\"\",\"\",INDIRECT(\"'\"&B186&\"'!$A$2\"))","v":{"$error":"#REF!"}},{"$f":"IF(B186=\"\",\"\",INDIRECT(\"'\"&B186&\"'!$A$8\"))","v":{"$error":"#REF!"}},{"$f":"IF(B186=\"\",\"\",INDIRECT(\"'\"&B186&\"'!$K$30\"))","v":{"$error":"#REF!"}},{"$f":"IF(B186=\"\",\"\",INDIRECT(\"'\"&B186&\"'!$L$30\"))","v":{"$error":"#REF!"}},{"$f":"IF(B186=\"\",\"\",INDIRECT(\"'\"&B186&\"'!$H$30\"))","v":{"$error":"#REF!"}},{"$f":"IF(B186=\"\",\"\",INDIRECT(\"'\"&B186&\"'!$I$30\"))","v":{"$error":"#REF!"}},{"$f":"IF(B186=\"\",\"\",INDIRECT(\"'\"&B186&\"'!$R$30\"))","v":{"$error":"#REF!"}},{"$f":"IF(B186=\"\",\"\",INDIRECT(\"'\"&B186&\"'!$U$30\"))","v":{"$error":"#REF!"}},{"$f":"IF(B186=\"\",\"\",INDIRECT(\"'\"&B186&\"'!$X$30\"))","v":{"$error":"#REF!"}},{"$f":"IF(B186=\"\",\"\",INDIRECT(\"'\"&B186&\"'!$Z$30\"))","v":{"$error":"#REF!"}},{"$f":"IF(B186=\"\",\"\",INDIRECT(\"'\"&B186&\"'!$AA$30\"))","v":{"$error":"#REF!"}},{"$f":"SUM(F186:N186)","v":{"$error":"#REF!"}},{"$f":"SUM(O186:O193)","v":{"$error":"#REF!"}},{"$f":"IF(B186=\"\",\"\",INDIRECT(\"'\"&B186&\"'!$H$4\"))","v":{"$error":"#REF!"}},{"$f":"P186-Q186","v":{"$error":"#REF!"}}]
[{"$nulls":4},{"$f":"IF(B186=\"\",\"\",INDIRECT(\"'\"&B186&\"'!$A$32\"))","v":{"$error":"#REF!"}},{"$f":"IF(B186=\"\",\"\",INDIRECT(\"'\"&B186&\"'!$K$54\"))","v":{"$error":"#REF!"}},{"$f":"IF(B186=\"\",\"\",INDIRECT(\"'\"&B186&\"'!$L$54\"))","v":{"$error":"#REF!"}},{"$f":"IF(B186=\"\",\"\",INDIRECT(\"'\"&B186&\"'!$H$54\"))","v":{"$error":"#REF!"}},{"$f":"IF(B186=\"\",\"\",INDIRECT(\"'\"&B186&\"'!$I$54\"))","v":{"$error":"#REF!"}},{"$f":"IF(B186=\"\",\"\",INDIRECT(\"'\"&B186&\"'!$R$54\"))","v":{"$error":"#REF!"}},{"$f":"IF(B186=\"\",\"\",INDIRECT(\"'\"&B186&\"'!$U$54\"))","v":{"$error":"#REF!"}},{"$f":"IF(B186=\"\",\"\",INDIRECT(\"'\"&B186&\"'!$X$54\"))","v":{"$error":"#REF!"}},{"$f":"IF(B186=\"\",\"\",INDIRECT(\"'\"&B186&\"'!$Z$54\"))","v":{"$error":"#REF!"}},{"$f":"IF(B186=\"\",\"\",INDIRECT(\"'\"&B186&\"'!$AA$54\"))","v":{"$error":"#REF!"}},{"$error":"#REF!"}]
[{"$nulls":4},{"$f":"IF(B186=\"\",\"\",INDIRECT(\"'\"&B186&\"'!$A$56\"))","v":{"$error":"#REF!"}},{"$f":"IF(B186=\"\",\"\",INDIRECT(\"'\"&B186&\"'!$K$78\"))","v":{"$error":"#REF!"}},{"$f":"IF(B186=\"\",\"\",INDIRECT(\"'\"&B186&\"'!$L$78\"))","v":{"$error":"#REF!"}},{"$f":"IF(B186=\"\",\"\",INDIRECT(\"'\"&B186&\"'!$H$78\"))","v":{"$error":"#REF!"}},{"$f":"IF(B186=\"\",\"\",INDIRECT(\"'\"&B186&\"'!$I$78\"))","v":{"$error":"#REF!"}},{"$f":"IF(B186=\"\",\"\",INDIRECT(\"'\"&B186&\"'!$R$78\"))","v":{"$error":"#REF!"}},{"$f":"IF(B186=\"\",\"\",INDIRECT(\"'\"&B186&\"'!$U$78\"))","v":{"$error":"#REF!"}},{"$f":"IF(B186=\"\",\"\",INDIRECT(\"'\"&B186&\"'!$X$78\"))","v":{"$error":"#REF!"}},{"$f":"IF(B186=\"\",\"\",INDIRECT(\"'\"&B186&\"'!$Z$78\"))","v":{"$error":"#REF!"}},{"$f":"IF(B186=\"\",\"\",INDIRECT(\"'\"&B186&\"'!$AA$78\"))","v":{"$error":"#REF!"}},{"$error":"#REF!"}]
[{"$nulls":4},{"$f":"IF(B186=\"\",\"\",INDIRECT(\"'\"&B186&\"'!$A$80\"))","v":{"$error":"#REF!"}},{"$f":"IF(B186=\"\",\"\",INDIRECT(\"'\"&B186&\"'!$K$102\"))","v":{"$error":"#REF!"}},{"$f":"IF(B186=\"\",\"\",INDIRECT(\"'\"&B186&\"'!$L$102\"))","v":{"$error":"#REF!"}},{"$f":"IF(B186=\"\",\"\",INDIRECT(\"'\"&B186&\"'!$H$102\"))","v":{"$error":"#REF!"}},{"$f":"IF(B186=\"\",\"\",INDIRECT(\"'\"&B186&\"'!$I$102\"))","v":{"$error":"#REF!"}},{"$f":"IF(B186=\"\",\"\",INDIRECT(\"'\"&B186&\"'!$R$102\"))","v":{"$error":"#REF!"}},{"$f":"IF(B186=\"\",\"\",INDIRECT(\"'\"&B186&\"'!$U$102\"))","v":{"$error":"#REF!"}},{"$f":"IF(B186=\"\",\"\",INDIRECT(\"'\"&B186&\"'!$X$102\"))","v":{"$error":"#REF!"}},{"$f":"IF(B186=\"\",\"\",INDIRECT(\"'\"&B186&\"'!$Z$102\"))","v":{"$error":"#REF!"}},{"$f":"IF(B186=\"\",\"\",INDIRECT(\"'\"&B186&\"'!$AA$102\"))","v":{"$error":"#REF!"}},{"$error":"#REF!"}]
[{"$nulls":4},{"$f":"IF(B186=\"\",\"\",INDIRECT(\"'\"&B186&\"'!$A$104\"))","v":{"$error":"#REF!"}},{"$f":"IF(B186=\"\",\"\",INDIRECT(\"'\"&B186&\"'!$K$111\"))","v":{"$error":"#REF!"}},{"$f":"IF(B186=\"\",\"\",INDIRECT(\"'\"&B186&\"'!$L$111\"))","v":{"$error":"#REF!"}},{"$f":"IF(B186=\"\",\"\",INDIRECT(\"'\"&B186&\"'!$H$111\"))","v":{"$error":"#REF!"}},{"$f":"IF(B186=\"\",\"\",INDIRECT(\"'\"&B186&\"'!$I$111\"))","v":{"$error":"#REF!"}},{"$f":"IF(B186=\"\",\"\",INDIRECT(\"'\"&B186&\"'!$R$111\"))","v":{"$error":"#REF!"}},{"$f":"IF(B186=\"\",\"\",INDIRECT(\"'\"&B186&\"'!$U$111\"))","v":{"$error":"#REF!"}},{"$f":"IF(B186=\"\",\"\",INDIRECT(\"'\"&B186&\"'!$X$111\"))","v":{"$error":"#REF!"}},{"$f":"IF(B186=\"\",\"\",INDIRECT(\"'\"&B186&\"'!$Z$111\"))","v":{"$error":"#REF!"}},{"$f":"IF(B186=\"\",\"\",INDIRECT(\"'\"&B186&\"'!$AA$111\"))","v":{"$error":"#REF!"}},{"$error":"#REF!"}]
[{"$nulls":4},{"$f":"IF(B186=\"\",\"\",INDIRECT(\"'\"&B186&\"'!$A$113\"))","v":{"$error":"#REF!"}},{"$f":"IF(B186=\"\",\"\",INDIRECT(\"'\"&B186&\"'!$K$120\"))","v":{"$error":"#REF!"}},{"$f":"IF(B186=\"\",\"\",INDIRECT(\"'\"&B186&\"'!$L$120\"))","v":{"$error":"#REF!"}},{"$f":"IF(B186=\"\",\"\",INDIRECT(\"'\"&B186&\"'!$H$120\"))","v":{"$error":"#REF!"}},{"$f":"IF(B186=\"\",\"\",INDIRECT(\"'\"&B186&\"'!$I$120\"))","v":{"$error":"#REF!"}},{"$f":"IF(B186=\"\",\"\",INDIRECT(\"'\"&B186&\"'!$R$120\"))","v":{"$error":"#REF!"}},{"$f":"IF(B186=\"\",\"\",INDIRECT(\"'\"&B186&\"'!$U$120\"))","v":{"$error":"#REF!"}},{"$f":"IF(B186=\"\",\"\",INDIRECT(\"'\"&B186&\"'!$X$120\"))","v":{"$error":"#REF!"}},{"$f":"IF(B186=\"\",\"\",INDIRECT(\"'\"&B186&\"'!$Z$120\"))","v":{"$error":"#REF!"}},{"$f":"IF(B186=\"\",\"\",INDIRECT(\"'\"&B186&\"'!$AA$120\"))","v":{"$error":"#REF!"}},{"$error":"#REF!"}]
[{"$nulls":4},{"$f":"IF(B186=\"\",\"\",INDIRECT(\"'\"&B186&\"'!$A$122\"))","v":{"$error":"#REF!"}},{"$f":"IF(B186=\"\",\"\",INDIRECT(\"'\"&B186&\"'!$K$129\"))","v":{"$error":"#REF!"}},{"$f":"IF(B186=\"\",\"\",INDIRECT(\"'\"&B186&\"'!$L$129\"))","v":{"$error":"#REF!"}},{"$f":"IF(B186=\"\",\"\",INDIRECT(\"'\"&B186&\"'!$H$129\"))","v":{"$error":"#REF!"}},{"$f":"IF(B186=\"\",\"\",INDIRECT(\"'\"&B186&\"'!$I$129\"))","v":{"$error":"#REF!"}},{"$f":"IF(B186=\"\",\"\",INDIRECT(\"'\"&B186&\"'!$R$129\"))","v":{"$error":"#REF!"}},{"$f":"IF(B186=\"\",\"\",INDIRECT(\"'\"&B186&\"'!$U$129\"))","v":{"$error":"#REF!"}},{"$f":"IF(B186=\"\",\"\",INDIRECT(\"'\"&B186&\"'!$X$129\"))","v":{"$error":"#REF!"}},{"$f":"IF(B186=\"\",\"\",INDIRECT(\"'\"&B186&\"'!$Z$129\"))","v":{"$error":"#REF!"}},{"$f":"IF(B186=\"\",\"\",INDIRECT(\"'\"&B186&\"'!$AA$129\"))","v":{"$error":"#REF!"}},{"$error":"#REF!"}]
[{"$nulls":4},{"$f":"IF(B186=\"\",\"\",INDIRECT(\"'\"&B186&\"'!$A$131\"))","v":{"$error":"#REF!"}},{"$f":"IF(B186=\"\",\"\",INDIRECT(\"'\"&B186&\"'!$K$167\"))","v":{"$error":"#REF!"}},{"$f":"IF(B186=\"\",\"\",INDIRECT(\"'\"&B186&\"'!$L$167\"))","v":{"$error":"#REF!"}},{"$f":"IF(B186=\"\",\"\",INDIRECT(\"'\"&B186&\"'!$H$167\"))","v":{"$error":"#REF!"}},{"$f":"IF(B186=\"\",\"\",INDIRECT(\"'\"&B186&\"'!$I$167\"))","v":{"$error":"#REF!"}},{"$f":"IF(B186=\"\",\"\",INDIRECT(\"'\"&B186&\"'!$R$167\"))","v":{"$error":"#REF!"}},{"$f":"IF(B186=\"\",\"\",INDIRECT(\"'\"&B186&\"'!$U$167\"))","v":{"$error":"#REF!"}},{"$f":"IF(B186=\"\",\"\",INDIRECT(\"'\"&B186&\"'!$X$167\"))","v":{"$error":"#REF!"}},{"$f":"IF(B186=\"\",\"\",INDIRECT(\"'\"&B186&\"'!$Z$167\"))","v":{"$error":"#REF!"}},{"$f":"IF(B186=\"\",\"\",INDIRECT(\"'\"&B186&\"'!$AA$167\"))","v":{"$error":"#REF!"}},{"$error":"#REF!"}]
[null,{"$f":"MID(INDEX(nom_feuilles,ROW(Masque!K28)),SEARCH(\"]\",INDEX(nom_feuilles,ROW(Masque!K28)))+1,30)","v":{"$error":"#REF!"}},{"$error":"#REF!"},{"$f":"IF(B194=\"\",\"\",INDIRECT(\"'\"&B194&\"'!$A$2\"))","v":{"$error":"#REF!"}},{"$f":"IF(B194=\"\",\"\",INDIRECT(\"'\"&B194&\"'!$A$8\"))","v":{"$error":"#REF!"}},{"$f":"IF(B194=\"\",\"\",INDIRECT(\"'\"&B194&\"'!$K$30\"))","v":{"$error":"#REF!"}},{"$f":"IF(B194=\"\",\"\",INDIRECT(\"'\"&B194&\"'!$L$30\"))","v":{"$error":"#REF!"}},{"$f":"IF(B194=\"\",\"\",INDIRECT(\"'\"&B194&\"'!$H$30\"))","v":{"$error":"#REF!"}},{"$f":"IF(B194=\"\",\"\",INDIRECT(\"'\"&B194&\"'!$I$30\"))","v":{"$error":"#REF!"}},{"$f":"IF(B194=\"\",\"\",INDIRECT(\"'\"&B194&\"'!$R$30\"))","v":{"$error":"#REF!"}},{"$f":"IF(B194=\"\",\"\",INDIRECT(\"'\"&B194&\"'!$U$30\"))","v":{"$error":"#REF!"}},{"$f":"IF(B194=\"\",\"\",INDIRECT(\"'\"&B194&\"'!$X$30\"))","v":{"$error":"#REF!"}},{"$f":"IF(B194=\"\",\"\",INDIRECT(\"'\"&B194&\"'!$Z$30\"))","v":{"$error":"#REF!"}},{"$f":"IF(B194=\"\",\"\",INDIRECT(\"'\"&B194&\"'!$AA$30\"))","v":{"$error":"#REF!"}},{"$error":"#REF!"},{"$f":"SUM(O194:O201)","v":{"$error":"#REF!"}},{"$f":"IF(B194=\"\",\"\",INDIRECT(\"'\"&B194&\"'!$H$4\"))","v":{"$error":"#REF!"}},{"$f":"P194-Q194","v":{"$error":"#REF!"}}]
[{"$nulls":4},{"$f":"IF(B194=\"\",\"\",INDIRECT(\"'\"&B194&\"'!$A$32\"))","v":{"$error":"#REF!"}},{"$f":"IF(B194=\"\",\"\",INDIRECT(\"'\"&B194&\"'!$K$54\"))","v":{"$error":"#REF!"}},{"$f":"IF(B194=\"\",\"\",INDIRECT(\"'\"&B194&\"'!$L$54\"))","v":{"$error":"#REF!"}},{"$f":"IF(B194=\"\",\"\",INDIRECT(\"'\"&B194&\"'!$H$54\"))","v":{"$error":"#REF!"}},{"$f":"IF(B194=\"\",\"\",INDIRECT(\"'\"&B194&\"'!$I$54\"))","v":{"$error":"#REF!"}},{"$f":"IF(B194=\"\",\"\",INDIRECT(\"'\"&B194&\"'!$R$54\"))","v":{"$error":"#REF!"}},{"$f":"IF(B194=\"\",\"\",INDIRECT(\"'\"&B194&\"'!$U$54\"))","v":{"$error":"#REF!"}},{"$f":"IF(B194=\"\",\"\",INDIRECT(\"'\"&B194&\"'!$X$54\"))","v":{"$error":"#REF!"}},{"$f":"IF(B194=\"\",\"\",INDIRECT(\"'\"&B194&\"'!$Z$54\"))","v":{"$error":"#REF!"}},{"$f":"IF(B194=\"\",\"\",INDIRECT(\"'\"&B194&\"'!$AA$54\"))","v":{"$error":"#REF!"}},{"$error":"#REF!"}]
[{"$nulls":4},{"$f":"IF(B194=\"\",\"\",INDIRECT(\"'\"&B194&\"'!$A$56\"))","v":{"$error":"#REF!"}},{"$f":"IF(B194=\"\",\"\",INDIRECT(\"'\"&B194&\"'!$K$78\"))","v":{"$error":"#REF!"}},{"$f":"IF(B194=\"\",\"\",INDIRECT(\"'\"&B194&\"'!$L$78\"))","v":{"$error":"#REF!"}},{"$f":"IF(B194=\"\",\"\",INDIRECT(\"'\"&B194&\"'!$H$78\"))","v":{"$error":"#REF!"}},{"$f":"IF(B194=\"\",\"\",INDIRECT(\"'\"&B194&\"'!$I$78\"))","v":{"$error":"#REF!"}},{"$f":"IF(B194=\"\",\"\",INDIRECT(\"'\"&B194&\"'!$R$78\"))","v":{"$error":"#REF!"}},{"$f":"IF(B194=\"\",\"\",INDIRECT(\"'\"&B194&\"'!$U$78\"))","v":{"$error":"#REF!"}},{"$f":"IF(B194=\"\",\"\",INDIRECT(\"'\"&B194&\"'!$X$78\"))","v":{"$error":"#REF!"}},{"$f":"IF(B194=\"\",\"\",INDIRECT(\"'\"&B194&\"'!$Z$78\"))","v":{"$error":"#REF!"}},{"$f":"IF(B194=\"\",\"\",INDIRECT(\"'\"&B194&\"'!$AA$78\"))","v":{"$error":"#REF!"}},{"$error":"#REF!"}]
[{"$nulls":4},{"$f":"IF(B194=\"\",\"\",INDIRECT(\"'\"&B194&\"'!$A$80\"))","v":{"$error":"#REF!"}},{"$f":"IF(B194=\"\",\"\",INDIRECT(\"'\"&B194&\"'!$K$102\"))","v":{"$error":"#REF!"}},{"$f":"IF(B194=\"\",\"\",INDIRECT(\"'\"&B194&\"'!$L$102\"))","v":{"$error":"#REF!"}},{"$f":"IF(B194=\"\",\"\",INDIRECT(\"'\"&B194&\"'!$H$102\"))","v":{"$error":"#REF!"}},{"$f":"IF(B194=\"\",\"\",INDIRECT(\"'\"&B194&\"'!$I$102\"))","v":{"$error":"#REF!"}},{"$f":"IF(B194=\"\",\"\",INDIRECT(\"'\"&B194&\"'!$R$102\"))","v":{"$error":"#REF!"}},{"$f":"IF(B194=\"\",\"\",INDIRECT(\"'\"&B194&\"'!$U$102\"))","v":{"$error":"#REF!"}},{"$f":"IF(B194=\"\",\"\",INDIRECT(\"'\"&B194&\"'!$X$102\"))","v":{"$error":"#REF!"}},{"$f":"IF(B194=\"\",\"\",INDIRECT(\"'\"&B194&\"'!$Z$102\"))","v":{"$error":"#REF!"}},{"$f":"IF(B194=\"\",\"\",INDIRECT(\"'\"&B194&\"'!$AA$102\"))","v":{"$error":"#REF!"}},{"$error":"#REF!"}]
[{"$nulls":4},{"$f":"IF(B194=\"\",\"\",INDIRECT(\"'\"&B194&\"'!$A$104\"))","v":{"$error":"#REF!"}},{"$f":"IF(B194=\"\",\"\",INDIRECT(\"'\"&B194&\"'!$K$111\"))","v":{"$error":"#REF!"}},{"$f":"IF(B194=\"\",\"\",INDIRECT(\"'\"&B194&\"'!$L$111\"))","v":{"$error":"#REF!"}},{"$f":"IF(B194=\"\",\"\",INDIRECT(\"'\"&B194&\"'!$H$111\"))","v":{"$error":"#REF!"}},{"$f":"IF(B194=\"\",\"\",INDIRECT(\"'\"&B194&\"'!$I$111\"))","v":{"$error":"#REF!"}},{"$f":"IF(B194=\"\",\"\",INDIRECT(\"'\"&B194&\"'!$R$111\"))","v":{"$error":"#REF!"}},{"$f":"IF(B194=\"\",\"\",INDIRECT(\"'\"&B194&\"'!$U$111\"))","v":{"$error":"#REF!"}},{"$f":"IF(B194=\"\",\"\",INDIRECT(\"'\"&B194&\"'!$X$111\"))","v":{"$error":"#REF!"}},{"$f":"IF(B194=\"\",\"\",INDIRECT(\"'\"&B194&\"'!$Z$111\"))","v":{"$error":"#REF!"}},{"$f":"IF(B194=\"\",\"\",INDIRECT(\"'\"&B194&\"'!$AA$111\"))","v":{"$error":"#REF!"}},{"$error":"#REF!"}]
[{"$nulls":4},{"$f":"IF(B194=\"\",\"\",INDIRECT(\"'\"&B194&\"'!$A$113\"))","v":{"$error":"#REF!"}},{"$f":"IF(B194=\"\",\"\",INDIRECT(\"'\"&B194&\"'!$K$120\"))","v":{"$error":"#REF!"}},{"$f":"IF(B194=\"\",\"\",INDIRECT(\"'\"&B194&\"'!$L$120\"))","v":{"$error":"#REF!"}},{"$f":"IF(B194=\"\",\"\",INDIRECT(\"'\"&B194&\"'!$H$120\"))","v":{"$error":"#REF!"}},{"$f":"IF(B194=\"\",\"\",INDIRECT(\"'\"&B194&\"'!$I$120\"))","v":{"$error":"#REF!"}},{"$f":"IF(B194=\"\",\"\",INDIRECT(\"'\"&B194&\"'!$R$120\"))","v":{"$error":"#REF!"}},{"$f":"IF(B194=\"\",\"\",INDIRECT(\"'\"&B194&\"'!$U$120\"))","v":{"$error":"#REF!"}},{"$f":"IF(B194=\"\",\"\",INDIRECT(\"'\"&B194&\"'!$X$120\"))","v":{"$error":"#REF!"}},{"$f":"IF(B194=\"\",\"\",INDIRECT(\"'\"&B194&\"'!$Z$120\"))","v":{"$error":"#REF!"}},{"$f":"IF(B194=\"\",\"\",INDIRECT(\"'\"&B194&\"'!$AA$120\"))","v":{"$error":"#REF!"}},{"$error":"#REF!"}]
[{"$nulls":4},{"$f":"IF(B194=\"\",\"\",INDIRECT(\"'\"&B194&\"'!$A$122\"))","v":{"$error":"#REF!"}},{"$f":"IF(B194=\"\",\"\",INDIRECT(\"'\"&B194&\"'!$K$129\"))","v":{"$error":"#REF!"}},{"$f":"IF(B194=\"\",\"\",INDIRECT(\"'\"&B194&\"'!$L$129\"))","v":{"$error":"#REF!"}},{"$f":"IF(B194=\"\",\"\",INDIRECT(\"'\"&B194&\"'!$H$129\"))","v":{"$error":"#REF!"}},{"$f":"IF(B194=\"\",\"\",INDIRECT(\"'\"&B194&\"'!$I$129\"))","v":{"$error":"#REF!"}},{"$f":"IF(B194=\"\",\"\",INDIRECT(\"'\"&B194&\"'!$R$129\"))","v":{"$error":"#REF!"}},{"$f":"IF(B194=\"\",\"\",INDIRECT(\"'\"&B194&\"'!$U$129\"))","v":{"$error":"#REF!"}},{"$f":"IF(B194=\"\",\"\",INDIRECT(\"'\"&B194&\"'!$X$129\"))","v":{"$error":"#REF!"}},{"$f":"IF(B194=\"\",\"\",INDIRECT(\"'\"&B194&\"'!$Z$129\"))","v":{"$error":"#REF!"}},{"$f":"IF(B194=\"\",\"\",INDIRECT(\"'\"&B194&\"'!$AA$129\"))","v":{"$error":"#REF!"}},{"$error":"#REF!"}]
[{"$nulls":4},{"$f":"IF(B194=\"\",\"\",INDIRECT(\"'\"&B194&\"'!$A$131\"))","v":{"$error":"#REF!"}},{"$f":"IF(B194=\"\",\"\",INDIRECT(\"'\"&B194&\"'!$K$167\"))","v":{"$error":"#REF!"}},{"$f":"IF(B194=\"\",\"\",INDIRECT(\"'\"&B194&\"'!$L$167\"))","v":{"$error":"#REF!"}},{"$f":"IF(B194=\"\",\"\",INDIRECT(\"'\"&B194&\"'!$H$167\"))","v":{"$error":"#REF!"}},{"$f":"IF(B194=\"\",\"\",INDIRECT(\"'\"&B194&\"'!$I$167\"))","v":{"$error":"#REF!"}},{"$f":"IF(B194=\"\",\"\",INDIRECT(\"'\"&B194&\"'!$R$167\"))","v":{"$error":"#REF!"}},{"$f":"IF(B194=\"\",\"\",INDIRECT(\"'\"&B194&\"'!$U$167\"))","v":{"$error":"#REF!"}},{"$f":"IF(B194=\"\",\"\",INDIRECT(\"'\"&B194&\"'!$X$167\"))","v":{"$error":"#REF!"}},{"$f":"IF(B194=\"\",\"\",INDIRECT(\"'\"&B194&\"'!$Z$167\"))","v":{"$error":"#REF!"}},{"$f":"IF(B194=\"\",\"\",INDIRECT(\"'\"&B194&\"'!$AA$167\"))","v":{"$error":"#REF!"}},{"$error":"#REF!"}]
[null,{"$f":"MID(INDEX(nom_feuilles,ROW(Masque!K29)),SEARCH(\"]\",INDEX(nom_feuilles,ROW(Masque!K29)))+1,30)","v":{"$error":"#REF!"}},{"$f":"IF(B202=\"\",\"\",INDIRECT(\"'\"&B202&\"'!$A$1\"))","v":{"$error":"#REF!"}},{"$f":"IF(B202=\"\",\"\",INDIRECT(\"'\"&B202&\"'!$A$2\"))","v":{"$error":"#REF!"}},{"$f":"IF(B202=\"\",\"\",INDIRECT(\"'\"&B202&\"'!$A$8\"))","v":{"$error":"#REF!"}},{"$f":"IF(B202=\"\",\"\",INDIRECT(\"'\"&B202&\"'!$K$30\"))","v":{"$error":"#REF!"}},{"$f":"IF(B202=\"\",\"\",INDIRECT(\"'\"&B202&\"'!$L$30\"))","v":{"$error":"#REF!"}},{"$f":"IF(B202=\"\",\"\",INDIRECT(\"'\"&B202&\"'!$H$30\"))","v":{"$error":"#REF!"}},{"$f":"IF(B202=\"\",\"\",INDIRECT(\"'\"&B202&\"'!$I$30\"))","v":{"$error":"#REF!"}},{"$f":"IF(B202=\"\",\"\",INDIRECT(\"'\"&B202&\"'!$R$30\"))","v":{"$error":"#REF!"}},{"$f":"IF(B202=\"\",\"\",INDIRECT(\"'\"&B202&\"'!$U$30\"))","v":{"$error":"#REF!"}},{"$f":"IF(B202=\"\",\"\",INDIRECT(\"'\"&B202&\"'!$X$30\"))","v":{"$error":"#REF!"}},{"$f":"IF(B202=\"\",\"\",INDIRECT(\"'\"&B202&\"'!$Z$30\"))","v":{"$error":"#REF!"}},{"$f":"IF(B202=\"\",\"\",INDIRECT(\"'\"&B202&\"'!$AA$30\"))","v":{"$error":"#REF!"}},{"$f":"SUM(F202:N202)","v":{"$error":"#REF!"}},{"$f":"SUM(O202:O209)","v":{"$error":"#REF!"}},{"$f":"IF(B202=\"\",\"\",INDIRECT(\"'\"&B202&\"'!$H$4\"))","v":{"$error":"#REF!"}},{"$f":"P202-Q202","v":{"$error":"#REF!"}}]
[{"$nulls":4},{"$f":"IF(B202=\"\",\"\",INDIRECT(\"'\"&B202&\"'!$A$32\"))","v":{"$error":"#REF!"}},{"$f":"IF(B202=\"\",\"\",INDIRECT(\"'\"&B202&\"'!$K$54\"))","v":{"$error":"#REF!"}},{"$f":"IF(B202=\"\",\"\",INDIRECT(\"'\"&B202&\"'!$L$54\"))","v":{"$error":"#REF!"}},{"$f":"IF(B202=\"\",\"\",INDIRECT(\"'\"&B202&\"'!$H$54\"))","v":{"$error":"#REF!"}},{"$f":"IF(B202=\"\",\"\",INDIRECT(\"'\"&B202&\"'!$I$54\"))","v":{"$error":"#REF!"}},{"$f":"IF(B202=\"\",\"\",INDIRECT(\"'\"&B202&\"'!$R$54\"))","v":{"$error":"#REF!"}},{"$f":"IF(B202=\"\",\"\",INDIRECT(\"'\"&B202&\"'!$U$54\"))","v":{"$error":"#REF!"}},{"$f":"IF(B202=\"\",\"\",INDIRECT(\"'\"&B202&\"'!$X$54\"))","v":{"$error":"#REF!"}},{"$f":"IF(B202=\"\",\"\",INDIRECT(\"'\"&B202&\"'!$Z$54\"))","v":{"$error":"#REF!"}},{"$f":"IF(B202=\"\",\"\",INDIRECT(\"'\"&B202&\"'!$AA$54\"))","v":{"$error":"#REF!"}},{"$error":"#REF!"}]
[{"$nulls":4},{"$f":"IF(B202=\"\",\"\",INDIRECT(\"'\"&B202&\"'!$A$56\"))","v":{"$error":"#REF!"}},{"$f":"IF(B202=\"\",\"\",INDIRECT(\"'\"&B202&\"'!$K$78\"))","v":{"$error":"#REF!"}},{"$f":"IF(B202=\"\",\"\",INDIRECT(\"'\"&B202&\"'!$L$78\"))","v":{"$error":"#REF!"}},{"$f":"IF(B202=\"\",\"\",INDIRECT(\"'\"&B202&\"'!$H$78\"))","v":{"$error":"#REF!"}},{"$f":"IF(B202=\"\",\"\",INDIRECT(\"'\"&B202&\"'!$I$78\"))","v":{"$error":"#REF!"}},{"$f":"IF(B202=\"\",\"\",INDIRECT(\"'\"&B202&\"'!$R$78\"))","v":{"$error":"#REF!"}},{"$f":"IF(B202=\"\",\"\",INDIRECT(\"'\"&B202&\"'!$U$78\"))","v":{"$error":"#REF!"}},{"$f":"IF(B202=\"\",\"\",INDIRECT(\"'\"&B202&\"'!$X$78\"))","v":{"$error":"#REF!"}},{"$f":"IF(B202=\"\",\"\",INDIRECT(\"'\"&B202&\"'!$Z$78\"))","v":{"$error":"#REF!"}},{"$f":"IF(B202=\"\",\"\",INDIRECT(\"'\"&B202&\"'!$AA$78\"))","v":{"$error":"#REF!"}},{"$error":"#REF!"}]
[{"$nulls":4},{"$f":"IF(B202=\"\",\"\",INDIRECT(\"'\"&B202&\"'!$A$80\"))","v":{"$error":"#REF!"}},{"$f":"IF(B202=\"\",\"\",INDIRECT(\"'\"&B202&\"'!$K$102\"))","v":{"$error":"#REF!"}},{"$f":"IF(B202=\"\",\"\",INDIRECT(\"'\"&B202&\"'!$L$102\"))","v":{"$error":"#REF!"}},{"$f":"IF(B202=\"\",\"\",INDIRECT(\"'\"&B202&\"'!$H$102\"))","v":{"$error":"#REF!"}},{"$f":"IF(B202=\"\",\"\",INDIRECT(\"'\"&B202&\"'!$I$102\"))","v":{"$error":"#REF!"}},{"$f":"IF(B202=\"\",\"\",INDIRECT(\"'\"&B202&\"'!$R$102\"))","v":{"$error":"#REF!"}},{"$f":"IF(B202=\"\",\"\",INDIRECT(\"'\"&B202&\"'!$U$102\"))","v":{"$error":"#REF!"}},{"$f":"IF(B202=\"\",\"\",INDIRECT(\"'\"&B202&\"'!$X$102\"))","v":{"$error":"#REF!"}},{"$f":"IF(B202=\"\",\"\",INDIRECT(\"'\"&B202&\"'!$Z$102\"))","v":{"$error":"#REF!"}},{"$f":"IF(B202=\"\",\"\",INDIRECT(\"'\"&B202&\"'!$AA$102\"))","v":{"$error":"#REF!"}},{"$error":"#REF!"}]
[{"$nulls":4},{"$f":"IF(B202=\"\",\"\",INDIRECT(\"'\"&B202&\"'!$A$104\"))","v":{"$error":"#REF!"}},{"$f":"IF(B202=\"\",\"\",INDIRECT(\"'\"&B202&\"'!$K$111\"))","v":{"$error":"#REF!"}},{"$f":"IF(B202=\"\",\"\",INDIRECT(\"'\"&B202&\"'!$L$111\"))","v":{"$error":"#REF!"}},{"$f":"IF(B202=\"\",\"\",INDIRECT(\"'\"&B202&\"'!$H$111\"))","v":{"$error":"#REF!"}},{"$f":"IF(B202=\"\",\"\",INDIRECT(\"'\"&B202&\"'!$I$111\"))","v":{"$error":"#REF!"}},{"$f":"IF(B202=\"\",\"\",INDIRECT(\"'\"&B202&\"'!$R$111\"))","v":{"$error":"#REF!"}},{"$f":"IF(B202=\"\",\"\",INDIRECT(\"'\"&B202&\"'!$U$111\"))","v":{"$error":"#REF!"}},{"$f":"IF(B202=\"\",\"\",INDIRECT(\"'\"&B202&\"'!$X$111\"))","v":{"$error":"#REF!"}},{"$f":"IF(B202=\"\",\"\",INDIRECT(\"'\"&B202&\"'!$Z$111\"))","v":{"$error":"#REF!"}},{"$f":"IF(B202=\"\",\"\",INDIRECT(\"'\"&B202&\"'!$AA$111\"))","v":{"$error":"#REF!"}},{"$error":"#REF!"}]
[{"$nulls":4},{"$f":"IF(B202=\"\",\"\",INDIRECT(\"'\"&B202&\"'!$A$113\"))","v":{"$error":"#REF!"}},{"$f":"IF(B202=\"\",\"\",INDIRECT(\"'\"&B202&\"'!$K$120\"))","v":{"$error":"#REF!"}},{"$f":"IF(B202=\"\",\"\",INDIRECT(\"'\"&B202&\"'!$L$120\"))","v":{"$error":"#REF!"}},{"$f":"IF(B202=\"\",\"\",INDIRECT(\"'\"&B202&\"'!$H$120\"))","v":{"$error":"#REF!"}},{"$f":"IF(B202=\"\",\"\",INDIRECT(\"'\"&B202&\"'!$I$120\"))","v":{"$error":"#REF!"}},{"$f":"IF(B202=\"\",\"\",INDIRECT(\"'\"&B202&\"'!$R$120\"))","v":{"$error":"#REF!"}},{"$f":"IF(B202=\"\",\"\",INDIRECT(\"'\"&B202&\"'!$U$120\"))","v":{"$error":"#REF!"}},{"$f":"IF(B202=\"\",\"\",INDIRECT(\"'\"&B202&\"'!$X$120\"))","v":{"$error":"#REF!"}},{"$f":"IF(B202=\"\",\"\",INDIRECT(\"'\"&B202&\"'!$Z$120\"))","v":{"$error":"#REF!"}},{"$f":"IF(B202=\"\",\"\",INDIRECT(\"'\"&B202&\"'!$AA$120\"))","v":{"$error":"#REF!"}},{"$error":"#REF!"}]
[{"$nulls":4},{"$f":"IF(B202=\"\",\"\",INDIRECT(\"'\"&B202&\"'!$A$122\"))","v":{"$error":"#REF!"}},{"$f":"IF(B202=\"\",\"\",INDIRECT(\"'\"&B202&\"'!$K$129\"))","v":{"$error":"#REF!"}},{"$f":"IF(B202=\"\",\"\",INDIRECT(\"'\"&B202&\"'!$L$129\"))","v":{"$error":"#REF!"}},{"$f":"IF(B202=\"\",\"\",INDIRECT(\"'\"&B202&\"'!$H$129\"))","v":{"$error":"#REF!"}},{"$f":"IF(B202=\"\",\"\",INDIRECT(\"'\"&B202&\"'!$I$129\"))","v":{"$error":"#REF!"}},{"$f":"IF(B202=\"\",\"\",INDIRECT(\"'\"&B202&\"'!$R$129\"))","v":{"$error":"#REF!"}},{"$f":"IF(B202=\"\",\"\",INDIRECT(\"'\"&B202&\"'!$U$129\"))","v":{"$error":"#REF!"}},{"$f":"IF(B202=\"\",\"\",INDIRECT(\"'\"&B202&\"'!$X$129\"))","v":{"$error":"#REF!"}},{"$f":"IF(B202=\"\",\"\",INDIRECT(\"'\"&B202&\"'!$Z$129\"))","v":{"$error":"#REF!"}},{"$f":"IF(B202=\"\",\"\",INDIRECT(\"'\"&B202&\"'!$AA$129\"))","v":{"$error":"#REF!"}},{"$error":"#REF!"}]
[{"$nulls":4},{"$f":"IF(B202=\"\",\"\",INDIRECT(\"'\"&B202&\"'!$A$131\"))","v":{"$error":"#REF!"}},{"$f":"IF(B202=\"\",\"\",INDIRECT(\"'\"&B202&\"'!$K$167\"))","v":{"$error":"#REF!"}},{"$f":"IF(B202=\"\",\"\",INDIRECT(\"'\"&B202&\"'!$L$167\"))","v":{"$error":"#REF!"}},{"$f":"IF(B202=\"\",\"\",INDIRECT(\"'\"&B202&\"'!$H$167\"))","v":{"$error":"#REF!"}},{"$f":"IF(B202=\"\",\"\",INDIRECT(\"'\"&B202&\"'!$I$167\"))","v":{"$error":"#REF!"}},{"$f":"IF(B202=\"\",\"\",INDIRECT(\"'\"&B202&\"'!$R$167\"))","v":{"$error":"#REF!"}},{"$f":"IF(B202=\"\",\"\",INDIRECT(\"'\"&B202&\"'!$U$167\"))","v":{"$error":"#REF!"}},{"$f":"IF(B202=\"\",\"\",INDIRECT(\"'\"&B202&\"'!$X$167\"))","v":{"$error":"#REF!"}},{"$f":"IF(B202=\"\",\"\",INDIRECT(\"'\"&B202&\"'!$Z$167\"))","v":{"$error":"#REF!"}},{"$f":"IF(B202=\"\",\"\",INDIRECT(\"'\"&B202&\"'!$AA$167\"))","v":{"$error":"#REF!"}},{"$error":"#REF!"}]
[null,{"$f":"MID(INDEX(nom_feuilles,ROW(Masque!K30)),SEARCH(\"]\",INDEX(nom_feuilles,ROW(Masque!K30)))+1,30)","v":{"$error":"#REF!"}},{"$error":"#REF!"},{"$f":"IF(B210=\"\",\"\",INDIRECT(\"'\"&B210&\"'!$A$2\"))","v":{"$error":"#REF!"}},{"$f":"IF(B210=\"\",\"\",INDIRECT(\"'\"&B210&\"'!$A$8\"))","v":{"$error":"#REF!"}},{"$f":"IF(B210=\"\",\"\",INDIRECT(\"'\"&B210&\"'!$K$30\"))","v":{"$error":"#REF!"}},{"$f":"IF(B210=\"\",\"\",INDIRECT(\"'\"&B210&\"'!$L$30\"))","v":{"$error":"#REF!"}},{"$f":"IF(B210=\"\",\"\",INDIRECT(\"'\"&B210&\"'!$H$30\"))","v":{"$error":"#REF!"}},{"$f":"IF(B210=\"\",\"\",INDIRECT(\"'\"&B210&\"'!$I$30\"))","v":{"$error":"#REF!"}},{"$f":"IF(B210=\"\",\"\",INDIRECT(\"'\"&B210&\"'!$R$30\"))","v":{"$error":"#REF!"}},{"$f":"IF(B210=\"\",\"\",INDIRECT(\"'\"&B210&\"'!$U$30\"))","v":{"$error":"#REF!"}},{"$f":"IF(B210=\"\",\"\",INDIRECT(\"'\"&B210&\"'!$X$30\"))","v":{"$error":"#REF!"}},{"$f":"IF(B210=\"\",\"\",INDIRECT(\"'\"&B210&\"'!$Z$30\"))","v":{"$error":"#REF!"}},{"$f":"IF(B210=\"\",\"\",INDIRECT(\"'\"&B210&\"'!$AA$30\"))","v":{"$error":"#REF!"}},{"$error":"#REF!"},{"$f":"SUM(O210:O217)","v":{"$error":"#REF!"}},{"$f":"IF(B210=\"\",\"\",INDIRECT(\"'\"&B210&\"'!$H$4\"))","v":{"$error":"#REF!"}},{"$f":"P210-Q210","v":{"$error":"#REF!"}}]
[{"$nulls":4},{"$f":"IF(B210=\"\",\"\",INDIRECT(\"'\"&B210&\"'!$A$32\"))","v":{"$error":"#REF!"}},{"$f":"IF(B210=\"\",\"\",INDIRECT(\"'\"&B210&\"'!$K$54\"))","v":{"$error":"#REF!"}},{"$f":"IF(B210=\"\",\"\",INDIRECT(\"'\"&B210&\"'!$L$54\"))","v":{"$error":"#REF!"}},{"$f":"IF(B210=\"\",\"\",INDIRECT(\"'\"&B210&\"'!$H$54\"))","v":{"$error":"#REF!"}},{"$f":"IF(B210=\"\",\"\",INDIRECT(\"'\"&B210&\"'!$I$54\"))","v":{"$error":"#REF!"}},{"$f":"IF(B210=\"\",\"\",INDIRECT(\"'\"&B210&\"'!$R$54\"))","v":{"$error":"#REF!"}},{"$f":"IF(B210=\"\",\"\",INDIRECT(\"'\"&B210&\"'!$U$54\"))","v":{"$error":"#REF!"}},{"$f":"IF(B210=\"\",\"\",INDIRECT(\"'\"&B210&\"'!$X$54\"))","v":{"$error":"#REF!"}},{"$f":"IF(B210=\"\",\"\",INDIRECT(\"'\"&B210&\"'!$Z$54\"))","v":{"$error":"#REF!"}},{"$f":"IF(B210=\"\",\"\",INDIRECT(\"'\"&B210&\"'!$AA$54\"))","v":{"$error":"#REF!"}},{"$error":"#REF!"}]
[{"$nulls":4},{"$f":"IF(B210=\"\",\"\",INDIRECT(\"'\"&B210&\"'!$A$56\"))","v":{"$error":"#REF!"}},{"$f":"IF(B210=\"\",\"\",INDIRECT(\"'\"&B210&\"'!$K$78\"))","v":{"$error":"#REF!"}},{"$f":"IF(B210=\"\",\"\",INDIRECT(\"'\"&B210&\"'!$L$78\"))","v":{"$error":"#REF!"}},{"$f":"IF(B210=\"\",\"\",INDIRECT(\"'\"&B210&\"'!$H$78\"))","v":{"$error":"#REF!"}},{"$f":"IF(B210=\"\",\"\",INDIRECT(\"'\"&B210&\"'!$I$78\"))","v":{"$error":"#REF!"}},{"$f":"IF(B210=\"\",\"\",INDIRECT(\"'\"&B210&\"'!$R$78\"))","v":{"$error":"#REF!"}},{"$f":"IF(B210=\"\",\"\",INDIRECT(\"'\"&B210&\"'!$U$78\"))","v":{"$error":"#REF!"}},{"$f":"IF(B210=\"\",\"\",INDIRECT(\"'\"&B210&\"'!$X$78\"))","v":{"$error":"#REF!"}},{"$f":"IF(B210=\"\",\"\",INDIRECT(\"'\"&B210&\"'!$Z$78\"))","v":{"$error":"#REF!"}},{"$f":"IF(B210=\"\",\"\",INDIRECT(\"'\"&B210&\"'!$AA$78\"))","v":{"$error":"#REF!"}},{"$error":"#REF!"}]
[{"$nulls":4},{"$f":"IF(B210=\"\",\"\",INDIRECT(\"'\"&B210&\"'!$A$80\"))","v":{"$error":"#REF!"}},{"$f":"IF(B210=\"\",\"\",INDIRECT(\"'\"&B210&\"'!$K$102\"))","v":{"$error":"#REF!"}},{"$f":"IF(B210=\"\",\"\",INDIRECT(\"'\"&B210&\"'!$L$102\"))","v":{"$error":"#REF!"}},{"$f":"IF(B210=\"\",\"\",INDIRECT(\"'\"&B210&\"'!$H$102\"))","v":{"$error":"#REF!"}},{"$f":"IF(B210=\"\",\"\",INDIRECT(\"'\"&B210&\"'!$I$102\"))","v":{"$error":"#REF!"}},{"$f":"IF(B210=\"\",\"\",INDIRECT(\"'\"&B210&\"'!$R$102\"))","v":{"$error":"#REF!"}},{"$f":"IF(B210=\"\",\"\",INDIRECT(\"'\"&B210&\"'!$U$102\"))","v":{"$error":"#REF!"}},{"$f":"IF(B210=\"\",\"\",INDIRECT(\"'\"&B210&\"'!$X$102\"))","v":{"$error":"#REF!"}},{"$f":"IF(B210=\"\",\"\",INDIRECT(\"'\"&B210&\"'!$Z$102\"))","v":{"$error":"#REF!"}},{"$f":"IF(B210=\"\",\"\",INDIRECT(\"'\"&B210&\"'!$AA$102\"))","v":{"$error":"#REF!"}},{"$error":"#REF!"}]
[{"$nulls":4},{"$f":"IF(B210=\"\",\"\",INDIRECT(\"'\"&B210&\"'!$A$104\"))","v":{"$error":"#REF!"}},{"$f":"IF(B210=\"\",\"\",INDIRECT(\"'\"&B210&\"'!$K$111\"))","v":{"$error":"#REF!"}},{"$f":"IF(B210=\"\",\"\",INDIRECT(\"'\"&B210&\"'!$L$111\"))","v":{"$error":"#REF!"}},{"$f":"IF(B210=\"\",\"\",INDIRECT(\"'\"&B210&\"'!$H$111\"))","v":{"$error":"#REF!"}},{"$f":"IF(B210=\"\",\"\",INDIRECT(\"'\"&B210&\"'!$I$111\"))","v":{"$error":"#REF!"}},{"$f":"IF(B210=\"\",\"\",INDIRECT(\"'\"&B210&\"'!$R$111\"))","v":{"$error":"#REF!"}},{"$f":"IF(B210=\"\",\"\",INDIRECT(\"'\"&B210&\"'!$U$111\"))","v":{"$error":"#REF!"}},{"$f":"IF(B210=\"\",\"\",INDIRECT(\"'\"&B210&\"'!$X$111\"))","v":{"$error":"#REF!"}},{"$f":"IF(B210=\"\",\"\",INDIRECT(\"'\"&B210&\"'!$Z$111\"))","v":{"$error":"#REF!"}},{"$f":"IF(B210=\"\",\"\",INDIRECT(\"'\"&B210&\"'!$AA$111\"))","v":{"$error":"#REF!"}},{"$error":"#REF!"}]
[{"$nulls":4},{"$f":"IF(B210=\"\",\"\",INDIRECT(\"'\"&B210&\"'!$A$113\"))","v":{"$error":"#REF!"}},{"$f":"IF(B210=\"\",\"\",INDIRECT(\"'\"&B210&\"'!$K$120\"))","v":{"$error":"#REF!"}},{"$f":"IF(B210=\"\",\"\",INDIRECT(\"'\"&B210&\"'!$L$120\"))","v":{"$error":"#REF!"}},{"$f":"IF(B210=\"\",\"\",INDIRECT(\"'\"&B210&\"'!$H$120\"))","v":{"$error":"#REF!"}},{"$f":"IF(B210=\"\",\"\",INDIRECT(\"'\"&B210&\"'!$I$120\"))","v":{"$error":"#REF!"}},{"$f":"IF(B210=\"\",\"\",INDIRECT(\"'\"&B210&\"'!$R$120\"))","v":{"$error":"#REF!"}},{"$f":"IF(B210=\"\",\"\",INDIRECT(\"'\"&B210&\"'!$U$120\"))","v":{"$error":"#REF!"}},{"$f":"IF(B210=\"\",\"\",INDIRECT(\"'\"&B210&\"'!$X$120\"))","v":{"$error":"#REF!"}},{"$f":"IF(B210=\"\",\"\",INDIRECT(\"'\"&B210&\"'!$Z$120\"))","v":{"$error":"#REF!"}},{"$f":"IF(B210=\"\",\"\",INDIRECT(\"'\"&B210&\"'!$AA$120\"))","v":{"$error":"#REF!"}},{"$error":"#REF!"}]
[{"$nulls":4},{"$f":"IF(B210=\"\",\"\",INDIRECT(\"'\"&B210&\"'!$A$122\"))","v":{"$error":"#REF!"}},{"$f":"IF(B210=\"\",\"\",INDIRECT(\"'\"&B210&\"'!$K$129\"))","v":{"$error":"#REF!"}},{"$f":"IF(B210=\"\",\"\",INDIRECT(\"'\"&B210&\"'!$L$129\"))","v":{"$error":"#REF!"}},{"$f":"IF(B210=\"\",\"\",INDIRECT(\"'\"&B210&\"'!$H$129\"))","v":{"$error":"#REF!"}},{"$f":"IF(B210=\"\",\"\",INDIRECT(\"'\"&B210&\"'!$I$129\"))","v":{"$error":"#REF!"}},{"$f":"IF(B210=\"\",\"\",INDIRECT(\"'\"&B210&\"'!$R$129\"))","v":{"$error":"#REF!"}},{"$f":"IF(B210=\"\",\"\",INDIRECT(\"'\"&B210&\"'!$U$129\"))","v":{"$error":"#REF!"}},{"$f":"IF(B210=\"\",\"\",INDIRECT(\"'\"&B210&\"'!$X$129\"))","v":{"$error":"#REF!"}},{"$f":"IF(B210=\"\",\"\",INDIRECT(\"'\"&B210&\"'!$Z$129\"))","v":{"$error":"#REF!"}},{"$f":"IF(B210=\"\",\"\",INDIRECT(\"'\"&B210&\"'!$AA$129\"))","v":{"$error":"#REF!"}},{"$error":"#REF!"}]
[{"$nulls":4},{"$f":"IF(B210=\"\",\"\",INDIRECT(\"'\"&B210&\"'!$A$131\"))","v":{"$error":"#REF!"}},{"$f":"IF(B210=\"\",\"\",INDIRECT(\"'\"&B210&\"'!$K$167\"))","v":{"$error":"#REF!"}},{"$f":"IF(B210=\"\",\"\",INDIRECT(\"'\"&B210&\"'!$L$167\"))","v":{"$error":"#REF!"}},{"$f":"IF(B210=\"\",\"\",INDIRECT(\"'\"&B210&\"'!$H$167\"))","v":{"$error":"#REF!"}},{"$f":"IF(B210=\"\",\"\",INDIRECT(\"'\"&B210&\"'!$I$167\"))","v":{"$error":"#REF!"}},{"$f":"IF(B210=\"\",\"\",INDIRECT(\"'\"&B210&\"'!$R$167\"))","v":{"$error":"#REF!"}},{"$f":"IF(B210=\"\",\"\",INDIRECT(\"'\"&B210&\"'!$U$167\"))","v":{"$error":"#REF!"}},{"$f":"IF(B210=\"\",\"\",INDIRECT(\"'\"&B210&\"'!$X$167\"))","v":{"$error":"#REF!"}},{"$f":"IF(B210=\"\",\"\",INDIRECT(\"'\"&B210&\"'!$Z$167\"))","v":{"$error":"#REF!"}},{"$f":"IF(B210=\"\",\"\",INDIRECT(\"'\"&B210&\"'!$AA$167\"))","v":{"$error":"#REF!"}},{"$error":"#REF!"}]
[null,{"$f":"MID(INDEX(nom_feuilles,ROW(Masque!K31)),SEARCH(\"]\",INDEX(nom_feuilles,ROW(Masque!K31)))+1,30)","v":{"$error":"#REF!"}},{"$f":"IF(B218=\"\",\"\",INDIRECT(\"'\"&B218&\"'!$A$1\"))","v":{"$error":"#REF!"}},{"$f":"IF(B218=\"\",\"\",INDIRECT(\"'\"&B218&\"'!$A$2\"))","v":{"$error":"#REF!"}},{"$f":"IF(B218=\"\",\"\",INDIRECT(\"'\"&B218&\"'!$A$8\"))","v":{"$error":"#REF!"}},{"$f":"IF(B218=\"\",\"\",INDIRECT(\"'\"&B218&\"'!$K$30\"))","v":{"$error":"#REF!"}},{"$f":"IF(B218=\"\",\"\",INDIRECT(\"'\"&B218&\"'!$L$30\"))","v":{"$error":"#REF!"}},{"$f":"IF(B218=\"\",\"\",INDIRECT(\"'\"&B218&\"'!$H$30\"))","v":{"$error":"#REF!"}},{"$f":"IF(B218=\"\",\"\",INDIRECT(\"'\"&B218&\"'!$I$30\"))","v":{"$error":"#REF!"}},{"$f":"IF(B218=\"\",\"\",INDIRECT(\"'\"&B218&\"'!$R$30\"))","v":{"$error":"#REF!"}},{"$f":"IF(B218=\"\",\"\",INDIRECT(\"'\"&B218&\"'!$U$30\"))","v":{"$error":"#REF!"}},{"$f":"IF(B218=\"\",\"\",INDIRECT(\"'\"&B218&\"'!$X$30\"))","v":{"$error":"#REF!"}},{"$f":"IF(B218=\"\",\"\",INDIRECT(\"'\"&B218&\"'!$Z$30\"))","v":{"$error":"#REF!"}},{"$f":"IF(B218=\"\",\"\",INDIRECT(\"'\"&B218&\"'!$AA$30\"))","v":{"$error":"#REF!"}},{"$f":"SUM(F218:N218)","v":{"$error":"#REF!"}},{"$f":"SUM(O218:O225)","v":{"$error":"#REF!"}},{"$f":"IF(B218=\"\",\"\",INDIRECT(\"'\"&B218&\"'!$H$4\"))","v":{"$error":"#REF!"}},{"$f":"P218-Q218","v":{"$error":"#REF!"}}]
[{"$nulls":4},{"$f":"IF(B218=\"\",\"\",INDIRECT(\"'\"&B218&\"'!$A$32\"))","v":{"$error":"#REF!"}},{"$f":"IF(B218=\"\",\"\",INDIRECT(\"'\"&B218&\"'!$K$54\"))","v":{"$error":"#REF!"}},{"$f":"IF(B218=\"\",\"\",INDIRECT(\"'\"&B218&\"'!$L$54\"))","v":{"$error":"#REF!"}},{"$f":"IF(B218=\"\",\"\",INDIRECT(\"'\"&B218&\"'!$H$54\"))","v":{"$error":"#REF!"}},{"$f":"IF(B218=\"\",\"\",INDIRECT(\"'\"&B218&\"'!$I$54\"))","v":{"$error":"#REF!"}},{"$f":"IF(B218=\"\",\"\",INDIRECT(\"'\"&B218&\"'!$R$54\"))","v":{"$error":"#REF!"}},{"$f":"IF(B218=\"\",\"\",INDIRECT(\"'\"&B218&\"'!$U$54\"))","v":{"$error":"#REF!"}},{"$f":"IF(B218=\"\",\"\",INDIRECT(\"'\"&B218&\"'!$X$54\"))","v":{"$error":"#REF!"}},{"$f":"IF(B218=\"\",\"\",INDIRECT(\"'\"&B218&\"'!$Z$54\"))","v":{"$error":"#REF!"}},{"$f":"IF(B218=\"\",\"\",INDIRECT(\"'\"&B218&\"'!$AA$54\"))","v":{"$error":"#REF!"}},{"$error":"#REF!"}]
[{"$nulls":4},{"$f":"IF(B218=\"\",\"\",INDIRECT(\"'\"&B218&\"'!$A$56\"))","v":{"$error":"#REF!"}},{"$f":"IF(B218=\"\",\"\",INDIRECT(\"'\"&B218&\"'!$K$78\"))","v":{"$error":"#REF!"}},{"$f":"IF(B218=\"\",\"\",INDIRECT(\"'\"&B218&\"'!$L$78\"))","v":{"$error":"#REF!"}},{"$f":"IF(B218=\"\",\"\",INDIRECT(\"'\"&B218&\"'!$H$78\"))","v":{"$error":"#REF!"}},{"$f":"IF(B218=\"\",\"\",INDIRECT(\"'\"&B218&\"'!$I$78\"))","v":{"$error":"#REF!"}},{"$f":"IF(B218=\"\",\"\",INDIRECT(\"'\"&B218&\"'!$R$78\"))","v":{"$error":"#REF!"}},{"$f":"IF(B218=\"\",\"\",INDIRECT(\"'\"&B218&\"'!$U$78\"))","v":{"$error":"#REF!"}},{"$f":"IF(B218=\"\",\"\",INDIRECT(\"'\"&B218&\"'!$X$78\"))","v":{"$error":"#REF!"}},{"$f":"IF(B218=\"\",\"\",INDIRECT(\"'\"&B218&\"'!$Z$78\"))","v":{"$error":"#REF!"}},{"$f":"IF(B218=\"\",\"\",INDIRECT(\"'\"&B218&\"'!$AA$78\"))","v":{"$error":"#REF!"}},{"$error":"#REF!"}]
[{"$nulls":4},{"$f":"IF(B218=\"\",\"\",INDIRECT(\"'\"&B218&\"'!$A$80\"))","v":{"$error":"#REF!"}},{"$f":"IF(B218=\"\",\"\",INDIRECT(\"'\"&B218&\"'!$K$102\"))","v":{"$error":"#REF!"}},{"$f":"IF(B218=\"\",\"\",INDIRECT(\"'\"&B218&\"'!$L$102\"))","v":{"$error":"#REF!"}},{"$f":"IF(B218=\"\",\"\",INDIRECT(\"'\"&B218&\"'!$H$102\"))","v":{"$error":"#REF!"}},{"$f":"IF(B218=\"\",\"\",INDIRECT(\"'\"&B218&\"'!$I$102\"))","v":{"$error":"#REF!"}},{"$f":"IF(B218=\"\",\"\",INDIRECT(\"'\"&B218&\"'!$R$102\"))","v":{"$error":"#REF!"}},{"$f":"IF(B218=\"\",\"\",INDIRECT(\"'\"&B218&\"'!$U$102\"))","v":{"$error":"#REF!"}},{"$f":"IF(B218=\"\",\"\",INDIRECT(\"'\"&B218&\"'!$X$102\"))","v":{"$error":"#REF!"}},{"$f":"IF(B218=\"\",\"\",INDIRECT(\"'\"&B218&\"'!$Z$102\"))","v":{"$error":"#REF!"}},{"$f":"IF(B218=\"\",\"\",INDIRECT(\"'\"&B218&\"'!$AA$102\"))","v":{"$error":"#REF!"}},{"$error":"#REF!"}]
[{"$nulls":4},{"$f":"IF(B218=\"\",\"\",INDIRECT(\"'\"&B218&\"'!$A$104\"))","v":{"$error":"#REF!"}},{"$f":"IF(B218=\"\",\"\",INDIRECT(\"'\"&B218&\"'!$K$111\"))","v":{"$error":"#REF!"}},{"$f":"IF(B218=\"\",\"\",INDIRECT(\"'\"&B218&\"'!$L$111\"))","v":{"$error":"#REF!"}},{"$f":"IF(B218=\"\",\"\",INDIRECT(\"'\"&B218&\"'!$H$111\"))","v":{"$error":"#REF!"}},{"$f":"IF(B218=\"\",\"\",INDIRECT(\"'\"&B218&\"'!$I$111\"))","v":{"$error":"#REF!"}},{"$f":"IF(B218=\"\",\"\",INDIRECT(\"'\"&B218&\"'!$R$111\"))","v":{"$error":"#REF!"}},{"$f":"IF(B218=\"\",\"\",INDIRECT(\"'\"&B218&\"'!$U$111\"))","v":{"$error":"#REF!"}},{"$f":"IF(B218=\"\",\"\",INDIRECT(\"'\"&B218&\"'!$X$111\"))","v":{"$error":"#REF!"}},{"$f":"IF(B218=\"\",\"\",INDIRECT(\"'\"&B218&\"'!$Z$111\"))","v":{"$error":"#REF!"}},{"$f":"IF(B218=\"\",\"\",INDIRECT(\"'\"&B218&\"'!$AA$111\"))","v":{"$error":"#REF!"}},{"$error":"#REF!"}]
[{"$nulls":4},{"$f":"IF(B218=\"\",\"\",INDIRECT(\"'\"&B218&\"'!$A$113\"))","v":{"$error":"#REF!"}},{"$f":"IF(B218=\"\",\"\",INDIRECT(\"'\"&B218&\"'!$K$120\"))","v":{"$error":"#REF!"}},{"$f":"IF(B218=\"\",\"\",INDIRECT(\"'\"&B218&\"'!$L$120\"))","v":{"$error":"#REF!"}},{"$f":"IF(B218=\"\",\"\",INDIRECT(\"'\"&B218&\"'!$H$120\"))","v":{"$error":"#REF!"}},{"$f":"IF(B218=\"\",\"\",INDIRECT(\"'\"&B218&\"'!$I$120\"))","v":{"$error":"#REF!"}},{"$f":"IF(B218=\"\",\"\",INDIRECT(\"'\"&B218&\"'!$R$120\"))","v":{"$error":"#REF!"}},{"$f":"IF(B218=\"\",\"\",INDIRECT(\"'\"&B218&\"'!$U$120\"))","v":{"$error":"#REF!"}},{"$f":"IF(B218=\"\",\"\",INDIRECT(\"'\"&B218&\"'!$X$120\"))","v":{"$error":"#REF!"}},{"$f":"IF(B218=\"\",\"\",INDIRECT(\"'\"&B218&\"'!$Z$120\"))","v":{"$error":"#REF!"}},{"$f":"IF(B218=\"\",\"\",INDIRECT(\"'\"&B218&\"'!$AA$120\"))","v":{"$error":"#REF!"}},{"$error":"#REF!"}]
[{"$nulls":4},{"$f":"IF(B218=\"\",\"\",INDIRECT(\"'\"&B218&\"'!$A$122\"))","v":{"$error":"#REF!"}},{"$f":"IF(B218=\"\",\"\",INDIRECT(\"'\"&B218&\"'!$K$129\"))","v":{"$error":"#REF!"}},{"$f":"IF(B218=\"\",\"\",INDIRECT(\"'\"&B218&\"'!$L$129\"))","v":{"$error":"#REF!"}},{"$f":"IF(B218=\"\",\"\",INDIRECT(\"'\"&B218&\"'!$H$129\"))","v":{"$error":"#REF!"}},{"$f":"IF(B218=\"\",\"\",INDIRECT(\"'\"&B218&\"'!$I$129\"))","v":{"$error":"#REF!"}},{"$f":"IF(B218=\"\",\"\",INDIRECT(\"'\"&B218&\"'!$R$129\"))","v":{"$error":"#REF!"}},{"$f":"IF(B218=\"\",\"\",INDIRECT(\"'\"&B218&\"'!$U$129\"))","v":{"$error":"#REF!"}},{"$f":"IF(B218=\"\",\"\",INDIRECT(\"'\"&B218&\"'!$X$129\"))","v":{"$error":"#REF!"}},{"$f":"IF(B218=\"\",\"\",INDIRECT(\"'\"&B218&\"'!$Z$129\"))","v":{"$error":"#REF!"}},{"$f":"IF(B218=\"\",\"\",INDIRECT(\"'\"&B218&\"'!$AA$129\"))","v":{"$error":"#REF!"}},{"$error":"#REF!"}]
[{"$nulls":4},{"$f":"IF(B218=\"\",\"\",INDIRECT(\"'\"&B218&\"'!$A$131\"))","v":{"$error":"#REF!"}},{"$f":"IF(B218=\"\",\"\",INDIRECT(\"'\"&B218&\"'!$K$167\"))","v":{"$error":"#REF!"}},{"$f":"IF(B218=\"\",\"\",INDIRECT(\"'\"&B218&\"'!$L$167\"))","v":{"$error":"#REF!"}},{"$f":"IF(B218=\"\",\"\",INDIRECT(\"'\"&B218&\"'!$H$167\"))","v":{"$error":"#REF!"}},{"$f":"IF(B218=\"\",\"\",INDIRECT(\"'\"&B218&\"'!$I$167\"))","v":{"$error":"#REF!"}},{"$f":"IF(B218=\"\",\"\",INDIRECT(\"'\"&B218&\"'!$R$167\"))","v":{"$error":"#REF!"}},{"$f":"IF(B218=\"\",\"\",INDIRECT(\"'\"&B218&\"'!$U$167\"))","v":{"$error":"#REF!"}},{"$f":"IF(B218=\"\",\"\",INDIRECT(\"'\"&B218&\"'!$X$167\"))","v":{"$error":"#REF!"}},{"$f":"IF(B218=\"\",\"\",INDIRECT(\"'\"&B218&\"'!$Z$167\"))","v":{"$error":"#REF!"}},{"$f":"IF(B218=\"\",\"\",INDIRECT(\"'\"&B218&\"'!$AA$167\"))","v":{"$error":"#REF!"}},{"$error":"#REF!"}]
[null,{"$f":"MID(INDEX(nom_feuilles,ROW(Masque!K32)),SEARCH(\"]\",INDEX(nom_feuilles,ROW(Masque!K32)))+1,30)","v":{"$error":"#REF!"}},{"$f":"IF(B226=\"\",\"\",INDIRECT(\"'\"&B226&\"'!$A$1\"))","v":{"$error":"#REF!"}},{"$f":"IF(B226=\"\",\"\",INDIRECT(\"'\"&B226&\"'!$A$2\"))","v":{"$error":"#REF!"}},{"$f":"IF(B226=\"\",\"\",INDIRECT(\"'\"&B226&\"'!$A$8\"))","v":{"$error":"#REF!"}},{"$f":"IF(B226=\"\",\"\",INDIRECT(\"'\"&B226&\"'!$K$30\"))","v":{"$error":"#REF!"}},{"$f":"IF(B226=\"\",\"\",INDIRECT(\"'\"&B226&\"'!$L$30\"))","v":{"$error":"#REF!"}},{"$f":"IF(B226=\"\",\"\",INDIRECT(\"'\"&B226&\"'!$H$30\"))","v":{"$error":"#REF!"}},{"$f":"IF(B226=\"\",\"\",INDIRECT(\"'\"&B226&\"'!$I$30\"))","v":{"$error":"#REF!"}},{"$f":"IF(B226=\"\",\"\",INDIRECT(\"'\"&B226&\"'!$R$30\"))","v":{"$error":"#REF!"}},{"$f":"IF(B226=\"\",\"\",INDIRECT(\"'\"&B226&\"'!$U$30\"))","v":{"$error":"#REF!"}},{"$f":"IF(B226=\"\",\"\",INDIRECT(\"'\"&B226&\"'!$X$30\"))","v":{"$error":"#REF!"}},{"$f":"IF(B226=\"\",\"\",INDIRECT(\"'\"&B226&\"'!$Z$30\"))","v":{"$error":"#REF!"}},{"$f":"IF(B226=\"\",\"\",INDIRECT(\"'\"&B226&\"'!$AA$30\"))","v":{"$error":"#REF!"}},{"$error":"#REF!"},{"$f":"SUM(O226:O233)","v":{"$error":"#REF!"}},{"$f":"IF(B226=\"\",\"\",INDIRECT(\"'\"&B226&\"'!$H$4\"))","v":{"$error":"#REF!"}},{"$f":"P226-Q226","v":{"$error":"#REF!"}}]
[{"$nulls":4},{"$f":"IF(B226=\"\",\"\",INDIRECT(\"'\"&B226&\"'!$A$32\"))","v":{"$error":"#REF!"}},{"$f":"IF(B226=\"\",\"\",INDIRECT(\"'\"&B226&\"'!$K$54\"))","v":{"$error":"#REF!"}},{"$f":"IF(B226=\"\",\"\",INDIRECT(\"'\"&B226&\"'!$L$54\"))","v":{"$error":"#REF!"}},{"$f":"IF(B226=\"\",\"\",INDIRECT(\"'\"&B226&\"'!$H$54\"))","v":{"$error":"#REF!"}},{"$f":"IF(B226=\"\",\"\",INDIRECT(\"'\"&B226&\"'!$I$54\"))","v":{"$error":"#REF!"}},{"$f":"IF(B226=\"\",\"\",INDIRECT(\"'\"&B226&\"'!$R$54\"))","v":{"$error":"#REF!"}},{"$f":"IF(B226=\"\",\"\",INDIRECT(\"'\"&B226&\"'!$U$54\"))","v":{"$error":"#REF!"}},{"$f":"IF(B226=\"\",\"\",INDIRECT(\"'\"&B226&\"'!$X$54\"))","v":{"$error":"#REF!"}},{"$f":"IF(B226=\"\",\"\",INDIRECT(\"'\"&B226&\"'!$Z$54\"))","v":{"$error":"#REF!"}},{"$f":"IF(B226=\"\",\"\",INDIRECT(\"'\"&B226&\"'!$AA$54\"))","v":{"$error":"#REF!"}},{"$error":"#REF!"}]
[{"$nulls":4},{"$f":"IF(B226=\"\",\"\",INDIRECT(\"'\"&B226&\"'!$A$56\"))","v":{"$error":"#REF!"}},{"$f":"IF(B226=\"\",\"\",INDIRECT(\"'\"&B226&\"'!$K$78\"))","v":{"$error":"#REF!"}},{"$f":"IF(B226=\"\",\"\",INDIRECT(\"'\"&B226&\"'!$L$78\"))","v":{"$error":"#REF!"}},{"$f":"IF(B226=\"\",\"\",INDIRECT(\"'\"&B226&\"'!$H$78\"))","v":{"$error":"#REF!"}},{"$f":"IF(B226=\"\",\"\",INDIRECT(\"'\"&B226&\"'!$I$78\"))","v":{"$error":"#REF!"}},{"$f":"IF(B226=\"\",\"\",INDIRECT(\"'\"&B226&\"'!$R$78\"))","v":{"$error":"#REF!"}},{"$f":"IF(B226=\"\",\"\",INDIRECT(\"'\"&B226&\"'!$U$78\"))","v":{"$error":"#REF!"}},{"$f":"IF(B226=\"\",\"\",INDIRECT(\"'\"&B226&\"'!$X$78\"))","v":{"$error":"#REF!"}},{"$f":"IF(B226=\"\",\"\",INDIRECT(\"'\"&B226&\"'!$Z$78\"))","v":{"$error":"#REF!"}},{"$f":"IF(B226=\"\",\"\",INDIRECT(\"'\"&B226&\"'!$AA$78\"))","v":{"$error":"#REF!"}},{"$error":"#REF!"}]
[{"$nulls":4},{"$f":"IF(B226=\"\",\"\",INDIRECT(\"'\"&B226&\"'!$A$80\"))","v":{"$error":"#REF!"}},{"$f":"IF(B226=\"\",\"\",INDIRECT(\"'\"&B226&\"'!$K$102\"))","v":{"$error":"#REF!"}},{"$f":"IF(B226=\"\",\"\",INDIRECT(\"'\"&B226&\"'!$L$102\"))","v":{"$error":"#REF!"}},{"$f":"IF(B226=\"\",\"\",INDIRECT(\"'\"&B226&\"'!$H$102\"))","v":{"$error":"#REF!"}},{"$f":"IF(B226=\"\",\"\",INDIRECT(\"'\"&B226&\"'!$I$102\"))","v":{"$error":"#REF!"}},{"$f":"IF(B226=\"\",\"\",INDIRECT(\"'\"&B226&\"'!$R$102\"))","v":{"$error":"#REF!"}},{"$f":"IF(B226=\"\",\"\",INDIRECT(\"'\"&B226&\"'!$U$102\"))","v":{"$error":"#REF!"}},{"$f":"IF(B226=\"\",\"\",INDIRECT(\"'\"&B226&\"'!$X$102\"))","v":{"$error":"#REF!"}},{"$f":"IF(B226=\"\",\"\",INDIRECT(\"'\"&B226&\"'!$Z$102\"))","v":{"$error":"#REF!"}},{"$f":"IF(B226=\"\",\"\",INDIRECT(\"'\"&B226&\"'!$AA$102\"))","v":{"$error":"#REF!"}},{"$error":"#REF!"}]
[{"$nulls":4},{"$f":"IF(B226=\"\",\"\",INDIRECT(\"'\"&B226&\"'!$A$104\"))","v":{"$error":"#REF!"}},{"$f":"IF(B226=\"\",\"\",INDIRECT(\"'\"&B226&\"'!$K$111\"))","v":{"$error":"#REF!"}},{"$f":"IF(B226=\"\",\"\",INDIRECT(\"'\"&B226&\"'!$L$111\"))","v":{"$error":"#REF!"}},{"$f":"IF(B226=\"\",\"\",INDIRECT(\"'\"&B226&\"'!$H$111\"))","v":{"$error":"#REF!"}},{"$f":"IF(B226=\"\",\"\",INDIRECT(\"'\"&B226&\"'!$I$111\"))","v":{"$error":"#REF!"}},{"$f":"IF(B226=\"\",\"\",INDIRECT(\"'\"&B226&\"'!$R$111\"))","v":{"$error":"#REF!"}},{"$f":"IF(B226=\"\",\"\",INDIRECT(\"'\"&B226&\"'!$U$111\"))","v":{"$error":"#REF!"}},{"$f":"IF(B226=\"\",\"\",INDIRECT(\"'\"&B226&\"'!$X$111\"))","v":{"$error":"#REF!"}},{"$f":"IF(B226=\"\",\"\",INDIRECT(\"'\"&B226&\"'!$Z$111\"))","v":{"$error":"#REF!"}},{"$f":"IF(B226=\"\",\"\",INDIRECT(\"'\"&B226&\"'!$AA$111\"))","v":{"$error":"#REF!"}},{"$error":"#REF!"}]
[{"$nulls":4},{"$f":"IF(B226=\"\",\"\",INDIRECT(\"'\"&B226&\"'!$A$113\"))","v":{"$error":"#REF!"}},{"$f":"IF(B226=\"\",\"\",INDIRECT(\"'\"&B226&\"'!$K$120\"))","v":{"$error":"#REF!"}},{"$f":"IF(B226=\"\",\"\",INDIRECT(\"'\"&B226&\"'!$L$120\"))","v":{"$error":"#REF!"}},{"$f":"IF(B226=\"\",\"\",INDIRECT(\"'\"&B226&\"'!$H$120\"))","v":{"$error":"#REF!"}},{"$f":"IF(B226=\"\",\"\",INDIRECT(\"'\"&B226&\"'!$I$120\"))","v":{"$error":"#REF!"}},{"$f":"IF(B226=\"\",\"\",INDIRECT(\"'\"&B226&\"'!$R$120\"))","v":{"$error":"#REF!"}},{"$f":"IF(B226=\"\",\"\",INDIRECT(\"'\"&B226&\"'!$U$120\"))","v":{"$error":"#REF!"}},{"$f":"IF(B226=\"\",\"\",INDIRECT(\"'\"&B226&\"'!$X$120\"))","v":{"$error":"#REF!"}},{"$f":"IF(B226=\"\",\"\",INDIRECT(\"'\"&B226&\"'!$Z$120\"))","v":{"$error":"#REF!"}},{"$f":"IF(B226=\"\",\"\",INDIRECT(\"'\"&B226&\"'!$AA$120\"))","v":{"$error":"#REF!"}},{"$error":"#REF!"}]
[{"$nulls":4},{"$f":"IF(B226=\"\",\"\",INDIRECT(\"'\"&B226&\"'!$A$122\"))","v":{"$error":"#REF!"}},{"$f":"IF(B226=\"\",\"\",INDIRECT(\"'\"&B226&\"'!$K$129\"))","v":{"$error":"#REF!"}},{"$f":"IF(B226=\"\",\"\",INDIRECT(\"'\"&B226&\"'!$L$129\"))","v":{"$error":"#REF!"}},{"$f":"IF(B226=\"\",\"\",INDIRECT(\"'\"&B226&\"'!$H$129\"))","v":{"$error":"#REF!"}},{"$f":"IF(B226=\"\",\"\",INDIRECT(\"'\"&B226&\"'!$I$129\"))","v":{"$error":"#REF!"}},{"$f":"IF(B226=\"\",\"\",INDIRECT(\"'\"&B226&\"'!$R$129\"))","v":{"$error":"#REF!"}},{"$f":"IF(B226=\"\",\"\",INDIRECT(\"'\"&B226&\"'!$U$129\"))","v":{"$error":"#REF!"}},{"$f":"IF(B226=\"\",\"\",INDIRECT(\"'\"&B226&\"'!$X$129\"))","v":{"$error":"#REF!"}},{"$f":"IF(B226=\"\",\"\",INDIRECT(\"'\"&B226&\"'!$Z$129\"))","v":{"$error":"#REF!"}},{"$f":"IF(B226=\"\",\"\",INDIRECT(\"'\"&B226&\"'!$AA$129\"))","v":{"$error":"#REF!"}},{"$error":"#REF!"}]
[{"$nulls":4},{"$f":"IF(B226=\"\",\"\",INDIRECT(\"'\"&B226&\"'!$A$131\"))","v":{"$error":"#REF!"}},{"$f":"IF(B226=\"\",\"\",INDIRECT(\"'\"&B226&\"'!$K$167\"))","v":{"$error":"#REF!"}},{"$f":"IF(B226=\"\",\"\",INDIRECT(\"'\"&B226&\"'!$L$167\"))","v":{"$error":"#REF!"}},{"$f":"IF(B226=\"\",\"\",INDIRECT(\"'\"&B226&\"'!$H$167\"))","v":{"$error":"#REF!"}},{"$f":"IF(B226=\"\",\"\",INDIRECT(\"'\"&B226&\"'!$I$167\"))","v":{"$error":"#REF!"}},{"$f":"IF(B226=\"\",\"\",INDIRECT(\"'\"&B226&\"'!$R$167\"))","v":{"$error":"#REF!"}},{"$f":"IF(B226=\"\",\"\",INDIRECT(\"'\"&B226&\"'!$U$167\"))","v":{"$error":"#REF!"}},{"$f":"IF(B226=\"\",\"\",INDIRECT(\"'\"&B226&\"'!$X$167\"))","v":{"$error":"#REF!"}},{"$f":"IF(B226=\"\",\"\",INDIRECT(\"'\"&B226&\"'!$Z$167\"))","v":{"$error":"#REF!"}},{"$f":"IF(B226=\"\",\"\",INDIRECT(\"'\"&B226&\"'!$AA$167\"))","v":{"$error":"#REF!"}},{"$error":"#REF!"}]
[null,{"$f":"MID(INDEX(nom_feuilles,ROW(Masque!K33)),SEARCH(\"]\",INDEX(nom_feuilles,ROW(Masque!K33)))+1,30)","v":{"$error":"#REF!"}},{"$f":"IF(B234=\"\",\"\",INDIRECT(\"'\"&B234&\"'!$A$1\"))","v":{"$error":"#REF!"}},{"$f":"IF(B234=\"\",\"\",INDIRECT(\"'\"&B234&\"'!$A$2\"))","v":{"$error":"#REF!"}},{"$f":"IF(B234=\"\",\"\",INDIRECT(\"'\"&B234&\"'!$A$8\"))","v":{"$error":"#REF!"}},{"$f":"IF(B234=\"\",\"\",INDIRECT(\"'\"&B234&\"'!$K$30\"))","v":{"$error":"#REF!"}},{"$f":"IF(B234=\"\",\"\",INDIRECT(\"'\"&B234&\"'!$L$30\"))","v":{"$error":"#REF!"}},{"$f":"IF(B234=\"\",\"\",INDIRECT(\"'\"&B234&\"'!$H$30\"))","v":{"$error":"#REF!"}},{"$f":"IF(B234=\"\",\"\",INDIRECT(\"'\"&B234&\"'!$I$30\"))","v":{"$error":"#REF!"}},{"$f":"IF(B234=\"\",\"\",INDIRECT(\"'\"&B234&\"'!$R$30\"))","v":{"$error":"#REF!"}},{"$f":"IF(B234=\"\",\"\",INDIRECT(\"'\"&B234&\"'!$U$30\"))","v":{"$error":"#REF!"}},{"$f":"IF(B234=\"\",\"\",INDIRECT(\"'\"&B234&\"'!$X$30\"))","v":{"$error":"#REF!"}},{"$f":"IF(B234=\"\",\"\",INDIRECT(\"'\"&B234&\"'!$Z$30\"))","v":{"$error":"#REF!"}},{"$f":"IF(B234=\"\",\"\",INDIRECT(\"'\"&B234&\"'!$AA$30\"))","v":{"$error":"#REF!"}},{"$f":"SUM(F234:N234)","v":{"$error":"#REF!"}},{"$f":"SUM(O234:O241)","v":{"$error":"#REF!"}},{"$f":"IF(B234=\"\",\"\",INDIRECT(\"'\"&B234&\"'!$H$4\"))","v":{"$error":"#REF!"}},{"$f":"P234-Q234","v":{"$error":"#REF!"}}]
[{"$nulls":4},{"$f":"IF(B234=\"\",\"\",INDIRECT(\"'\"&B234&\"'!$A$32\"))","v":{"$error":"#REF!"}},{"$f":"IF(B234=\"\",\"\",INDIRECT(\"'\"&B234&\"'!$K$54\"))","v":{"$error":"#REF!"}},{"$f":"IF(B234=\"\",\"\",INDIRECT(\"'\"&B234&\"'!$L$54\"))","v":{"$error":"#REF!"}},{"$f":"IF(B234=\"\",\"\",INDIRECT(\"'\"&B234&\"'!$H$54\"))","v":{"$error":"#REF!"}},{"$f":"IF(B234=\"\",\"\",INDIRECT(\"'\"&B234&\"'!$I$54\"))","v":{"$error":"#REF!"}},{"$f":"IF(B234=\"\",\"\",INDIRECT(\"'\"&B234&\"'!$R$54\"))","v":{"$error":"#REF!"}},{"$f":"IF(B234=\"\",\"\",INDIRECT(\"'\"&B234&\"'!$U$54\"))","v":{"$error":"#REF!"}},{"$f":"IF(B234=\"\",\"\",INDIRECT(\"'\"&B234&\"'!$X$54\"))","v":{"$error":"#REF!"}},{"$f":"IF(B234=\"\",\"\",INDIRECT(\"'\"&B234&\"'!$Z$54\"))","v":{"$error":"#REF!"}},{"$f":"IF(B234=\"\",\"\",INDIRECT(\"'\"&B234&\"'!$AA$54\"))","v":{"$error":"#REF!"}},{"$error":"#REF!"}]
[{"$nulls":4},{"$f":"IF(B234=\"\",\"\",INDIRECT(\"'\"&B234&\"'!$A$56\"))","v":{"$error":"#REF!"}},{"$f":"IF(B234=\"\",\"\",INDIRECT(\"'\"&B234&\"'!$K$78\"))","v":{"$error":"#REF!"}},{"$f":"IF(B234=\"\",\"\",INDIRECT(\"'\"&B234&\"'!$L$78\"))","v":{"$error":"#REF!"}},{"$f":"IF(B234=\"\",\"\",INDIRECT(\"'\"&B234&\"'!$H$78\"))","v":{"$error":"#REF!"}},{"$f":"IF(B234=\"\",\"\",INDIRECT(\"'\"&B234&\"'!$I$78\"))","v":{"$error":"#REF!"}},{"$f":"IF(B234=\"\",\"\",INDIRECT(\"'\"&B234&\"'!$R$78\"))","v":{"$error":"#REF!"}},{"$f":"IF(B234=\"\",\"\",INDIRECT(\"'\"&B234&\"'!$U$78\"))","v":{"$error":"#REF!"}},{"$f":"IF(B234=\"\",\"\",INDIRECT(\"'\"&B234&\"'!$X$78\"))","v":{"$error":"#REF!"}},{"$f":"IF(B234=\"\",\"\",INDIRECT(\"'\"&B234&\"'!$Z$78\"))","v":{"$error":"#REF!"}},{"$f":"IF(B234=\"\",\"\",INDIRECT(\"'\"&B234&\"'!$AA$78\"))","v":{"$error":"#REF!"}},{"$error":"#REF!"}]
[{"$nulls":4},{"$f":"IF(B234=\"\",\"\",INDIRECT(\"'\"&B234&\"'!$A$80\"))","v":{"$error":"#REF!"}},{"$f":"IF(B234=\"\",\"\",INDIRECT(\"'\"&B234&\"'!$K$102\"))","v":{"$error":"#REF!"}},{"$f":"IF(B234=\"\",\"\",INDIRECT(\"'\"&B234&\"'!$L$102\"))","v":{"$error":"#REF!"}},{"$f":"IF(B234=\"\",\"\",INDIRECT(\"'\"&B234&\"'!$H$102\"))","v":{"$error":"#REF!"}},{"$f":"IF(B234=\"\",\"\",INDIRECT(\"'\"&B234&\"'!$I$102\"))","v":{"$error":"#REF!"}},{"$f":"IF(B234=\"\",\"\",INDIRECT(\"'\"&B234&\"'!$R$102\"))","v":{"$error":"#REF!"}},{"$f":"IF(B234=\"\",\"\",INDIRECT(\"'\"&B234&\"'!$U$102\"))","v":{"$error":"#REF!"}},{"$f":"IF(B234=\"\",\"\",INDIRECT(\"'\"&B234&\"'!$X$102\"))","v":{"$error":"#REF!"}},{"$f":"IF(B234=\"\",\"\",INDIRECT(\"'\"&B234&\"'!$Z$102\"))","v":{"$error":"#REF!"}},{"$f":"IF(B234=\"\",\"\",INDIRECT(\"'\"&B234&\"'!$AA$102\"))","v":{"$error":"#REF!"}},{"$error":"#REF!"}]
[{"$nulls":4},{"$f":"IF(B234=\"\",\"\",INDIRECT(\"'\"&B234&\"'!$A$104\"))","v":{"$error":"#REF!"}},{"$f":"IF(B234=\"\",\"\",INDIRECT(\"'\"&B234&\"'!$K$111\"))","v":{"$error":"#REF!"}},{"$f":"IF(B234=\"\",\"\",INDIRECT(\"'\"&B234&\"'!$L$111\"))","v":{"$error":"#REF!"}},{"$f":"IF(B234=\"\",\"\",INDIRECT(\"'\"&B234&\"'!$H$111\"))","v":{"$error":"#REF!"}},{"$f":"IF(B234=\"\",\"\",INDIRECT(\"'\"&B234&\"'!$I$111\"))","v":{"$error":"#REF!"}},{"$f":"IF(B234=\"\",\"\",INDIRECT(\"'\"&B234&\"'!$R$111\"))","v":{"$error":"#REF!"}},{"$f":"IF(B234=\"\",\"\",INDIRECT(\"'\"&B234&\"'!$U$111\"))","v":{"$error":"#REF!"}},{"$f":"IF(B234=\"\",\"\",INDIRECT(\"'\"&B234&\"'!$X$111\"))","v":{"$error":"#REF!"}},{"$f":"IF(B234=\"\",\"\",INDIRECT(\"'\"&B234&\"'!$Z$111\"))","v":{"$error":"#REF!"}},{"$f":"IF(B234=\"\",\"\",INDIRECT(\"'\"&B234&\"'!$AA$111\"))","v":{"$error":"#REF!"}},{"$error":"#REF!"}]
[{"$nulls":4},{"$f":"IF(B234=\"\",\"\",INDIRECT(\"'\"&B234&\"'!$A$113\"))","v":{"$error":"#REF!"}},{"$f":"IF(B234=\"\",\"\",INDIRECT(\"'\"&B234&\"'!$K$120\"))","v":{"$error":"#REF!"}},{"$f":"IF(B234=\"\",\"\",INDIRECT(\"'\"&B234&\"'!$L$120\"))","v":{"$error":"#REF!"}},{"$f":"IF(B234=\"\",\"\",INDIRECT(\"'\"&B234&\"'!$H$120\"))","v":{"$error":"#REF!"}},{"$f":"IF(B234=\"\",\"\",INDIRECT(\"'\"&B234&\"'!$I$120\"))","v":{"$error":"#REF!"}},{"$f":"IF(B234=\"\",\"\",INDIRECT(\"'\"&B234&\"'!$R$120\"))","v":{"$error":"#REF!"}},{"$f":"IF(B234=\"\",\"\",INDIRECT(\"'\"&B234&\"'!$U$120\"))","v":{"$error":"#REF!"}},{"$f":"IF(B234=\"\",\"\",INDIRECT(\"'\"&B234&\"'!$X$120\"))","v":{"$error":"#REF!"}},{"$f":"IF(B234=\"\",\"\",INDIRECT(\"'\"&B234&\"'!$Z$120\"))","v":{"$error":"#REF!"}},{"$f":"IF(B234=\"\",\"\",INDIRECT(\"'\"&B234&\"'!$AA$120\"))","v":{"$error":"#REF!"}},{"$error":"#REF!"}]
[{"$nulls":4},{"$f":"IF(B234=\"\",\"\",INDIRECT(\"'\"&B234&\"'!$A$122\"))","v":{"$error":"#REF!"}},{"$f":"IF(B234=\"\",\"\",INDIRECT(\"'\"&B234&\"'!$K$129\"))","v":{"$error":"#REF!"}},{"$f":"IF(B234=\"\",\"\",INDIRECT(\"'\"&B234&\"'!$L$129\"))","v":{"$error":"#REF!"}},{"$f":"IF(B234=\"\",\"\",INDIRECT(\"'\"&B234&\"'!$H$129\"))","v":{"$error":"#REF!"}},{"$f":"IF(B234=\"\",\"\",INDIRECT(\"'\"&B234&\"'!$I$129\"))","v":{"$error":"#REF!"}},{"$f":"IF(B234=\"\",\"\",INDIRECT(\"'\"&B234&\"'!$R$129\"))","v":{"$error":"#REF!"}},{"$f":"IF(B234=\"\",\"\",INDIRECT(\"'\"&B234&\"'!$U$129\"))","v":{"$error":"#REF!"}},{"$f":"IF(B234=\"\",\"\",INDIRECT(\"'\"&B234&\"'!$X$129\"))","v":{"$error":"#REF!"}},{"$f":"IF(B234=\"\",\"\",INDIRECT(\"'\"&B234&\"'!$Z$129\"))","v":{"$error":"#REF!"}},{"$f":"IF(B234=\"\",\"\",INDIRECT(\"'\"&B234&\"'!$AA$129\"))","v":{"$error":"#REF!"}},{"$error":"#REF!"}]
[{"$nulls":4},{"$f":"IF(B234=\"\",\"\",INDIRECT(\"'\"&B234&\"'!$A$131\"))","v":{"$error":"#REF!"}},{"$f":"IF(B234=\"\",\"\",INDIRECT(\"'\"&B234&\"'!$K$167\"))","v":{"$error":"#REF!"}},{"$f":"IF(B234=\"\",\"\",INDIRECT(\"'\"&B234&\"'!$L$167\"))","v":{"$error":"#REF!"}},{"$f":"IF(B234=\"\",\"\",INDIRECT(\"'\"&B234&\"'!$H$167\"))","v":{"$error":"#REF!"}},{"$f":"IF(B234=\"\",\"\",INDIRECT(\"'\"&B234&\"'!$I$167\"))","v":{"$error":"#REF!"}},{"$f":"IF(B234=\"\",\"\",INDIRECT(\"'\"&B234&\"'!$R$167\"))","v":{"$error":"#REF!"}},{"$f":"IF(B234=\"\",\"\",INDIRECT(\"'\"&B234&\"'!$U$167\"))","v":{"$error":"#REF!"}},{"$f":"IF(B234=\"\",\"\",INDIRECT(\"'\"&B234&\"'!$X$167\"))","v":{"$error":"#REF!"}},{"$f":"IF(B234=\"\",\"\",INDIRECT(\"'\"&B234&\"'!$Z$167\"))","v":{"$error":"#REF!"}},{"$f":"IF(B234=\"\",\"\",INDIRECT(\"'\"&B234&\"'!$AA$167\"))","v":{"$error":"#REF!"}},{"$error":"#REF!"}]
[null,{"$f":"MID(INDEX(nom_feuilles,ROW(Masque!K34)),SEARCH(\"]\",INDEX(nom_feuilles,ROW(Masque!K34)))+1,30)","v":{"$error":"#REF!"}},{"$f":"IF(B242=\"\",\"\",INDIRECT(\"'\"&B242&\"'!$A$1\"))","v":{"$error":"#REF!"}},{"$f":"IF(B242=\"\",\"\",INDIRECT(\"'\"&B242&\"'!$A$2\"))","v":{"$error":"#REF!"}},{"$f":"IF(B242=\"\",\"\",INDIRECT(\"'\"&B242&\"'!$A$8\"))","v":{"$error":"#REF!"}},{"$f":"IF(B242=\"\",\"\",INDIRECT(\"'\"&B242&\"'!$K$30\"))","v":{"$error":"#REF!"}},{"$f":"IF(B242=\"\",\"\",INDIRECT(\"'\"&B242&\"'!$L$30\"))","v":{"$error":"#REF!"}},{"$f":"IF(B242=\"\",\"\",INDIRECT(\"'\"&B242&\"'!$H$30\"))","v":{"$error":"#REF!"}},{"$f":"IF(B242=\"\",\"\",INDIRECT(\"'\"&B242&\"'!$I$30\"))","v":{"$error":"#REF!"}},{"$f":"IF(B242=\"\",\"\",INDIRECT(\"'\"&B242&\"'!$R$30\"))","v":{"$error":"#REF!"}},{"$f":"IF(B242=\"\",\"\",INDIRECT(\"'\"&B242&\"'!$U$30\"))","v":{"$error":"#REF!"}},{"$f":"IF(B242=\"\",\"\",INDIRECT(\"'\"&B242&\"'!$X$30\"))","v":{"$error":"#REF!"}},{"$f":"IF(B242=\"\",\"\",INDIRECT(\"'\"&B242&\"'!$Z$30\"))","v":{"$error":"#REF!"}},{"$f":"IF(B242=\"\",\"\",INDIRECT(\"'\"&B242&\"'!$AA$30\"))","v":{"$error":"#REF!"}},{"$error":"#REF!"},{"$f":"SUM(O242:O249)","v":{"$error":"#REF!"}},{"$f":"IF(B242=\"\",\"\",INDIRECT(\"'\"&B242&\"'!$H$4\"))","v":{"$error":"#REF!"}},{"$f":"P242-Q242","v":{"$error":"#REF!"}}]
[{"$nulls":4},{"$f":"IF(B242=\"\",\"\",INDIRECT(\"'\"&B242&\"'!$A$32\"))","v":{"$error":"#REF!"}},{"$f":"IF(B242=\"\",\"\",INDIRECT(\"'\"&B242&\"'!$K$54\"))","v":{"$error":"#REF!"}},{"$f":"IF(B242=\"\",\"\",INDIRECT(\"'\"&B242&\"'!$L$54\"))","v":{"$error":"#REF!"}},{"$f":"IF(B242=\"\",\"\",INDIRECT(\"'\"&B242&\"'!$H$54\"))","v":{"$error":"#REF!"}},{"$f":"IF(B242=\"\",\"\",INDIRECT(\"'\"&B242&\"'!$I$54\"))","v":{"$error":"#REF!"}},{"$f":"IF(B242=\"\",\"\",INDIRECT(\"'\"&B242&\"'!$R$54\"))","v":{"$error":"#REF!"}},{"$f":"IF(B242=\"\",\"\",INDIRECT(\"'\"&B242&\"'!$U$54\"))","v":{"$error":"#REF!"}},{"$f":"IF(B242=\"\",\"\",INDIRECT(\"'\"&B242&\"'!$X$54\"))","v":{"$error":"#REF!"}},{"$f":"IF(B242=\"\",\"\",INDIRECT(\"'\"&B242&\"'!$Z$54\"))","v":{"$error":"#REF!"}},{"$f":"IF(B242=\"\",\"\",INDIRECT(\"'\"&B242&\"'!$AA$54\"))","v":{"$error":"#REF!"}},{"$error":"#REF!"}]
[{"$nulls":4},{"$f":"IF(B242=\"\",\"\",INDIRECT(\"'\"&B242&\"'!$A$56\"))","v":{"$error":"#REF!"}},{"$f":"IF(B242=\"\",\"\",INDIRECT(\"'\"&B242&\"'!$K$78\"))","v":{"$error":"#REF!"}},{"$f":"IF(B242=\"\",\"\",INDIRECT(\"'\"&B242&\"'!$L$78\"))","v":{"$error":"#REF!"}},{"$f":"IF(B242=\"\",\"\",INDIRECT(\"'\"&B242&\"'!$H$78\"))","v":{"$error":"#REF!"}},{"$f":"IF(B242=\"\",\"\",INDIRECT(\"'\"&B242&\"'!$I$78\"))","v":{"$error":"#REF!"}},{"$f":"IF(B242=\"\",\"\",INDIRECT(\"'\"&B242&\"'!$R$78\"))","v":{"$error":"#REF!"}},{"$f":"IF(B242=\"\",\"\",INDIRECT(\"'\"&B242&\"'!$U$78\"))","v":{"$error":"#REF!"}},{"$f":"IF(B242=\"\",\"\",INDIRECT(\"'\"&B242&\"'!$X$78\"))","v":{"$error":"#REF!"}},{"$f":"IF(B242=\"\",\"\",INDIRECT(\"'\"&B242&\"'!$Z$78\"))","v":{"$error":"#REF!"}},{"$f":"IF(B242=\"\",\"\",INDIRECT(\"'\"&B242&\"'!$AA$78\"))","v":{"$error":"#REF!"}},{"$error":"#REF!"}]
[{"$nulls":4},{"$f":"IF(B242=\"\",\"\",INDIRECT(\"'\"&B242&\"'!$A$80\"))","v":{"$error":"#REF!"}},{"$f":"IF(B242=\"\",\"\",INDIRECT(\"'\"&B242&\"'!$K$102\"))","v":{"$error":"#REF!"}},{"$f":"IF(B242=\"\",\"\",INDIRECT(\"'\"&B242&\"'!$L$102\"))","v":{"$error":"#REF!"}},{"$f":"IF(B242=\"\",\"\",INDIRECT(\"'\"&B242&\"'!$H$102\"))","v":{"$error":"#REF!"}},{"$f":"IF(B242=\"\",\"\",INDIRECT(\"'\"&B242&\"'!$I$102\"))","v":{"$error":"#REF!"}},{"$f":"IF(B242=\"\",\"\",INDIRECT(\"'\"&B242&\"'!$R$102\"))","v":{"$error":"#REF!"}},{"$f":"IF(B242=\"\",\"\",INDIRECT(\"'\"&B242&\"'!$U$102\"))","v":{"$error":"#REF!"}},{"$f":"IF(B242=\"\",\"\",INDIRECT(\"'\"&B242&\"'!$X$102\"))","v":{"$error":"#REF!"}},{"$f":"IF(B242=\"\",\"\",INDIRECT(\"'\"&B242&\"'!$Z$102\"))","v":{"$error":"#REF!"}},{"$f":"IF(B242=\"\",\"\",INDIRECT(\"'\"&B242&\"'!$AA$102\"))","v":{"$error":"#REF!"}},{"$error":"#REF!"}]
[{"$nulls":4},{"$f":"IF(B242=\"\",\"\",INDIRECT(\"'\"&B242&\"'!$A$104\"))","v":{"$error":"#REF!"}},{"$f":"IF(B242=\"\",\"\",INDIRECT(\"'\"&B242&\"'!$K$111\"))","v":{"$error":"#REF!"}},{"$f":"IF(B242=\"\",\"\",INDIRECT(\"'\"&B242&\"'!$L$111\"))","v":{"$error":"#REF!"}},{"$f":"IF(B242=\"\",\"\",INDIRECT(\"'\"&B242&\"'!$H$111\"))","v":{"$error":"#REF!"}},{"$f":"IF(B242=\"\",\"\",INDIRECT(\"'\"&B242&\"'!$I$111\"))","v":{"$error":"#REF!"}},{"$f":"IF(B242=\"\",\"\",INDIRECT(\"'\"&B242&\"'!$R$111\"))","v":{"$error":"#REF!"}},{"$f":"IF(B242=\"\",\"\",INDIRECT(\"'\"&B242&\"'!$U$111\"))","v":{"$error":"#REF!"}},{"$f":"IF(B242=\"\",\"\",INDIRECT(\"'\"&B242&\"'!$X$111\"))","v":{"$error":"#REF!"}},{"$f":"IF(B242=\"\",\"\",INDIRECT(\"'\"&B242&\"'!$Z$111\"))","v":{"$error":"#REF!"}},{"$f":"IF(B242=\"\",\"\",INDIRECT(\"'\"&B242&\"'!$AA$111\"))","v":{"$error":"#REF!"}},{"$error":"#REF!"}]
[{"$nulls":4},{"$f":"IF(B242=\"\",\"\",INDIRECT(\"'\"&B242&\"'!$A$113\"))","v":{"$error":"#REF!"}},{"$f":"IF(B242=\"\",\"\",INDIRECT(\"'\"&B242&\"'!$K$120\"))","v":{"$error":"#REF!"}},{"$f":"IF(B242=\"\",\"\",INDIRECT(\"'\"&B242&\"'!$L$120\"))","v":{"$error":"#REF!"}},{"$f":"IF(B242=\"\",\"\",INDIRECT(\"'\"&B242&\"'!$H$120\"))","v":{"$error":"#REF!"}},{"$f":"IF(B242=\"\",\"\",INDIRECT(\"'\"&B242&\"'!$I$120\"))","v":{"$error":"#REF!"}},{"$f":"IF(B242=\"\",\"\",INDIRECT(\"'\"&B242&\"'!$R$120\"))","v":{"$error":"#REF!"}},{"$f":"IF(B242=\"\",\"\",INDIRECT(\"'\"&B242&\"'!$U$120\"))","v":{"$error":"#REF!"}},{"$f":"IF(B242=\"\",\"\",INDIRECT(\"'\"&B242&\"'!$X$120\"))","v":{"$error":"#REF!"}},{"$f":"IF(B242=\"\",\"\",INDIRECT(\"'\"&B242&\"'!$Z$120\"))","v":{"$error":"#REF!"}},{"$f":"IF(B242=\"\",\"\",INDIRECT(\"'\"&B242&\"'!$AA$120\"))","v":{"$error":"#REF!"}},{"$error":"#REF!"}]
[{"$nulls":4},{"$f":"IF(B242=\"\",\"\",INDIRECT(\"'\"&B242&\"'!$A$122\"))","v":{"$error":"#REF!"}},{"$f":"IF(B242=\"\",\"\",INDIRECT(\"'\"&B242&\"'!$K$129\"))","v":{"$error":"#REF!"}},{"$f":"IF(B242=\"\",\"\",INDIRECT(\"'\"&B242&\"'!$L$129\"))","v":{"$error":"#REF!"}},{"$f":"IF(B242=\"\",\"\",INDIRECT(\"'\"&B242&\"'!$H$129\"))","v":{"$error":"#REF!"}},{"$f":"IF(B242=\"\",\"\",INDIRECT(\"'\"&B242&\"'!$I$129\"))","v":{"$error":"#REF!"}},{"$f":"IF(B242=\"\",\"\",INDIRECT(\"'\"&B242&\"'!$R$129\"))","v":{"$error":"#REF!"}},{"$f":"IF(B242=\"\",\"\",INDIRECT(\"'\"&B242&\"'!$U$129\"))","v":{"$error":"#REF!"}},{"$f":"IF(B242=\"\",\"\",INDIRECT(\"'\"&B242&\"'!$X$129\"))","v":{"$error":"#REF!"}},{"$f":"IF(B242=\"\",\"\",INDIRECT(\"'\"&B242&\"'!$Z$129\"))","v":{"$error":"#REF!"}},{"$f":"IF(B242=\"\",\"\",INDIRECT(\"'\"&B242&\"'!$AA$129\"))","v":{"$error":"#REF!"}},{"$error":"#REF!"}]
[{"$nulls":4},{"$f":"IF(B242=\"\",\"\",INDIRECT(\"'\"&B242&\"'!$A$131\"))","v":{"$error":"#REF!"}},{"$f":"IF(B242=\"\",\"\",INDIRECT(\"'\"&B242&\"'!$K$167\"))","v":{"$error":"#REF!"}},{"$f":"IF(B242=\"\",\"\",INDIRECT(\"'\"&B242&\"'!$L$167\"))","v":{"$error":"#REF!"}},{"$f":"IF(B242=\"\",\"\",INDIRECT(\"'\"&B242&\"'!$H$167\"))","v":{"$error":"#REF!"}},{"$f":"IF(B242=\"\",\"\",INDIRECT(\"'\"&B242&\"'!$I$167\"))","v":{"$error":"#REF!"}},{"$f":"IF(B242=\"\",\"\",INDIRECT(\"'\"&B242&\"'!$R$167\"))","v":{"$error":"#REF!"}},{"$f":"IF(B242=\"\",\"\",INDIRECT(\"'\"&B242&\"'!$U$167\"))","v":{"$error":"#REF!"}},{"$f":"IF(B242=\"\",\"\",INDIRECT(\"'\"&B242&\"'!$X$167\"))","v":{"$error":"#REF!"}},{"$f":"IF(B242=\"\",\"\",INDIRECT(\"'\"&B242&\"'!$Z$167\"))","v":{"$error":"#REF!"}},{"$f":"IF(B242=\"\",\"\",INDIRECT(\"'\"&B242&\"'!$AA$167\"))","v":{"$error":"#REF!"}},{"$error":"#REF!"}]
[null,{"$f":"MID(INDEX(nom_feuilles,ROW(Masque!K35)),SEARCH(\"]\",INDEX(nom_feuilles,ROW(Masque!K35)))+1,30)","v":{"$error":"#REF!"}},{"$f":"IF(B250=\"\",\"\",INDIRECT(\"'\"&B250&\"'!$A$1\"))","v":{"$error":"#REF!"}},{"$f":"IF(B250=\"\",\"\",INDIRECT(\"'\"&B250&\"'!$A$2\"))","v":{"$error":"#REF!"}},{"$f":"IF(B250=\"\",\"\",INDIRECT(\"'\"&B250&\"'!$A$8\"))","v":{"$error":"#REF!"}},{"$f":"IF(B250=\"\",\"\",INDIRECT(\"'\"&B250&\"'!$K$30\"))","v":{"$error":"#REF!"}},{"$f":"IF(B250=\"\",\"\",INDIRECT(\"'\"&B250&\"'!$L$30\"))","v":{"$error":"#REF!"}},{"$f":"IF(B250=\"\",\"\",INDIRECT(\"'\"&B250&\"'!$H$30\"))","v":{"$error":"#REF!"}},{"$f":"IF(B250=\"\",\"\",INDIRECT(\"'\"&B250&\"'!$I$30\"))","v":{"$error":"#REF!"}},{"$f":"IF(B250=\"\",\"\",INDIRECT(\"'\"&B250&\"'!$R$30\"))","v":{"$error":"#REF!"}},{"$f":"IF(B250=\"\",\"\",INDIRECT(\"'\"&B250&\"'!$U$30\"))","v":{"$error":"#REF!"}},{"$f":"IF(B250=\"\",\"\",INDIRECT(\"'\"&B250&\"'!$X$30\"))","v":{"$error":"#REF!"}},{"$f":"IF(B250=\"\",\"\",INDIRECT(\"'\"&B250&\"'!$Z$30\"))","v":{"$error":"#REF!"}},{"$f":"IF(B250=\"\",\"\",INDIRECT(\"'\"&B250&\"'!$AA$30\"))","v":{"$error":"#REF!"}},{"$error":"#REF!"},{"$f":"SUM(O250:O257)","v":{"$error":"#REF!"}},{"$f":"IF(B250=\"\",\"\",INDIRECT(\"'\"&B250&\"'!$H$4\"))","v":{"$error":"#REF!"}},{"$f":"P250-Q250","v":{"$error":"#REF!"}}]
[{"$nulls":4},{"$f":"IF(B250=\"\",\"\",INDIRECT(\"'\"&B250&\"'!$A$32\"))","v":{"$error":"#REF!"}},{"$f":"IF(B250=\"\",\"\",INDIRECT(\"'\"&B250&\"'!$K$54\"))","v":{"$error":"#REF!"}},{"$f":"IF(B250=\"\",\"\",INDIRECT(\"'\"&B250&\"'!$L$54\"))","v":{"$error":"#REF!"}},{"$f":"IF(B250=\"\",\"\",INDIRECT(\"'\"&B250&\"'!$H$54\"))","v":{"$error":"#REF!"}},{"$f":"IF(B250=\"\",\"\",INDIRECT(\"'\"&B250&\"'!$I$54\"))","v":{"$error":"#REF!"}},{"$f":"IF(B250=\"\",\"\",INDIRECT(\"'\"&B250&\"'!$R$54\"))","v":{"$error":"#REF!"}},{"$f":"IF(B250=\"\",\"\",INDIRECT(\"'\"&B250&\"'!$U$54\"))","v":{"$error":"#REF!"}},{"$f":"IF(B250=\"\",\"\",INDIRECT(\"'\"&B250&\"'!$X$54\"))","v":{"$error":"#REF!"}},{"$f":"IF(B250=\"\",\"\",INDIRECT(\"'\"&B250&\"'!$Z$54\"))","v":{"$error":"#REF!"}},{"$f":"IF(B250=\"\",\"\",INDIRECT(\"'\"&B250&\"'!$AA$54\"))","v":{"$error":"#REF!"}},{"$error":"#REF!"}]
[{"$nulls":4},{"$f":"IF(B250=\"\",\"\",INDIRECT(\"'\"&B250&\"'!$A$56\"))","v":{"$error":"#REF!"}},{"$f":"IF(B250=\"\",\"\",INDIRECT(\"'\"&B250&\"'!$K$78\"))","v":{"$error":"#REF!"}},{"$f":"IF(B250=\"\",\"\",INDIRECT(\"'\"&B250&\"'!$L$78\"))","v":{"$error":"#REF!"}},{"$f":"IF(B250=\"\",\"\",INDIRECT(\"'\"&B250&\"'!$H$78\"))","v":{"$error":"#REF!"}},{"$f":"IF(B250=\"\",\"\",INDIRECT(\"'\"&B250&\"'!$I$78\"))","v":{"$error":"#REF!"}},{"$f":"IF(B250=\"\",\"\",INDIRECT(\"'\"&B250&\"'!$R$78\"))","v":{"$error":"#REF!"}},{"$f":"IF(B250=\"\",\"\",INDIRECT(\"'\"&B250&\"'!$U$78\"))","v":{"$error":"#REF!"}},{"$f":"IF(B250=\"\",\"\",INDIRECT(\"'\"&B250&\"'!$X$78\"))","v":{"$error":"#REF!"}},{"$f":"IF(B250=\"\",\"\",INDIRECT(\"'\"&B250&\"'!$Z$78\"))","v":{"$error":"#REF!"}},{"$f":"IF(B250=\"\",\"\",INDIRECT(\"'\"&B250&\"'!$AA$78\"))","v":{"$error":"#REF!"}},{"$error":"#REF!"}]
[{"$nulls":4},{"$f":"IF(B250=\"\",\"\",INDIRECT(\"'\"&B250&\"'!$A$80\"))","v":{"$error":"#REF!"}},{"$f":"IF(B250=\"\",\"\",INDIRECT(\"'\"&B250&\"'!$K$102\"))","v":{"$error":"#REF!"}},{"$f":"IF(B250=\"\",\"\",INDIRECT(\"'\"&B250&\"'!$L$102\"))","v":{"$error":"#REF!"}},{"$f":"IF(B250=\"\",\"\",INDIRECT(\"'\"&B250&\"'!$H$102\"))","v":{"$error":"#REF!"}},{"$f":"IF(B250=\"\",\"\",INDIRECT(\"'\"&B250&\"'!$I$102\"))","v":{"$error":"#REF!"}},{"$f":"IF(B250=\"\",\"\",INDIRECT(\"'\"&B250&\"'!$R$102\"))","v":{"$error":"#REF!"}},{"$f":"IF(B250=\"\",\"\",INDIRECT(\"'\"&B250&\"'!$U$102\"))","v":{"$error":"#REF!"}},{"$f":"IF(B250=\"\",\"\",INDIRECT(\"'\"&B250&\"'!$X$102\"))","v":{"$error":"#REF!"}},{"$f":"IF(B250=\"\",\"\",INDIRECT(\"'\"&B250&\"'!$Z$102\"))","v":{"$error":"#REF!"}},{"$f":"IF(B250=\"\",\"\",INDIRECT(\"'\"&B250&\"'!$AA$102\"))","v":{"$error":"#REF!"}},{"$error":"#REF!"}]
[{"$nulls":4},{"$f":"IF(B250=\"\",\"\",INDIRECT(\"'\"&B250&\"'!$A$104\"))","v":{"$error":"#REF!"}},{"$f":"IF(B250=\"\",\"\",INDIRECT(\"'\"&B250&\"'!$K$111\"))","v":{"$error":"#REF!"}},{"$f":"IF(B250=\"\",\"\",INDIRECT(\"'\"&B250&\"'!$L$111\"))","v":{"$error":"#REF!"}},{"$f":"IF(B250=\"\",\"\",INDIRECT(\"'\"&B250&\"'!$H$111\"))","v":{"$error":"#REF!"}},{"$f":"IF(B250=\"\",\"\",INDIRECT(\"'\"&B250&\"'!$I$111\"))","v":{"$error":"#REF!"}},{"$f":"IF(B250=\"\",\"\",INDIRECT(\"'\"&B250&\"'!$R$111\"))","v":{"$error":"#REF!"}},{"$f":"IF(B250=\"\",\"\",INDIRECT(\"'\"&B250&\"'!$U$111\"))","v":{"$error":"#REF!"}},{"$f":"IF(B250=\"\",\"\",INDIRECT(\"'\"&B250&\"'!$X$111\"))","v":{"$error":"#REF!"}},{"$f":"IF(B250=\"\",\"\",INDIRECT(\"'\"&B250&\"'!$Z$111\"))","v":{"$error":"#REF!"}},{"$f":"IF(B250=\"\",\"\",INDIRECT(\"'\"&B250&\"'!$AA$111\"))","v":{"$error":"#REF!"}},{"$error":"#REF!"}]
[{"$nulls":4},{"$f":"IF(B250=\"\",\"\",INDIRECT(\"'\"&B250&\"'!$A$113\"))","v":{"$error":"#REF!"}},{"$f":"IF(B250=\"\",\"\",INDIRECT(\"'\"&B250&\"'!$K$120\"))","v":{"$error":"#REF!"}},{"$f":"IF(B250=\"\",\"\",INDIRECT(\"'\"&B250&\"'!$L$120\"))","v":{"$error":"#REF!"}},{"$f":"IF(B250=\"\",\"\",INDIRECT(\"'\"&B250&\"'!$H$120\"))","v":{"$error":"#REF!"}},{"$f":"IF(B250=\"\",\"\",INDIRECT(\"'\"&B250&\"'!$I$120\"))","v":{"$error":"#REF!"}},{"$f":"IF(B250=\"\",\"\",INDIRECT(\"'\"&B250&\"'!$R$120\"))","v":{"$error":"#REF!"}},{"$f":"IF(B250=\"\",\"\",INDIRECT(\"'\"&B250&\"'!$U$120\"))","v":{"$error":"#REF!"}},{"$f":"IF(B250=\"\",\"\",INDIRECT(\"'\"&B250&\"'!$X$120\"))","v":{"$error":"#REF!"}},{"$f":"IF(B250=\"\",\"\",INDIRECT(\"'\"&B250&\"'!$Z$120\"))","v":{"$error":"#REF!"}},{"$f":"IF(B250=\"\",\"\",INDIRECT(\"'\"&B250&\"'!$AA$120\"))","v":{"$error":"#REF!"}},{"$error":"#REF!"}]
[{"$nulls":4},{"$f":"IF(B250=\"\",\"\",INDIRECT(\"'\"&B250&\"'!$A$122\"))","v":{"$error":"#REF!"}},{"$f":"IF(B250=\"\",\"\",INDIRECT(\"'\"&B250&\"'!$K$129\"))","v":{"$error":"#REF!"}},{"$f":"IF(B250=\"\",\"\",INDIRECT(\"'\"&B250&\"'!$L$129\"))","v":{"$error":"#REF!"}},{"$f":"IF(B250=\"\",\"\",INDIRECT(\"'\"&B250&\"'!$H$129\"))","v":{"$error":"#REF!"}},{"$f":"IF(B250=\"\",\"\",INDIRECT(\"'\"&B250&\"'!$I$129\"))","v":{"$error":"#REF!"}},{"$f":"IF(B250=\"\",\"\",INDIRECT(\"'\"&B250&\"'!$R$129\"))","v":{"$error":"#REF!"}},{"$f":"IF(B250=\"\",\"\",INDIRECT(\"'\"&B250&\"'!$U$129\"))","v":{"$error":"#REF!"}},{"$f":"IF(B250=\"\",\"\",INDIRECT(\"'\"&B250&\"'!$X$129\"))","v":{"$error":"#REF!"}},{"$f":"IF(B250=\"\",\"\",INDIRECT(\"'\"&B250&\"'!$Z$129\"))","v":{"$error":"#REF!"}},{"$f":"IF(B250=\"\",\"\",INDIRECT(\"'\"&B250&\"'!$AA$129\"))","v":{"$error":"#REF!"}},{"$error":"#REF!"}]
[{"$nulls":4},{"$f":"IF(B250=\"\",\"\",INDIRECT(\"'\"&B250&\"'!$A$131\"))","v":{"$error":"#REF!"}},{"$f":"IF(B250=\"\",\"\",INDIRECT(\"'\"&B250&\"'!$K$167\"))","v":{"$error":"#REF!"}},{"$f":"IF(B250=\"\",\"\",INDIRECT(\"'\"&B250&\"'!$L$167\"))","v":{"$error":"#REF!"}},{"$f":"IF(B250=\"\",\"\",INDIRECT(\"'\"&B250&\"'!$H$167\"))","v":{"$error":"#REF!"}},{"$f":"IF(B250=\"\",\"\",INDIRECT(\"'\"&B250&\"'!$I$167\"))","v":{"$error":"#REF!"}},{"$f":"IF(B250=\"\",\"\",INDIRECT(\"'\"&B250&\"'!$R$167\"))","v":{"$error":"#REF!"}},{"$f":"IF(B250=\"\",\"\",INDIRECT(\"'\"&B250&\"'!$U$167\"))","v":{"$error":"#REF!"}},{"$f":"IF(B250=\"\",\"\",INDIRECT(\"'\"&B250&\"'!$X$167\"))","v":{"$error":"#REF!"}},{"$f":"IF(B250=\"\",\"\",INDIRECT(\"'\"&B250&\"'!$Z$167\"))","v":{"$error":"#REF!"}},{"$f":"IF(B250=\"\",\"\",INDIRECT(\"'\"&B250&\"'!$AA$167\"))","v":{"$error":"#REF!"}},{"$error":"#REF!"}]
[null,{"$f":"MID(INDEX(nom_feuilles,ROW(Masque!K36)),SEARCH(\"]\",INDEX(nom_feuilles,ROW(Masque!K36)))+1,30)","v":{"$error":"#REF!"}},{"$f":"IF(B258=\"\",\"\",INDIRECT(\"'\"&B258&\"'!$A$1\"))","v":{"$error":"#REF!"}},{"$f":"IF(B258=\"\",\"\",INDIRECT(\"'\"&B258&\"'!$A$2\"))","v":{"$error":"#REF!"}},{"$f":"IF(B258=\"\",\"\",INDIRECT(\"'\"&B258&\"'!$A$8\"))","v":{"$error":"#REF!"}},{"$f":"IF(B258=\"\",\"\",INDIRECT(\"'\"&B258&\"'!$K$30\"))","v":{"$error":"#REF!"}},{"$f":"IF(B258=\"\",\"\",INDIRECT(\"'\"&B258&\"'!$L$30\"))","v":{"$error":"#REF!"}},{"$f":"IF(B258=\"\",\"\",INDIRECT(\"'\"&B258&\"'!$H$30\"))","v":{"$error":"#REF!"}},{"$f":"IF(B258=\"\",\"\",INDIRECT(\"'\"&B258&\"'!$I$30\"))","v":{"$error":"#REF!"}},{"$f":"IF(B258=\"\",\"\",INDIRECT(\"'\"&B258&\"'!$R$30\"))","v":{"$error":"#REF!"}},{"$f":"IF(B258=\"\",\"\",INDIRECT(\"'\"&B258&\"'!$U$30\"))","v":{"$error":"#REF!"}},{"$f":"IF(B258=\"\",\"\",INDIRECT(\"'\"&B258&\"'!$X$30\"))","v":{"$error":"#REF!"}},{"$f":"IF(B258=\"\",\"\",INDIRECT(\"'\"&B258&\"'!$Z$30\"))","v":{"$error":"#REF!"}},{"$f":"IF(B258=\"\",\"\",INDIRECT(\"'\"&B258&\"'!$AA$30\"))","v":{"$error":"#REF!"}},{"$error":"#REF!"},{"$f":"SUM(O258:O265)","v":{"$error":"#REF!"}},{"$f":"IF(B258=\"\",\"\",INDIRECT(\"'\"&B258&\"'!$H$4\"))","v":{"$error":"#REF!"}},{"$f":"P258-Q258","v":{"$error":"#REF!"}}]
[{"$nulls":4},{"$f":"IF(B258=\"\",\"\",INDIRECT(\"'\"&B258&\"'!$A$32\"))","v":{"$error":"#REF!"}},{"$f":"IF(B258=\"\",\"\",INDIRECT(\"'\"&B258&\"'!$K$54\"))","v":{"$error":"#REF!"}},{"$f":"IF(B258=\"\",\"\",INDIRECT(\"'\"&B258&\"'!$L$54\"))","v":{"$error":"#REF!"}},{"$f":"IF(B258=\"\",\"\",INDIRECT(\"'\"&B258&\"'!$H$54\"))","v":{"$error":"#REF!"}},{"$f":"IF(B258=\"\",\"\",INDIRECT(\"'\"&B258&\"'!$I$54\"))","v":{"$error":"#REF!"}},{"$f":"IF(B258=\"\",\"\",INDIRECT(\"'\"&B258&\"'!$R$54\"))","v":{"$error":"#REF!"}},{"$f":"IF(B258=\"\",\"\",INDIRECT(\"'\"&B258&\"'!$U$54\"))","v":{"$error":"#REF!"}},{"$f":"IF(B258=\"\",\"\",INDIRECT(\"'\"&B258&\"'!$X$54\"))","v":{"$error":"#REF!"}},{"$f":"IF(B258=\"\",\"\",INDIRECT(\"'\"&B258&\"'!$Z$54\"))","v":{"$error":"#REF!"}},{"$f":"IF(B258=\"\",\"\",INDIRECT(\"'\"&B258&\"'!$AA$54\"))","v":{"$error":"#REF!"}},{"$error":"#REF!"}]
[{"$nulls":4},{"$f":"IF(B258=\"\",\"\",INDIRECT(\"'\"&B258&\"'!$A$56\"))","v":{"$error":"#REF!"}},{"$f":"IF(B258=\"\",\"\",INDIRECT(\"'\"&B258&\"'!$K$78\"))","v":{"$error":"#REF!"}},{"$f":"IF(B258=\"\",\"\",INDIRECT(\"'\"&B258&\"'!$L$78\"))","v":{"$error":"#REF!"}},{"$f":"IF(B258=\"\",\"\",INDIRECT(\"'\"&B258&\"'!$H$78\"))","v":{"$error":"#REF!"}},{"$f":"IF(B258=\"\",\"\",INDIRECT(\"'\"&B258&\"'!$I$78\"))","v":{"$error":"#REF!"}},{"$f":"IF(B258=\"\",\"\",INDIRECT(\"'\"&B258&\"'!$R$78\"))","v":{"$error":"#REF!"}},{"$f":"IF(B258=\"\",\"\",INDIRECT(\"'\"&B258&\"'!$U$78\"))","v":{"$error":"#REF!"}},{"$f":"IF(B258=\"\",\"\",INDIRECT(\"'\"&B258&\"'!$X$78\"))","v":{"$error":"#REF!"}},{"$f":"IF(B258=\"\",\"\",INDIRECT(\"'\"&B258&\"'!$Z$78\"))","v":{"$error":"#REF!"}},{"$f":"IF(B258=\"\",\"\",INDIRECT(\"'\"&B258&\"'!$AA$78\"))","v":{"$error":"#REF!"}},{"$error":"#REF!"}]
[{"$nulls":4},{"$f":"IF(B258=\"\",\"\",INDIRECT(\"'\"&B258&\"'!$A$80\"))","v":{"$error":"#REF!"}},{"$f":"IF(B258=\"\",\"\",INDIRECT(\"'\"&B258&\"'!$K$102\"))","v":{"$error":"#REF!"}},{"$f":"IF(B258=\"\",\"\",INDIRECT(\"'\"&B258&\"'!$L$102\"))","v":{"$error":"#REF!"}},{"$f":"IF(B258=\"\",\"\",INDIRECT(\"'\"&B258&\"'!$H$102\"))","v":{"$error":"#REF!"}},{"$f":"IF(B258=\"\",\"\",INDIRECT(\"'\"&B258&\"'!$I$102\"))","v":{"$error":"#REF!"}},{"$f":"IF(B258=\"\",\"\",INDIRECT(\"'\"&B258&\"'!$R$102\"))","v":{"$error":"#REF!"}},{"$f":"IF(B258=\"\",\"\",INDIRECT(\"'\"&B258&\"'!$U$102\"))","v":{"$error":"#REF!"}},{"$f":"IF(B258=\"\",\"\",INDIRECT(\"'\"&B258&\"'!$X$102\"))","v":{"$error":"#REF!"}},{"$f":"IF(B258=\"\",\"\",INDIRECT(\"'\"&B258&\"'!$Z$102\"))","v":{"$error":"#REF!"}},{"$f":"IF(B258=\"\",\"\",INDIRECT(\"'\"&B258&\"'!$AA$102\"))","v":{"$error":"#REF!"}},{"$error":"#REF!"}]
[{"$nulls":4},{"$f":"IF(B258=\"\",\"\",INDIRECT(\"'\"&B258&\"'!$A$104\"))","v":{"$error":"#REF!"}},{"$f":"IF(B258=\"\",\"\",INDIRECT(\"'\"&B258&\"'!$K$111\"))","v":{"$error":"#REF!"}},{"$f":"IF(B258=\"\",\"\",INDIRECT(\"'\"&B258&\"'!$L$111\"))","v":{"$error":"#REF!"}},{"$f":"IF(B258=\"\",\"\",INDIRECT(\"'\"&B258&\"'!$H$111\"))","v":{"$error":"#REF!"}},{"$f":"IF(B258=\"\",\"\",INDIRECT(\"'\"&B258&\"'!$I$111\"))","v":{"$error":"#REF!"}},{"$f":"IF(B258=\"\",\"\",INDIRECT(\"'\"&B258&\"'!$R$111\"))","v":{"$error":"#REF!"}},{"$f":"IF(B258=\"\",\"\",INDIRECT(\"'\"&B258&\"'!$U$111\"))","v":{"$error":"#REF!"}},{"$f":"IF(B258=\"\",\"\",INDIRECT(\"'\"&B258&\"'!$X$111\"))","v":{"$error":"#REF!"}},{"$f":"IF(B258=\"\",\"\",INDIRECT(\"'\"&B258&\"'!$Z$111\"))","v":{"$error":"#REF!"}},{"$f":"IF(B258=\"\",\"\",INDIRECT(\"'\"&B258&\"'!$AA$111\"))","v":{"$error":"#REF!"}},{"$error":"#REF!"}]
[{"$nulls":4},{"$f":"IF(B258=\"\",\"\",INDIRECT(\"'\"&B258&\"'!$A$113\"))","v":{"$error":"#REF!"}},{"$f":"IF(B258=\"\",\"\",INDIRECT(\"'\"&B258&\"'!$K$120\"))","v":{"$error":"#REF!"}},{"$f":"IF(B258=\"\",\"\",INDIRECT(\"'\"&B258&\"'!$L$120\"))","v":{"$error":"#REF!"}},{"$f":"IF(B258=\"\",\"\",INDIRECT(\"'\"&B258&\"'!$H$120\"))","v":{"$error":"#REF!"}},{"$f":"IF(B258=\"\",\"\",INDIRECT(\"'\"&B258&\"'!$I$120\"))","v":{"$error":"#REF!"}},{"$f":"IF(B258=\"\",\"\",INDIRECT(\"'\"&B258&\"'!$R$120\"))","v":{"$error":"#REF!"}},{"$f":"IF(B258=\"\",\"\",INDIRECT(\"'\"&B258&\"'!$U$120\"))","v":{"$error":"#REF!"}},{"$f":"IF(B258=\"\",\"\",INDIRECT(\"'\"&B258&\"'!$X$120\"))","v":{"$error":"#REF!"}},{"$f":"IF(B258=\"\",\"\",INDIRECT(\"'\"&B258&\"'!$Z$120\"))","v":{"$error":"#REF!"}},{"$f":"IF(B258=\"\",\"\",INDIRECT(\"'\"&B258&\"'!$AA$120\"))","v":{"$error":"#REF!"}},{"$error":"#REF!"}]
[{"$nulls":4},{"$f":"IF(B258=\"\",\"\",INDIRECT(\"'\"&B258&\"'!$A$122\"))","v":{"$error":"#REF!"}},{"$f":"IF(B258=\"\",\"\",INDIRECT(\"'\"&B258&\"'!$K$129\"))","v":{"$error":"#REF!"}},{"$f":"IF(B258=\"\",\"\",INDIRECT(\"'\"&B258&\"'!$L$129\"))","v":{"$error":"#REF!"}},{"$f":"IF(B258=\"\",\"\",INDIRECT(\"'\"&B258&\"'!$H$129\"))","v":{"$error":"#REF!"}},{"$f":"IF(B258=\"\",\"\",INDIRECT(\"'\"&B258&\"'!$I$129\"))","v":{"$error":"#REF!"}},{"$f":"IF(B258=\"\",\"\",INDIRECT(\"'\"&B258&\"'!$R$129\"))","v":{"$error":"#REF!"}},{"$f":"IF(B258=\"\",\"\",INDIRECT(\"'\"&B258&\"'!$U$129\"))","v":{"$error":"#REF!"}},{"$f":"IF(B258=\"\",\"\",INDIRECT(\"'\"&B258&\"'!$X$129\"))","v":{"$error":"#REF!"}},{"$f":"IF(B258=\"\",\"\",INDIRECT(\"'\"&B258&\"'!$Z$129\"))","v":{"$error":"#REF!"}},{"$f":"IF(B258=\"\",\"\",INDIRECT(\"'\"&B258&\"'!$AA$129\"))","v":{"$error":"#REF!"}},{"$error":"#REF!"}]
[{"$nulls":4},{"$f":"IF(B258=\"\",\"\",INDIRECT(\"'\"&B258&\"'!$A$131\"))","v":{"$error":"#REF!"}},{"$f":"IF(B258=\"\",\"\",INDIRECT(\"'\"&B258&\"'!$K$167\"))","v":{"$error":"#REF!"}},{"$f":"IF(B258=\"\",\"\",INDIRECT(\"'\"&B258&\"'!$L$167\"))","v":{"$error":"#REF!"}},{"$f":"IF(B258=\"\",\"\",INDIRECT(\"'\"&B258&\"'!$H$167\"))","v":{"$error":"#REF!"}},{"$f":"IF(B258=\"\",\"\",INDIRECT(\"'\"&B258&\"'!$I$167\"))","v":{"$error":"#REF!"}},{"$f":"IF(B258=\"\",\"\",INDIRECT(\"'\"&B258&\"'!$R$167\"))","v":{"$error":"#REF!"}},{"$f":"IF(B258=\"\",\"\",INDIRECT(\"'\"&B258&\"'!$U$167\"))","v":{"$error":"#REF!"}},{"$f":"IF(B258=\"\",\"\",INDIRECT(\"'\"&B258&\"'!$X$167\"))","v":{"$error":"#REF!"}},{"$f":"IF(B258=\"\",\"\",INDIRECT(\"'\"&B258&\"'!$Z$167\"))","v":{"$error":"#REF!"}},{"$f":"IF(B258=\"\",\"\",INDIRECT(\"'\"&B258&\"'!$AA$167\"))","v":{"$error":"#REF!"}},{"$error":"#REF!"}]
[null,{"$f":"MID(INDEX(nom_feuilles,ROW(Masque!K37)),SEARCH(\"]\",INDEX(nom_feuilles,ROW(Masque!K37)))+1,30)","v":{"$error":"#REF!"}},{"$f":"IF(B266=\"\",\"\",INDIRECT(\"'\"&B266&\"'!$A$1\"))","v":{"$error":"#REF!"}},{"$f":"IF(B266=\"\",\"\",INDIRECT(\"'\"&B266&\"'!$A$2\"))","v":{"$error":"#REF!"}},{"$f":"IF(B266=\"\",\"\",INDIRECT(\"'\"&B266&\"'!$A$8\"))","v":{"$error":"#REF!"}},{"$f":"IF(B266=\"\",\"\",INDIRECT(\"'\"&B266&\"'!$K$30\"))","v":{"$error":"#REF!"}},{"$f":"IF(B266=\"\",\"\",INDIRECT(\"'\"&B266&\"'!$L$30\"))","v":{"$error":"#REF!"}},{"$f":"IF(B266=\"\",\"\",INDIRECT(\"'\"&B266&\"'!$H$30\"))","v":{"$error":"#REF!"}},{"$f":"IF(B266=\"\",\"\",INDIRECT(\"'\"&B266&\"'!$I$30\"))","v":{"$error":"#REF!"}},{"$f":"IF(B266=\"\",\"\",INDIRECT(\"'\"&B266&\"'!$R$30\"))","v":{"$error":"#REF!"}},{"$f":"IF(B266=\"\",\"\",INDIRECT(\"'\"&B266&\"'!$U$30\"))","v":{"$error":"#REF!"}},{"$f":"IF(B266=\"\",\"\",INDIRECT(\"'\"&B266&\"'!$X$30\"))","v":{"$error":"#REF!"}},{"$f":"IF(B266=\"\",\"\",INDIRECT(\"'\"&B266&\"'!$Z$30\"))","v":{"$error":"#REF!"}},{"$f":"IF(B266=\"\",\"\",INDIRECT(\"'\"&B266&\"'!$AA$30\"))","v":{"$error":"#REF!"}},{"$f":"SUM(F266:N266)","v":{"$error":"#REF!"}},{"$f":"SUM(O266:O273)","v":{"$error":"#REF!"}},{"$f":"IF(B266=\"\",\"\",INDIRECT(\"'\"&B266&\"'!$H$4\"))","v":{"$error":"#REF!"}},{"$f":"P266-Q266","v":{"$error":"#REF!"}}]
[{"$nulls":4},{"$f":"IF(B266=\"\",\"\",INDIRECT(\"'\"&B266&\"'!$A$32\"))","v":{"$error":"#REF!"}},{"$f":"IF(B266=\"\",\"\",INDIRECT(\"'\"&B266&\"'!$K$54\"))","v":{"$error":"#REF!"}},{"$f":"IF(B266=\"\",\"\",INDIRECT(\"'\"&B266&\"'!$L$54\"))","v":{"$error":"#REF!"}},{"$f":"IF(B266=\"\",\"\",INDIRECT(\"'\"&B266&\"'!$H$54\"))","v":{"$error":"#REF!"}},{"$f":"IF(B266=\"\",\"\",INDIRECT(\"'\"&B266&\"'!$I$54\"))","v":{"$error":"#REF!"}},{"$f":"IF(B266=\"\",\"\",INDIRECT(\"'\"&B266&\"'!$R$54\"))","v":{"$error":"#REF!"}},{"$f":"IF(B266=\"\",\"\",INDIRECT(\"'\"&B266&\"'!$U$54\"))","v":{"$error":"#REF!"}},{"$f":"IF(B266=\"\",\"\",INDIRECT(\"'\"&B266&\"'!$X$54\"))","v":{"$error":"#REF!"}},{"$f":"IF(B266=\"\",\"\",INDIRECT(\"'\"&B266&\"'!$Z$54\"))","v":{"$error":"#REF!"}},{"$f":"IF(B266=\"\",\"\",INDIRECT(\"'\"&B266&\"'!$AA$54\"))","v":{"$error":"#REF!"}},{"$error":"#REF!"}]
[{"$nulls":4},{"$f":"IF(B266=\"\",\"\",INDIRECT(\"'\"&B266&\"'!$A$56\"))","v":{"$error":"#REF!"}},{"$f":"IF(B266=\"\",\"\",INDIRECT(\"'\"&B266&\"'!$K$78\"))","v":{"$error":"#REF!"}},{"$f":"IF(B266=\"\",\"\",INDIRECT(\"'\"&B266&\"'!$L$78\"))","v":{"$error":"#REF!"}},{"$f":"IF(B266=\"\",\"\",INDIRECT(\"'\"&B266&\"'!$H$78\"))","v":{"$error":"#REF!"}},{"$f":"IF(B266=\"\",\"\",INDIRECT(\"'\"&B266&\"'!$I$78\"))","v":{"$error":"#REF!"}},{"$f":"IF(B266=\"\",\"\",INDIRECT(\"'\"&B266&\"'!$R$78\"))","v":{"$error":"#REF!"}},{"$f":"IF(B266=\"\",\"\",INDIRECT(\"'\"&B266&\"'!$U$78\"))","v":{"$error":"#REF!"}},{"$f":"IF(B266=\"\",\"\",INDIRECT(\"'\"&B266&\"'!$X$78\"))","v":{"$error":"#REF!"}},{"$f":"IF(B266=\"\",\"\",INDIRECT(\"'\"&B266&\"'!$Z$78\"))","v":{"$error":"#REF!"}},{"$f":"IF(B266=\"\",\"\",INDIRECT(\"'\"&B266&\"'!$AA$78\"))","v":{"$error":"#REF!"}},{"$error":"#REF!"}]
[{"$nulls":4},{"$f":"IF(B266=\"\",\"\",INDIRECT(\"'\"&B266&\"'!$A$80\"))","v":{"$error":"#REF!"}},{"$f":"IF(B266=\"\",\"\",INDIRECT(\"'\"&B266&\"'!$K$102\"))","v":{"$error":"#REF!"}},{"$f":"IF(B266=\"\",\"\",INDIRECT(\"'\"&B266&\"'!$L$102\"))","v":{"$error":"#REF!"}},{"$f":"IF(B266=\"\",\"\",INDIRECT(\"'\"&B266&\"'!$H$102\"))","v":{"$error":"#REF!"}},{"$f":"IF(B266=\"\",\"\",INDIRECT(\"'\"&B266&\"'!$I$102\"))","v":{"$error":"#REF!"}},{"$f":"IF(B266=\"\",\"\",INDIRECT(\"'\"&B266&\"'!$R$102\"))","v":{"$error":"#REF!"}},{"$f":"IF(B266=\"\",\"\",INDIRECT(\"'\"&B266&\"'!$U$102\"))","v":{"$error":"#REF!"}},{"$f":"IF(B266=\"\",\"\",INDIRECT(\"'\"&B266&\"'!$X$102\"))","v":{"$error":"#REF!"}},{"$f":"IF(B266=\"\",\"\",INDIRECT(\"'\"&B266&\"'!$Z$102\"))","v":{"$error":"#REF!"}},{"$f":"IF(B266=\"\",\"\",INDIRECT(\"'\"&B266&\"'!$AA$102\"))","v":{"$error":"#REF!"}},{"$error":"#REF!"}]
[{"$nulls":4},{"$f":"IF(B266=\"\",\"\",INDIRECT(\"'\"&B266&\"'!$A$104\"))","v":{"$error":"#REF!"}},{"$f":"IF(B266=\"\",\"\",INDIRECT(\"'\"&B266&\"'!$K$111\"))","v":{"$error":"#REF!"}},{"$f":"IF(B266=\"\",\"\",INDIRECT(\"'\"&B266&\"'!$L$111\"))","v":{"$error":"#REF!"}},{"$f":"IF(B266=\"\",\"\",INDIRECT(\"'\"&B266&\"'!$H$111\"))","v":{"$error":"#REF!"}},{"$f":"IF(B266=\"\",\"\",INDIRECT(\"'\"&B266&\"'!$I$111\"))","v":{"$error":"#REF!"}},{"$f":"IF(B266=\"\",\"\",INDIRECT(\"'\"&B266&\"'!$R$111\"))","v":{"$error":"#REF!"}},{"$f":"IF(B266=\"\",\"\",INDIRECT(\"'\"&B266&\"'!$U$111\"))","v":{"$error":"#REF!"}},{"$f":"IF(B266=\"\",\"\",INDIRECT(\"'\"&B266&\"'!$X$111\"))","v":{"$error":"#REF!"}},{"$f":"IF(B266=\"\",\"\",INDIRECT(\"'\"&B266&\"'!$Z$111\"))","v":{"$error":"#REF!"}},{"$f":"IF(B266=\"\",\"\",INDIRECT(\"'\"&B266&\"'!$AA$111\"))","v":{"$error":"#REF!"}},{"$error":"#REF!"}]
[{"$nulls":4},{"$f":"IF(B266=\"\",\"\",INDIRECT(\"'\"&B266&\"'!$A$113\"))","v":{"$error":"#REF!"}},{"$f":"IF(B266=\"\",\"\",INDIRECT(\"'\"&B266&\"'!$K$120\"))","v":{"$error":"#REF!"}},{"$f":"IF(B266=\"\",\"\",INDIRECT(\"'\"&B266&\"'!$L$120\"))","v":{"$error":"#REF!"}},{"$f":"IF(B266=\"\",\"\",INDIRECT(\"'\"&B266&\"'!$H$120\"))","v":{"$error":"#REF!"}},{"$f":"IF(B266=\"\",\"\",INDIRECT(\"'\"&B266&\"'!$I$120\"))","v":{"$error":"#REF!"}},{"$f":"IF(B266=\"\",\"\",INDIRECT(\"'\"&B266&\"'!$R$120\"))","v":{"$error":"#REF!"}},{"$f":"IF(B266=\"\",\"\",INDIRECT(\"'\"&B266&\"'!$U$120\"))","v":{"$error":"#REF!"}},{"$f":"IF(B266=\"\",\"\",INDIRECT(\"'\"&B266&\"'!$X$120\"))","v":{"$error":"#REF!"}},{"$f":"IF(B266=\"\",\"\",INDIRECT(\"'\"&B266&\"'!$Z$120\"))","v":{"$error":"#REF!"}},{"$f":"IF(B266=\"\",\"\",INDIRECT(\"'\"&B266&\"'!$AA$120\"))","v":{"$error":"#REF!"}},{"$error":"#REF!"}]
[{"$nulls":4},{"$f":"IF(B266=\"\",\"\",INDIRECT(\"'\"&B266&\"'!$A$122\"))","v":{"$error":"#REF!"}},{"$f":"IF(B266=\"\",\"\",INDIRECT(\"'\"&B266&\"'!$K$129\"))","v":{"$error":"#REF!"}},{"$f":"IF(B266=\"\",\"\",INDIRECT(\"'\"&B266&\"'!$L$129\"))","v":{"$error":"#REF!"}},{"$f":"IF(B266=\"\",\"\",INDIRECT(\"'\"&B266&\"'!$H$129\"))","v":{"$error":"#REF!"}},{"$f":"IF(B266=\"\",\"\",INDIRECT(\"'\"&B266&\"'!$I$129\"))","v":{"$error":"#REF!"}},{"$f":"IF(B266=\"\",\"\",INDIRECT(\"'\"&B266&\"'!$R$129\"))","v":{"$error":"#REF!"}},{"$f":"IF(B266=\"\",\"\",INDIRECT(\"'\"&B266&\"'!$U$129\"))","v":{"$error":"#REF!"}},{"$f":"IF(B266=\"\",\"\",INDIRECT(\"'\"&B266&\"'!$X$129\"))","v":{"$error":"#REF!"}},{"$f":"IF(B266=\"\",\"\",INDIRECT(\"'\"&B266&\"'!$Z$129\"))","v":{"$error":"#REF!"}},{"$f":"IF(B266=\"\",\"\",INDIRECT(\"'\"&B266&\"'!$AA$129\"))","v":{"$error":"#REF!"}},{"$error":"#REF!"}]
[{"$nulls":4},{"$f":"IF(B266=\"\",\"\",INDIRECT(\"'\"&B266&\"'!$A$131\"))","v":{"$error":"#REF!"}},{"$f":"IF(B266=\"\",\"\",INDIRECT(\"'\"&B266&\"'!$K$167\"))","v":{"$error":"#REF!"}},{"$f":"IF(B266=\"\",\"\",INDIRECT(\"'\"&B266&\"'!$L$167\"))","v":{"$error":"#REF!"}},{"$f":"IF(B266=\"\",\"\",INDIRECT(\"'\"&B266&\"'!$H$167\"))","v":{"$error":"#REF!"}},{"$f":"IF(B266=\"\",\"\",INDIRECT(\"'\"&B266&\"'!$I$167\"))","v":{"$error":"#REF!"}},{"$f":"IF(B266=\"\",\"\",INDIRECT(\"'\"&B266&\"'!$R$167\"))","v":{"$error":"#REF!"}},{"$f":"IF(B266=\"\",\"\",INDIRECT(\"'\"&B266&\"'!$U$167\"))","v":{"$error":"#REF!"}},{"$f":"IF(B266=\"\",\"\",INDIRECT(\"'\"&B266&\"'!$X$167\"))","v":{"$error":"#REF!"}},{"$f":"IF(B266=\"\",\"\",INDIRECT(\"'\"&B266&\"'!$Z$167\"))","v":{"$error":"#REF!"}},{"$f":"IF(B266=\"\",\"\",INDIRECT(\"'\"&B266&\"'!$AA$167\"))","v":{"$error":"#REF!"}},{"$error":"#REF!"}]
[null,{"$f":"MID(INDEX(nom_feuilles,ROW(Masque!K38)),SEARCH(\"]\",INDEX(nom_feuilles,ROW(Masque!K38)))+1,30)","v":{"$error":"#REF!"}},{"$f":"IF(B274=\"\",\"\",INDIRECT(\"'\"&B274&\"'!$A$1\"))","v":{"$error":"#REF!"}},{"$f":"IF(B274=\"\",\"\",INDIRECT(\"'\"&B274&\"'!$A$2\"))","v":{"$error":"#REF!"}},{"$f":"IF(B274=\"\",\"\",INDIRECT(\"'\"&B274&\"'!$A$8\"))","v":{"$error":"#REF!"}},{"$f":"IF(B274=\"\",\"\",INDIRECT(\"'\"&B274&\"'!$K$30\"))","v":{"$error":"#REF!"}},{"$f":"IF(B274=\"\",\"\",INDIRECT(\"'\"&B274&\"'!$L$30\"))","v":{"$error":"#REF!"}},{"$f":"IF(B274=\"\",\"\",INDIRECT(\"'\"&B274&\"'!$H$30\"))","v":{"$error":"#REF!"}},{"$f":"IF(B274=\"\",\"\",INDIRECT(\"'\"&B274&\"'!$I$30\"))","v":{"$error":"#REF!"}},{"$f":"IF(B274=\"\",\"\",INDIRECT(\"'\"&B274&\"'!$R$30\"))","v":{"$error":"#REF!"}},{"$f":"IF(B274=\"\",\"\",INDIRECT(\"'\"&B274&\"'!$U$30\"))","v":{"$error":"#REF!"}},{"$f":"IF(B274=\"\",\"\",INDIRECT(\"'\"&B274&\"'!$X$30\"))","v":{"$error":"#REF!"}},{"$f":"IF(B274=\"\",\"\",INDIRECT(\"'\"&B274&\"'!$Z$30\"))","v":{"$error":"#REF!"}},{"$f":"IF(B274=\"\",\"\",INDIRECT(\"'\"&B274&\"'!$AA$30\"))","v":{"$error":"#REF!"}},{"$f":"SUM(F274:N274)","v":{"$error":"#REF!"}},{"$f":"SUM(O274:O281)","v":{"$error":"#REF!"}},{"$f":"IF(B274=\"\",\"\",INDIRECT(\"'\"&B274&\"'!$H$4\"))","v":{"$error":"#REF!"}},{"$f":"P274-Q274","v":{"$error":"#REF!"}}]
[{"$nulls":4},{"$f":"IF(B274=\"\",\"\",INDIRECT(\"'\"&B274&\"'!$A$32\"))","v":{"$error":"#REF!"}},{"$f":"IF(B274=\"\",\"\",INDIRECT(\"'\"&B274&\"'!$K$54\"))","v":{"$error":"#REF!"}},{"$f":"IF(B274=\"\",\"\",INDIRECT(\"'\"&B274&\"'!$L$54\"))","v":{"$error":"#REF!"}},{"$f":"IF(B274=\"\",\"\",INDIRECT(\"'\"&B274&\"'!$H$54\"))","v":{"$error":"#REF!"}},{"$f":"IF(B274=\"\",\"\",INDIRECT(\"'\"&B274&\"'!$I$54\"))","v":{"$error":"#REF!"}},{"$f":"IF(B274=\"\",\"\",INDIRECT(\"'\"&B274&\"'!$R$54\"))","v":{"$error":"#REF!"}},{"$f":"IF(B274=\"\",\"\",INDIRECT(\"'\"&B274&\"'!$U$54\"))","v":{"$error":"#REF!"}},{"$f":"IF(B274=\"\",\"\",INDIRECT(\"'\"&B274&\"'!$X$54\"))","v":{"$error":"#REF!"}},{"$f":"IF(B274=\"\",\"\",INDIRECT(\"'\"&B274&\"'!$Z$54\"))","v":{"$error":"#REF!"}},{"$f":"IF(B274=\"\",\"\",INDIRECT(\"'\"&B274&\"'!$AA$54\"))","v":{"$error":"#REF!"}},{"$error":"#REF!"}]
[{"$nulls":4},{"$f":"IF(B274=\"\",\"\",INDIRECT(\"'\"&B274&\"'!$A$56\"))","v":{"$error":"#REF!"}},{"$f":"IF(B274=\"\",\"\",INDIRECT(\"'\"&B274&\"'!$K$78\"))","v":{"$error":"#REF!"}},{"$f":"IF(B274=\"\",\"\",INDIRECT(\"'\"&B274&\"'!$L$78\"))","v":{"$error":"#REF!"}},{"$f":"IF(B274=\"\",\"\",INDIRECT(\"'\"&B274&\"'!$H$78\"))","v":{"$error":"#REF!"}},{"$f":"IF(B274=\"\",\"\",INDIRECT(\"'\"&B274&\"'!$I$78\"))","v":{"$error":"#REF!"}},{"$f":"IF(B274=\"\",\"\",INDIRECT(\"'\"&B274&\"'!$R$78\"))","v":{"$error":"#REF!"}},{"$f":"IF(B274=\"\",\"\",INDIRECT(\"'\"&B274&\"'!$U$78\"))","v":{"$error":"#REF!"}},{"$f":"IF(B274=\"\",\"\",INDIRECT(\"'\"&B274&\"'!$X$78\"))","v":{"$error":"#REF!"}},{"$f":"IF(B274=\"\",\"\",INDIRECT(\"'\"&B274&\"'!$Z$78\"))","v":{"$error":"#REF!"}},{"$f":"IF(B274=\"\",\"\",INDIRECT(\"'\"&B274&\"'!$AA$78\"))","v":{"$error":"#REF!"}},{"$error":"#REF!"}]
[{"$nulls":4},{"$f":"IF(B274=\"\",\"\",INDIRECT(\"'\"&B274&\"'!$A$80\"))","v":{"$error":"#REF!"}},{"$f":"IF(B274=\"\",\"\",INDIRECT(\"'\"&B274&\"'!$K$102\"))","v":{"$error":"#REF!"}},{"$f":"IF(B274=\"\",\"\",INDIRECT(\"'\"&B274&\"'!$L$102\"))","v":{"$error":"#REF!"}},{"$f":"IF(B274=\"\",\"\",INDIRECT(\"'\"&B274&\"'!$H$102\"))","v":{"$error":"#REF!"}},{"$f":"IF(B274=\"\",\"\",INDIRECT(\"'\"&B274&\"'!$I$102\"))","v":{"$error":"#REF!"}},{"$f":"IF(B274=\"\",\"\",INDIRECT(\"'\"&B274&\"'!$R$102\"))","v":{"$error":"#REF!"}},{"$f":"IF(B274=\"\",\"\",INDIRECT(\"'\"&B274&\"'!$U$102\"))","v":{"$error":"#REF!"}},{"$f":"IF(B274=\"\",\"\",INDIRECT(\"'\"&B274&\"'!$X$102\"))","v":{"$error":"#REF!"}},{"$f":"IF(B274=\"\",\"\",INDIRECT(\"'\"&B274&\"'!$Z$102\"))","v":{"$error":"#REF!"}},{"$f":"IF(B274=\"\",\"\",INDIRECT(\"'\"&B274&\"'!$AA$102\"))","v":{"$error":"#REF!"}},{"$error":"#REF!"}]
[{"$nulls":4},{"$f":"IF(B274=\"\",\"\",INDIRECT(\"'\"&B274&\"'!$A$104\"))","v":{"$error":"#REF!"}},{"$f":"IF(B274=\"\",\"\",INDIRECT(\"'\"&B274&\"'!$K$111\"))","v":{"$error":"#REF!"}},{"$f":"IF(B274=\"\",\"\",INDIRECT(\"'\"&B274&\"'!$L$111\"))","v":{"$error":"#REF!"}},{"$f":"IF(B274=\"\",\"\",INDIRECT(\"'\"&B274&\"'!$H$111\"))","v":{"$error":"#REF!"}},{"$f":"IF(B274=\"\",\"\",INDIRECT(\"'\"&B274&\"'!$I$111\"))","v":{"$error":"#REF!"}},{"$f":"IF(B274=\"\",\"\",INDIRECT(\"'\"&B274&\"'!$R$111\"))","v":{"$error":"#REF!"}},{"$f":"IF(B274=\"\",\"\",INDIRECT(\"'\"&B274&\"'!$U$111\"))","v":{"$error":"#REF!"}},{"$f":"IF(B274=\"\",\"\",INDIRECT(\"'\"&B274&\"'!$X$111\"))","v":{"$error":"#REF!"}},{"$f":"IF(B274=\"\",\"\",INDIRECT(\"'\"&B274&\"'!$Z$111\"))","v":{"$error":"#REF!"}},{"$f":"IF(B274=\"\",\"\",INDIRECT(\"'\"&B274&\"'!$AA$111\"))","v":{"$error":"#REF!"}},{"$error":"#REF!"}]
[{"$nulls":4},{"$f":"IF(B274=\"\",\"\",INDIRECT(\"'\"&B274&\"'!$A$113\"))","v":{"$error":"#REF!"}},{"$f":"IF(B274=\"\",\"\",INDIRECT(\"'\"&B274&\"'!$K$120\"))","v":{"$error":"#REF!"}},{"$f":"IF(B274=\"\",\"\",INDIRECT(\"'\"&B274&\"'!$L$120\"))","v":{"$error":"#REF!"}},{"$f":"IF(B274=\"\",\"\",INDIRECT(\"'\"&B274&\"'!$H$120\"))","v":{"$error":"#REF!"}},{"$f":"IF(B274=\"\",\"\",INDIRECT(\"'\"&B274&\"'!$I$120\"))","v":{"$error":"#REF!"}},{"$f":"IF(B274=\"\",\"\",INDIRECT(\"'\"&B274&\"'!$R$120\"))","v":{"$error":"#REF!"}},{"$f":"IF(B274=\"\",\"\",INDIRECT(\"'\"&B274&\"'!$U$120\"))","v":{"$error":"#REF!"}},{"$f":"IF(B274=\"\",\"\",INDIRECT(\"'\"&B274&\"'!$X$120\"))","v":{"$error":"#REF!"}},{"$f":"IF(B274=\"\",\"\",INDIRECT(\"'\"&B274&\"'!$Z$120\"))","v":{"$error":"#REF!"}},{"$f":"IF(B274=\"\",\"\",INDIRECT(\"'\"&B274&\"'!$AA$120\"))","v":{"$error":"#REF!"}},{"$error":"#REF!"}]
[{"$nulls":4},{"$f":"IF(B274=\"\",\"\",INDIRECT(\"'\"&B274&\"'!$A$122\"))","v":{"$error":"#REF!"}},{"$f":"IF(B274=\"\",\"\",INDIRECT(\"'\"&B274&\"'!$K$129\"))","v":{"$error":"#REF!"}},{"$f":"IF(B274=\"\",\"\",INDIRECT(\"'\"&B274&\"'!$L$129\"))","v":{"$error":"#REF!"}},{"$f":"IF(B274=\"\",\"\",INDIRECT(\"'\"&B274&\"'!$H$129\"))","v":{"$error":"#REF!"}},{"$f":"IF(B274=\"\",\"\",INDIRECT(\"'\"&B274&\"'!$I$129\"))","v":{"$error":"#REF!"}},{"$f":"IF(B274=\"\",\"\",INDIRECT(\"'\"&B274&\"'!$R$129\"))","v":{"$error":"#REF!"}},{"$f":"IF(B274=\"\",\"\",INDIRECT(\"'\"&B274&\"'!$U$129\"))","v":{"$error":"#REF!"}},{"$f":"IF(B274=\"\",\"\",INDIRECT(\"'\"&B274&\"'!$X$129\"))","v":{"$error":"#REF!"}},{"$f":"IF(B274=\"\",\"\",INDIRECT(\"'\"&B274&\"'!$Z$129\"))","v":{"$error":"#REF!"}},{"$f":"IF(B274=\"\",\"\",INDIRECT(\"'\"&B274&\"'!$AA$129\"))","v":{"$error":"#REF!"}},{"$error":"#REF!"}]
[{"$nulls":4},{"$f":"IF(B274=\"\",\"\",INDIRECT(\"'\"&B274&\"'!$A$131\"))","v":{"$error":"#REF!"}},{"$f":"IF(B274=\"\",\"\",INDIRECT(\"'\"&B274&\"'!$K$167\"))","v":{"$error":"#REF!"}},{"$f":"IF(B274=\"\",\"\",INDIRECT(\"'\"&B274&\"'!$L$167\"))","v":{"$error":"#REF!"}},{"$f":"IF(B274=\"\",\"\",INDIRECT(\"'\"&B274&\"'!$H$167\"))","v":{"$error":"#REF!"}},{"$f":"IF(B274=\"\",\"\",INDIRECT(\"'\"&B274&\"'!$I$167\"))","v":{"$error":"#REF!"}},{"$f":"IF(B274=\"\",\"\",INDIRECT(\"'\"&B274&\"'!$R$167\"))","v":{"$error":"#REF!"}},{"$f":"IF(B274=\"\",\"\",INDIRECT(\"'\"&B274&\"'!$U$167\"))","v":{"$error":"#REF!"}},{"$f":"IF(B274=\"\",\"\",INDIRECT(\"'\"&B274&\"'!$X$167\"))","v":{"$error":"#REF!"}},{"$f":"IF(B274=\"\",\"\",INDIRECT(\"'\"&B274&\"'!$Z$167\"))","v":{"$error":"#REF!"}},{"$f":"IF(B274=\"\",\"\",INDIRECT(\"'\"&B274&\"'!$AA$167\"))","v":{"$error":"#REF!"}},{"$error":"#REF!"}]
[null,{"$f":"MID(INDEX(nom_feuilles,ROW(Masque!K39)),SEARCH(\"]\",INDEX(nom_feuilles,ROW(Masque!K39)))+1,30)","v":{"$error":"#REF!"}},{"$error":"#REF!"},{"$f":"IF(B282=\"\",\"\",INDIRECT(\"'\"&B282&\"'!$A$2\"))","v":{"$error":"#REF!"}},{"$f":"IF(B282=\"\",\"\",INDIRECT(\"'\"&B282&\"'!$A$8\"))","v":{"$error":"#REF!"}},{"$f":"IF(B282=\"\",\"\",INDIRECT(\"'\"&B282&\"'!$K$30\"))","v":{"$error":"#REF!"}},{"$f":"IF(B282=\"\",\"\",INDIRECT(\"'\"&B282&\"'!$L$30\"))","v":{"$error":"#REF!"}},{"$f":"IF(B282=\"\",\"\",INDIRECT(\"'\"&B282&\"'!$H$30\"))","v":{"$error":"#REF!"}},{"$f":"IF(B282=\"\",\"\",INDIRECT(\"'\"&B282&\"'!$I$30\"))","v":{"$error":"#REF!"}},{"$f":"IF(B282=\"\",\"\",INDIRECT(\"'\"&B282&\"'!$R$30\"))","v":{"$error":"#REF!"}},{"$f":"IF(B282=\"\",\"\",INDIRECT(\"'\"&B282&\"'!$U$30\"))","v":{"$error":"#REF!"}},{"$f":"IF(B282=\"\",\"\",INDIRECT(\"'\"&B282&\"'!$X$30\"))","v":{"$error":"#REF!"}},{"$f":"IF(B282=\"\",\"\",INDIRECT(\"'\"&B282&\"'!$Z$30\"))","v":{"$error":"#REF!"}},{"$f":"IF(B282=\"\",\"\",INDIRECT(\"'\"&B282&\"'!$AA$30\"))","v":{"$error":"#REF!"}},{"$error":"#REF!"},{"$f":"SUM(O282:O289)","v":{"$error":"#REF!"}},{"$f":"IF(B282=\"\",\"\",INDIRECT(\"'\"&B282&\"'!$H$4\"))","v":{"$error":"#REF!"}},{"$f":"P282-Q282","v":{"$error":"#REF!"}}]
[{"$nulls":4},{"$f":"IF(B282=\"\",\"\",INDIRECT(\"'\"&B282&\"'!$A$32\"))","v":{"$error":"#REF!"}},{"$f":"IF(B282=\"\",\"\",INDIRECT(\"'\"&B282&\"'!$K$54\"))","v":{"$error":"#REF!"}},{"$f":"IF(B282=\"\",\"\",INDIRECT(\"'\"&B282&\"'!$L$54\"))","v":{"$error":"#REF!"}},{"$f":"IF(B282=\"\",\"\",INDIRECT(\"'\"&B282&\"'!$H$54\"))","v":{"$error":"#REF!"}},{"$f":"IF(B282=\"\",\"\",INDIRECT(\"'\"&B282&\"'!$I$54\"))","v":{"$error":"#REF!"}},{"$f":"IF(B282=\"\",\"\",INDIRECT(\"'\"&B282&\"'!$R$54\"))","v":{"$error":"#REF!"}},{"$f":"IF(B282=\"\",\"\",INDIRECT(\"'\"&B282&\"'!$U$54\"))","v":{"$error":"#REF!"}},{"$f":"IF(B282=\"\",\"\",INDIRECT(\"'\"&B282&\"'!$X$54\"))","v":{"$error":"#REF!"}},{"$f":"IF(B282=\"\",\"\",INDIRECT(\"'\"&B282&\"'!$Z$54\"))","v":{"$error":"#REF!"}},{"$f":"IF(B282=\"\",\"\",INDIRECT(\"'\"&B282&\"'!$AA$54\"))","v":{"$error":"#REF!"}},{"$error":"#REF!"}]
[{"$nulls":4},{"$f":"IF(B282=\"\",\"\",INDIRECT(\"'\"&B282&\"'!$A$56\"))","v":{"$error":"#REF!"}},{"$f":"IF(B282=\"\",\"\",INDIRECT(\"'\"&B282&\"'!$K$78\"))","v":{"$error":"#REF!"}},{"$f":"IF(B282=\"\",\"\",INDIRECT(\"'\"&B282&\"'!$L$78\"))","v":{"$error":"#REF!"}},{"$f":"IF(B282=\"\",\"\",INDIRECT(\"'\"&B282&\"'!$H$78\"))","v":{"$error":"#REF!"}},{"$f":"IF(B282=\"\",\"\",INDIRECT(\"'\"&B282&\"'!$I$78\"))","v":{"$error":"#REF!"}},{"$f":"IF(B282=\"\",\"\",INDIRECT(\"'\"&B282&\"'!$R$78\"))","v":{"$error":"#REF!"}},{"$f":"IF(B282=\"\",\"\",INDIRECT(\"'\"&B282&\"'!$U$78\"))","v":{"$error":"#REF!"}},{"$f":"IF(B282=\"\",\"\",INDIRECT(\"'\"&B282&\"'!$X$78\"))","v":{"$error":"#REF!"}},{"$f":"IF(B282=\"\",\"\",INDIRECT(\"'\"&B282&\"'!$Z$78\"))","v":{"$error":"#REF!"}},{"$f":"IF(B282=\"\",\"\",INDIRECT(\"'\"&B282&\"'!$AA$78\"))","v":{"$error":"#REF!"}},{"$error":"#REF!"}]
[{"$nulls":4},{"$f":"IF(B282=\"\",\"\",INDIRECT(\"'\"&B282&\"'!$A$80\"))","v":{"$error":"#REF!"}},{"$f":"IF(B282=\"\",\"\",INDIRECT(\"'\"&B282&\"'!$K$102\"))","v":{"$error":"#REF!"}},{"$f":"IF(B282=\"\",\"\",INDIRECT(\"'\"&B282&\"'!$L$102\"))","v":{"$error":"#REF!"}},{"$f":"IF(B282=\"\",\"\",INDIRECT(\"'\"&B282&\"'!$H$102\"))","v":{"$error":"#REF!"}},{"$f":"IF(B282=\"\",\"\",INDIRECT(\"'\"&B282&\"'!$I$102\"))","v":{"$error":"#REF!"}},{"$f":"IF(B282=\"\",\"\",INDIRECT(\"'\"&B282&\"'!$R$102\"))","v":{"$error":"#REF!"}},{"$f":"IF(B282=\"\",\"\",INDIRECT(\"'\"&B282&\"'!$U$102\"))","v":{"$error":"#REF!"}},{"$f":"IF(B282=\"\",\"\",INDIRECT(\"'\"&B282&\"'!$X$102\"))","v":{"$error":"#REF!"}},{"$f":"IF(B282=\"\",\"\",INDIRECT(\"'\"&B282&\"'!$Z$102\"))","v":{"$error":"#REF!"}},{"$f":"IF(B282=\"\",\"\",INDIRECT(\"'\"&B282&\"'!$AA$102\"))","v":{"$error":"#REF!"}},{"$error":"#REF!"}]
[{"$nulls":4},{"$f":"IF(B282=\"\",\"\",INDIRECT(\"'\"&B282&\"'!$A$104\"))","v":{"$error":"#REF!"}},{"$f":"IF(B282=\"\",\"\",INDIRECT(\"'\"&B282&\"'!$K$111\"))","v":{"$error":"#REF!"}},{"$f":"IF(B282=\"\",\"\",INDIRECT(\"'\"&B282&\"'!$L$111\"))","v":{"$error":"#REF!"}},{"$f":"IF(B282=\"\",\"\",INDIRECT(\"'\"&B282&\"'!$H$111\"))","v":{"$error":"#REF!"}},{"$f":"IF(B282=\"\",\"\",INDIRECT(\"'\"&B282&\"'!$I$111\"))","v":{"$error":"#REF!"}},{"$f":"IF(B282=\"\",\"\",INDIRECT(\"'\"&B282&\"'!$R$111\"))","v":{"$error":"#REF!"}},{"$f":"IF(B282=\"\",\"\",INDIRECT(\"'\"&B282&\"'!$U$111\"))","v":{"$error":"#REF!"}},{"$f":"IF(B282=\"\",\"\",INDIRECT(\"'\"&B282&\"'!$X$111\"))","v":{"$error":"#REF!"}},{"$f":"IF(B282=\"\",\"\",INDIRECT(\"'\"&B282&\"'!$Z$111\"))","v":{"$error":"#REF!"}},{"$f":"IF(B282=\"\",\"\",INDIRECT(\"'\"&B282&\"'!$AA$111\"))","v":{"$error":"#REF!"}},{"$error":"#REF!"}]
[{"$nulls":4},{"$f":"IF(B282=\"\",\"\",INDIRECT(\"'\"&B282&\"'!$A$113\"))","v":{"$error":"#REF!"}},{"$f":"IF(B282=\"\",\"\",INDIRECT(\"'\"&B282&\"'!$K$120\"))","v":{"$error":"#REF!"}},{"$f":"IF(B282=\"\",\"\",INDIRECT(\"'\"&B282&\"'!$L$120\"))","v":{"$error":"#REF!"}},{"$f":"IF(B282=\"\",\"\",INDIRECT(\"'\"&B282&\"'!$H$120\"))","v":{"$error":"#REF!"}},{"$f":"IF(B282=\"\",\"\",INDIRECT(\"'\"&B282&\"'!$I$120\"))","v":{"$error":"#REF!"}},{"$f":"IF(B282=\"\",\"\",INDIRECT(\"'\"&B282&\"'!$R$120\"))","v":{"$error":"#REF!"}},{"$f":"IF(B282=\"\",\"\",INDIRECT(\"'\"&B282&\"'!$U$120\"))","v":{"$error":"#REF!"}},{"$f":"IF(B282=\"\",\"\",INDIRECT(\"'\"&B282&\"'!$X$120\"))","v":{"$error":"#REF!"}},{"$f":"IF(B282=\"\",\"\",INDIRECT(\"'\"&B282&\"'!$Z$120\"))","v":{"$error":"#REF!"}},{"$f":"IF(B282=\"\",\"\",INDIRECT(\"'\"&B282&\"'!$AA$120\"))","v":{"$error":"#REF!"}},{"$error":"#REF!"}]
[{"$nulls":4},{"$f":"IF(B282=\"\",\"\",INDIRECT(\"'\"&B282&\"'!$A$122\"))","v":{"$error":"#REF!"}},{"$f":"IF(B282=\"\",\"\",INDIRECT(\"'\"&B282&\"'!$K$129\"))","v":{"$error":"#REF!"}},{"$f":"IF(B282=\"\",\"\",INDIRECT(\"'\"&B282&\"'!$L$129\"))","v":{"$error":"#REF!"}},{"$f":"IF(B282=\"\",\"\",INDIRECT(\"'\"&B282&\"'!$H$129\"))","v":{"$error":"#REF!"}},{"$f":"IF(B282=\"\",\"\",INDIRECT(\"'\"&B282&\"'!$I$129\"))","v":{"$error":"#REF!"}},{"$f":"IF(B282=\"\",\"\",INDIRECT(\"'\"&B282&\"'!$R$129\"))","v":{"$error":"#REF!"}},{"$f":"IF(B282=\"\",\"\",INDIRECT(\"'\"&B282&\"'!$U$129\"))","v":{"$error":"#REF!"}},{"$f":"IF(B282=\"\",\"\",INDIRECT(\"'\"&B282&\"'!$X$129\"))","v":{"$error":"#REF!"}},{"$f":"IF(B282=\"\",\"\",INDIRECT(\"'\"&B282&\"'!$Z$129\"))","v":{"$error":"#REF!"}},{"$f":"IF(B282=\"\",\"\",INDIRECT(\"'\"&B282&\"'!$AA$129\"))","v":{"$error":"#REF!"}},{"$error":"#REF!"}]
[{"$nulls":4},{"$f":"IF(B282=\"\",\"\",INDIRECT(\"'\"&B282&\"'!$A$131\"))","v":{"$error":"#REF!"}},{"$f":"IF(B282=\"\",\"\",INDIRECT(\"'\"&B282&\"'!$K$167\"))","v":{"$error":"#REF!"}},{"$f":"IF(B282=\"\",\"\",INDIRECT(\"'\"&B282&\"'!$L$167\"))","v":{"$error":"#REF!"}},{"$f":"IF(B282=\"\",\"\",INDIRECT(\"'\"&B282&\"'!$H$167\"))","v":{"$error":"#REF!"}},{"$f":"IF(B282=\"\",\"\",INDIRECT(\"'\"&B282&\"'!$I$167\"))","v":{"$error":"#REF!"}},{"$f":"IF(B282=\"\",\"\",INDIRECT(\"'\"&B282&\"'!$R$167\"))","v":{"$error":"#REF!"}},{"$f":"IF(B282=\"\",\"\",INDIRECT(\"'\"&B282&\"'!$U$167\"))","v":{"$error":"#REF!"}},{"$f":"IF(B282=\"\",\"\",INDIRECT(\"'\"&B282&\"'!$X$167\"))","v":{"$error":"#REF!"}},{"$f":"IF(B282=\"\",\"\",INDIRECT(\"'\"&B282&\"'!$Z$167\"))","v":{"$error":"#REF!"}},{"$f":"IF(B282=\"\",\"\",INDIRECT(\"'\"&B282&\"'!$AA$167\"))","v":{"$error":"#REF!"}},{"$error":"#REF!"}]
[null,{"$f":"MID(INDEX(nom_feuilles,ROW(Masque!K40)),SEARCH(\"]\",INDEX(nom_feuilles,ROW(Masque!K40)))+1,30)","v":{"$error":"#REF!"}},{"$error":"#REF!"},{"$f":"IF(B290=\"\",\"\",INDIRECT(\"'\"&B290&\"'!$A$2\"))","v":{"$error":"#REF!"}},{"$f":"IF(B290=\"\",\"\",INDIRECT(\"'\"&B290&\"'!$A$8\"))","v":{"$error":"#REF!"}},{"$f":"IF(B290=\"\",\"\",INDIRECT(\"'\"&B290&\"'!$K$30\"))","v":{"$error":"#REF!"}},{"$f":"IF(B290=\"\",\"\",INDIRECT(\"'\"&B290&\"'!$L$30\"))","v":{"$error":"#REF!"}},{"$f":"IF(B290=\"\",\"\",INDIRECT(\"'\"&B290&\"'!$H$30\"))","v":{"$error":"#REF!"}},{"$f":"IF(B290=\"\",\"\",INDIRECT(\"'\"&B290&\"'!$I$30\"))","v":{"$error":"#REF!"}},{"$f":"IF(B290=\"\",\"\",INDIRECT(\"'\"&B290&\"'!$R$30\"))","v":{"$error":"#REF!"}},{"$f":"IF(B290=\"\",\"\",INDIRECT(\"'\"&B290&\"'!$U$30\"))","v":{"$error":"#REF!"}},{"$f":"IF(B290=\"\",\"\",INDIRECT(\"'\"&B290&\"'!$X$30\"))","v":{"$error":"#REF!"}},{"$f":"IF(B290=\"\",\"\",INDIRECT(\"'\"&B290&\"'!$Z$30\"))","v":{"$error":"#REF!"}},{"$f":"IF(B290=\"\",\"\",INDIRECT(\"'\"&B290&\"'!$AA$30\"))","v":{"$error":"#REF!"}},{"$error":"#REF!"},{"$f":"SUM(O290:O297)","v":{"$error":"#REF!"}},{"$f":"IF(B290=\"\",\"\",INDIRECT(\"'\"&B290&\"'!$H$4\"))","v":{"$error":"#REF!"}},{"$f":"P290-Q290","v":{"$error":"#REF!"}}]
[{"$nulls":4},{"$f":"IF(B290=\"\",\"\",INDIRECT(\"'\"&B290&\"'!$A$32\"))","v":{"$error":"#REF!"}},{"$f":"IF(B290=\"\",\"\",INDIRECT(\"'\"&B290&\"'!$K$54\"))","v":{"$error":"#REF!"}},{"$f":"IF(B290=\"\",\"\",INDIRECT(\"'\"&B290&\"'!$L$54\"))","v":{"$error":"#REF!"}},{"$f":"IF(B290=\"\",\"\",INDIRECT(\"'\"&B290&\"'!$H$54\"))","v":{"$error":"#REF!"}},{"$f":"IF(B290=\"\",\"\",INDIRECT(\"'\"&B290&\"'!$I$54\"))","v":{"$error":"#REF!"}},{"$f":"IF(B290=\"\",\"\",INDIRECT(\"'\"&B290&\"'!$R$54\"))","v":{"$error":"#REF!"}},{"$f":"IF(B290=\"\",\"\",INDIRECT(\"'\"&B290&\"'!$U$54\"))","v":{"$error":"#REF!"}},{"$f":"IF(B290=\"\",\"\",INDIRECT(\"'\"&B290&\"'!$X$54\"))","v":{"$error":"#REF!"}},{"$f":"IF(B290=\"\",\"\",INDIRECT(\"'\"&B290&\"'!$Z$54\"))","v":{"$error":"#REF!"}},{"$f":"IF(B290=\"\",\"\",INDIRECT(\"'\"&B290&\"'!$AA$54\"))","v":{"$error":"#REF!"}},{"$error":"#REF!"}]
[{"$nulls":4},{"$f":"IF(B290=\"\",\"\",INDIRECT(\"'\"&B290&\"'!$A$56\"))","v":{"$error":"#REF!"}},{"$f":"IF(B290=\"\",\"\",INDIRECT(\"'\"&B290&\"'!$K$78\"))","v":{"$error":"#REF!"}},{"$f":"IF(B290=\"\",\"\",INDIRECT(\"'\"&B290&\"'!$L$78\"))","v":{"$error":"#REF!"}},{"$f":"IF(B290=\"\",\"\",INDIRECT(\"'\"&B290&\"'!$H$78\"))","v":{"$error":"#REF!"}},{"$f":"IF(B290=\"\",\"\",INDIRECT(\"'\"&B290&\"'!$I$78\"))","v":{"$error":"#REF!"}},{"$f":"IF(B290=\"\",\"\",INDIRECT(\"'\"&B290&\"'!$R$78\"))","v":{"$error":"#REF!"}},{"$f":"IF(B290=\"\",\"\",INDIRECT(\"'\"&B290&\"'!$U$78\"))","v":{"$error":"#REF!"}},{"$f":"IF(B290=\"\",\"\",INDIRECT(\"'\"&B290&\"'!$X$78\"))","v":{"$error":"#REF!"}},{"$f":"IF(B290=\"\",\"\",INDIRECT(\"'\"&B290&\"'!$Z$78\"))","v":{"$error":"#REF!"}},{"$f":"IF(B290=\"\",\"\",INDIRECT(\"'\"&B290&\"'!$AA$78\"))","v":{"$error":"#REF!"}},{"$error":"#REF!"}]
[{"$nulls":4},{"$f":"IF(B290=\"\",\"\",INDIRECT(\"'\"&B290&\"'!$A$80\"))","v":{"$error":"#REF!"}},{"$f":"IF(B290=\"\",\"\",INDIRECT(\"'\"&B290&\"'!$K$102\"))","v":{"$error":"#REF!"}},{"$f":"IF(B290=\"\",\"\",INDIRECT(\"'\"&B290&\"'!$L$102\"))","v":{"$error":"#REF!"}},{"$f":"IF(B290=\"\",\"\",INDIRECT(\"'\"&B290&\"'!$H$102\"))","v":{"$error":"#REF!"}},{"$f":"IF(B290=\"\",\"\",INDIRECT(\"'\"&B290&\"'!$I$102\"))","v":{"$error":"#REF!"}},{"$f":"IF(B290=\"\",\"\",INDIRECT(\"'\"&B290&\"'!$R$102\"))","v":{"$error":"#REF!"}},{"$f":"IF(B290=\"\",\"\",INDIRECT(\"'\"&B290&\"'!$U$102\"))","v":{"$error":"#REF!"}},{"$f":"IF(B290=\"\",\"\",INDIRECT(\"'\"&B290&\"'!$X$102\"))","v":{"$error":"#REF!"}},{"$f":"IF(B290=\"\",\"\",INDIRECT(\"'\"&B290&\"'!$Z$102\"))","v":{"$error":"#REF!"}},{"$f":"IF(B290=\"\",\"\",INDIRECT(\"'\"&B290&\"'!$AA$102\"))","v":{"$error":"#REF!"}},{"$error":"#REF!"}]
[{"$nulls":4},{"$f":"IF(B290=\"\",\"\",INDIRECT(\"'\"&B290&\"'!$A$104\"))","v":{"$error":"#REF!"}},{"$f":"IF(B290=\"\",\"\",INDIRECT(\"'\"&B290&\"'!$K$111\"))","v":{"$error":"#REF!"}},{"$f":"IF(B290=\"\",\"\",INDIRECT(\"'\"&B290&\"'!$L$111\"))","v":{"$error":"#REF!"}},{"$f":"IF(B290=\"\",\"\",INDIRECT(\"'\"&B290&\"'!$H$111\"))","v":{"$error":"#REF!"}},{"$f":"IF(B290=\"\",\"\",INDIRECT(\"'\"&B290&\"'!$I$111\"))","v":{"$error":"#REF!"}},{"$f":"IF(B290=\"\",\"\",INDIRECT(\"'\"&B290&\"'!$R$111\"))","v":{"$error":"#REF!"}},{"$f":"IF(B290=\"\",\"\",INDIRECT(\"'\"&B290&\"'!$U$111\"))","v":{"$error":"#REF!"}},{"$f":"IF(B290=\"\",\"\",INDIRECT(\"'\"&B290&\"'!$X$111\"))","v":{"$error":"#REF!"}},{"$f":"IF(B290=\"\",\"\",INDIRECT(\"'\"&B290&\"'!$Z$111\"))","v":{"$error":"#REF!"}},{"$f":"IF(B290=\"\",\"\",INDIRECT(\"'\"&B290&\"'!$AA$111\"))","v":{"$error":"#REF!"}},{"$error":"#REF!"}]
[{"$nulls":4},{"$f":"IF(B290=\"\",\"\",INDIRECT(\"'\"&B290&\"'!$A$113\"))","v":{"$error":"#REF!"}},{"$f":"IF(B290=\"\",\"\",INDIRECT(\"'\"&B290&\"'!$K$120\"))","v":{"$error":"#REF!"}},{"$f":"IF(B290=\"\",\"\",INDIRECT(\"'\"&B290&\"'!$L$120\"))","v":{"$error":"#REF!"}},{"$f":"IF(B290=\"\",\"\",INDIRECT(\"'\"&B290&\"'!$H$120\"))","v":{"$error":"#REF!"}},{"$f":"IF(B290=\"\",\"\",INDIRECT(\"'\"&B290&\"'!$I$120\"))","v":{"$error":"#REF!"}},{"$f":"IF(B290=\"\",\"\",INDIRECT(\"'\"&B290&\"'!$R$120\"))","v":{"$error":"#REF!"}},{"$f":"IF(B290=\"\",\"\",INDIRECT(\"'\"&B290&\"'!$U$120\"))","v":{"$error":"#REF!"}},{"$f":"IF(B290=\"\",\"\",INDIRECT(\"'\"&B290&\"'!$X$120\"))","v":{"$error":"#REF!"}},{"$f":"IF(B290=\"\",\"\",INDIRECT(\"'\"&B290&\"'!$Z$120\"))","v":{"$error":"#REF!"}},{"$f":"IF(B290=\"\",\"\",INDIRECT(\"'\"&B290&\"'!$AA$120\"))","v":{"$error":"#REF!"}},{"$error":"#REF!"}]
[{"$nulls":4},{"$f":"IF(B290=\"\",\"\",INDIRECT(\"'\"&B290&\"'!$A$122\"))","v":{"$error":"#REF!"}},{"$f":"IF(B290=\"\",\"\",INDIRECT(\"'\"&B290&\"'!$K$129\"))","v":{"$error":"#REF!"}},{"$f":"IF(B290=\"\",\"\",INDIRECT(\"'\"&B290&\"'!$L$129\"))","v":{"$error":"#REF!"}},{"$f":"IF(B290=\"\",\"\",INDIRECT(\"'\"&B290&\"'!$H$129\"))","v":{"$error":"#REF!"}},{"$f":"IF(B290=\"\",\"\",INDIRECT(\"'\"&B290&\"'!$I$129\"))","v":{"$error":"#REF!"}},{"$f":"IF(B290=\"\",\"\",INDIRECT(\"'\"&B290&\"'!$R$129\"))","v":{"$error":"#REF!"}},{"$f":"IF(B290=\"\",\"\",INDIRECT(\"'\"&B290&\"'!$U$129\"))","v":{"$error":"#REF!"}},{"$f":"IF(B290=\"\",\"\",INDIRECT(\"'\"&B290&\"'!$X$129\"))","v":{"$error":"#REF!"}},{"$f":"IF(B290=\"\",\"\",INDIRECT(\"'\"&B290&\"'!$Z$129\"))","v":{"$error":"#REF!"}},{"$f":"IF(B290=\"\",\"\",INDIRECT(\"'\"&B290&\"'!$AA$129\"))","v":{"$error":"#REF!"}},{"$error":"#REF!"}]
[{"$nulls":4},{"$f":"IF(B290=\"\",\"\",INDIRECT(\"'\"&B290&\"'!$A$131\"))","v":{"$error":"#REF!"}},{"$f":"IF(B290=\"\",\"\",INDIRECT(\"'\"&B290&\"'!$K$167\"))","v":{"$error":"#REF!"}},{"$f":"IF(B290=\"\",\"\",INDIRECT(\"'\"&B290&\"'!$L$167\"))","v":{"$error":"#REF!"}},{"$f":"IF(B290=\"\",\"\",INDIRECT(\"'\"&B290&\"'!$H$167\"))","v":{"$error":"#REF!"}},{"$f":"IF(B290=\"\",\"\",INDIRECT(\"'\"&B290&\"'!$I$167\"))","v":{"$error":"#REF!"}},{"$f":"IF(B290=\"\",\"\",INDIRECT(\"'\"&B290&\"'!$R$167\"))","v":{"$error":"#REF!"}},{"$f":"IF(B290=\"\",\"\",INDIRECT(\"'\"&B290&\"'!$U$167\"))","v":{"$error":"#REF!"}},{"$f":"IF(B290=\"\",\"\",INDIRECT(\"'\"&B290&\"'!$X$167\"))","v":{"$error":"#REF!"}},{"$f":"IF(B290=\"\",\"\",INDIRECT(\"'\"&B290&\"'!$Z$167\"))","v":{"$error":"#REF!"}},{"$f":"IF(B290=\"\",\"\",INDIRECT(\"'\"&B290&\"'!$AA$167\"))","v":{"$error":"#REF!"}},{"$error":"#REF!"}]
[null,{"$f":"MID(INDEX(nom_feuilles,ROW(Masque!K41)),SEARCH(\"]\",INDEX(nom_feuilles,ROW(Masque!K41)))+1,30)","v":{"$error":"#REF!"}},{"$f":"IF(B298=\"\",\"\",INDIRECT(\"'\"&B298&\"'!$A$1\"))","v":{"$error":"#REF!"}},{"$f":"IF(B298=\"\",\"\",INDIRECT(\"'\"&B298&\"'!$A$2\"))","v":{"$error":"#REF!"}},{"$f":"IF(B298=\"\",\"\",INDIRECT(\"'\"&B298&\"'!$A$8\"))","v":{"$error":"#REF!"}},{"$f":"IF(B298=\"\",\"\",INDIRECT(\"'\"&B298&\"'!$K$30\"))","v":{"$error":"#REF!"}},{"$f":"IF(B298=\"\",\"\",INDIRECT(\"'\"&B298&\"'!$L$30\"))","v":{"$error":"#REF!"}},{"$f":"IF(B298=\"\",\"\",INDIRECT(\"'\"&B298&\"'!$H$30\"))","v":{"$error":"#REF!"}},{"$f":"IF(B298=\"\",\"\",INDIRECT(\"'\"&B298&\"'!$I$30\"))","v":{"$error":"#REF!"}},{"$f":"IF(B298=\"\",\"\",INDIRECT(\"'\"&B298&\"'!$R$30\"))","v":{"$error":"#REF!"}},{"$f":"IF(B298=\"\",\"\",INDIRECT(\"'\"&B298&\"'!$U$30\"))","v":{"$error":"#REF!"}},{"$f":"IF(B298=\"\",\"\",INDIRECT(\"'\"&B298&\"'!$X$30\"))","v":{"$error":"#REF!"}},{"$f":"IF(B298=\"\",\"\",INDIRECT(\"'\"&B298&\"'!$Z$30\"))","v":{"$error":"#REF!"}},{"$f":"IF(B298=\"\",\"\",INDIRECT(\"'\"&B298&\"'!$AA$30\"))","v":{"$error":"#REF!"}},{"$f":"SUM(F298:N298)","v":{"$error":"#REF!"}},{"$f":"SUM(O298:O305)","v":{"$error":"#REF!"}},{"$f":"IF(B298=\"\",\"\",INDIRECT(\"'\"&B298&\"'!$H$4\"))","v":{"$error":"#REF!"}},{"$f":"P298-Q298","v":{"$error":"#REF!"}}]
[{"$nulls":4},{"$f":"IF(B298=\"\",\"\",INDIRECT(\"'\"&B298&\"'!$A$32\"))","v":{"$error":"#REF!"}},{"$f":"IF(B298=\"\",\"\",INDIRECT(\"'\"&B298&\"'!$K$54\"))","v":{"$error":"#REF!"}},{"$f":"IF(B298=\"\",\"\",INDIRECT(\"'\"&B298&\"'!$L$54\"))","v":{"$error":"#REF!"}},{"$f":"IF(B298=\"\",\"\",INDIRECT(\"'\"&B298&\"'!$H$54\"))","v":{"$error":"#REF!"}},{"$f":"IF(B298=\"\",\"\",INDIRECT(\"'\"&B298&\"'!$I$54\"))","v":{"$error":"#REF!"}},{"$f":"IF(B298=\"\",\"\",INDIRECT(\"'\"&B298&\"'!$R$54\"))","v":{"$error":"#REF!"}},{"$f":"IF(B298=\"\",\"\",INDIRECT(\"'\"&B298&\"'!$U$54\"))","v":{"$error":"#REF!"}},{"$f":"IF(B298=\"\",\"\",INDIRECT(\"'\"&B298&\"'!$X$54\"))","v":{"$error":"#REF!"}},{"$f":"IF(B298=\"\",\"\",INDIRECT(\"'\"&B298&\"'!$Z$54\"))","v":{"$error":"#REF!"}},{"$f":"IF(B298=\"\",\"\",INDIRECT(\"'\"&B298&\"'!$AA$54\"))","v":{"$error":"#REF!"}},{"$error":"#REF!"}]
[{"$nulls":4},{"$f":"IF(B298=\"\",\"\",INDIRECT(\"'\"&B298&\"'!$A$56\"))","v":{"$error":"#REF!"}},{"$f":"IF(B298=\"\",\"\",INDIRECT(\"'\"&B298&\"'!$K$78\"))","v":{"$error":"#REF!"}},{"$f":"IF(B298=\"\",\"\",INDIRECT(\"'\"&B298&\"'!$L$78\"))","v":{"$error":"#REF!"}},{"$f":"IF(B298=\"\",\"\",INDIRECT(\"'\"&B298&\"'!$H$78\"))","v":{"$error":"#REF!"}},{"$f":"IF(B298=\"\",\"\",INDIRECT(\"'\"&B298&\"'!$I$78\"))","v":{"$error":"#REF!"}},{"$f":"IF(B298=\"\",\"\",INDIRECT(\"'\"&B298&\"'!$R$78\"))","v":{"$error":"#REF!"}},{"$f":"IF(B298=\"\",\"\",INDIRECT(\"'\"&B298&\"'!$U$78\"))","v":{"$error":"#REF!"}},{"$f":"IF(B298=\"\",\"\",INDIRECT(\"'\"&B298&\"'!$X$78\"))","v":{"$error":"#REF!"}},{"$f":"IF(B298=\"\",\"\",INDIRECT(\"'\"&B298&\"'!$Z$78\"))","v":{"$error":"#REF!"}},{"$f":"IF(B298=\"\",\"\",INDIRECT(\"'\"&B298&\"'!$AA$78\"))","v":{"$error":"#REF!"}},{"$error":"#REF!"}]
[{"$nulls":4},{"$f":"IF(B298=\"\",\"\",INDIRECT(\"'\"&B298&\"'!$A$80\"))","v":{"$error":"#REF!"}},{"$f":"IF(B298=\"\",\"\",INDIRECT(\"'\"&B298&\"'!$K$102\"))","v":{"$error":"#REF!"}},{"$f":"IF(B298=\"\",\"\",INDIRECT(\"'\"&B298&\"'!$L$102\"))","v":{"$error":"#REF!"}},{"$f":"IF(B298=\"\",\"\",INDIRECT(\"'\"&B298&\"'!$H$102\"))","v":{"$error":"#REF!"}},{"$f":"IF(B298=\"\",\"\",INDIRECT(\"'\"&B298&\"'!$I$102\"))","v":{"$error":"#REF!"}},{"$f":"IF(B298=\"\",\"\",INDIRECT(\"'\"&B298&\"'!$R$102\"))","v":{"$error":"#REF!"}},{"$f":"IF(B298=\"\",\"\",INDIRECT(\"'\"&B298&\"'!$U$102\"))","v":{"$error":"#REF!"}},{"$f":"IF(B298=\"\",\"\",INDIRECT(\"'\"&B298&\"'!$X$102\"))","v":{"$error":"#REF!"}},{"$f":"IF(B298=\"\",\"\",INDIRECT(\"'\"&B298&\"'!$Z$102\"))","v":{"$error":"#REF!"}},{"$f":"IF(B298=\"\",\"\",INDIRECT(\"'\"&B298&\"'!$AA$102\"))","v":{"$error":"#REF!"}},{"$error":"#REF!"}]
[{"$nulls":4},{"$f":"IF(B298=\"\",\"\",INDIRECT(\"'\"&B298&\"'!$A$104\"))","v":{"$error":"#REF!"}},{"$f":"IF(B298=\"\",\"\",INDIRECT(\"'\"&B298&\"'!$K$111\"))","v":{"$error":"#REF!"}},{"$f":"IF(B298=\"\",\"\",INDIRECT(\"'\"&B298&\"'!$L$111\"))","v":{"$error":"#REF!"}},{"$f":"IF(B298=\"\",\"\",INDIRECT(\"'\"&B298&\"'!$H$111\"))","v":{"$error":"#REF!"}},{"$f":"IF(B298=\"\",\"\",INDIRECT(\"'\"&B298&\"'!$I$111\"))","v":{"$error":"#REF!"}},{"$f":"IF(B298=\"\",\"\",INDIRECT(\"'\"&B298&\"'!$R$111\"))","v":{"$error":"#REF!"}},{"$f":"IF(B298=\"\",\"\",INDIRECT(\"'\"&B298&\"'!$U$111\"))","v":{"$error":"#REF!"}},{"$f":"IF(B298=\"\",\"\",INDIRECT(\"'\"&B298&\"'!$X$111\"))","v":{"$error":"#REF!"}},{"$f":"IF(B298=\"\",\"\",INDIRECT(\"'\"&B298&\"'!$Z$111\"))","v":{"$error":"#REF!"}},{"$f":"IF(B298=\"\",\"\",INDIRECT(\"'\"&B298&\"'!$AA$111\"))","v":{"$error":"#REF!"}},{"$error":"#REF!"}]
[{"$nulls":4},{"$f":"IF(B298=\"\",\"\",INDIRECT(\"'\"&B298&\"'!$A$113\"))","v":{"$error":"#REF!"}},{"$f":"IF(B298=\"\",\"\",INDIRECT(\"'\"&B298&\"'!$K$120\"))","v":{"$error":"#REF!"}},{"$f":"IF(B298=\"\",\"\",INDIRECT(\"'\"&B298&\"'!$L$120\"))","v":{"$error":"#REF!"}},{"$f":"IF(B298=\"\",\"\",INDIRECT(\"'\"&B298&\"'!$H$120\"))","v":{"$error":"#REF!"}},{"$f":"IF(B298=\"\",\"\",INDIRECT(\"'\"&B298&\"'!$I$120\"))","v":{"$error":"#REF!"}},{"$f":"IF(B298=\"\",\"\",INDIRECT(\"'\"&B298&\"'!$R$120\"))","v":{"$error":"#REF!"}},{"$f":"IF(B298=\"\",\"\",INDIRECT(\"'\"&B298&\"'!$U$120\"))","v":{"$error":"#REF!"}},{"$f":"IF(B298=\"\",\"\",INDIRECT(\"'\"&B298&\"'!$X$120\"))","v":{"$error":"#REF!"}},{"$f":"IF(B298=\"\",\"\",INDIRECT(\"'\"&B298&\"'!$Z$120\"))","v":{"$error":"#REF!"}},{"$f":"IF(B298=\"\",\"\",INDIRECT(\"'\"&B298&\"'!$AA$120\"))","v":{"$error":"#REF!"}},{"$error":"#REF!"}]
[{"$nulls":4},{"$f":"IF(B298=\"\",\"\",INDIRECT(\"'\"&B298&\"'!$A$122\"))","v":{"$error":"#REF!"}},{"$f":"IF(B298=\"\",\"\",INDIRECT(\"'\"&B298&\"'!$K$129\"))","v":{"$error":"#REF!"}},{"$f":"IF(B298=\"\",\"\",INDIRECT(\"'\"&B298&\"'!$L$129\"))","v":{"$error":"#REF!"}},{"$f":"IF(B298=\"\",\"\",INDIRECT(\"'\"&B298&\"'!$H$129\"))","v":{"$error":"#REF!"}},{"$f":"IF(B298=\"\",\"\",INDIRECT(\"'\"&B298&\"'!$I$129\"))","v":{"$error":"#REF!"}},{"$f":"IF(B298=\"\",\"\",INDIRECT(\"'\"&B298&\"'!$R$129\"))","v":{"$error":"#REF!"}},{"$f":"IF(B298=\"\",\"\",INDIRECT(\"'\"&B298&\"'!$U$129\"))","v":{"$error":"#REF!"}},{"$f":"IF(B298=\"\",\"\",INDIRECT(\"'\"&B298&\"'!$X$129\"))","v":{"$error":"#REF!"}},{"$f":"IF(B298=\"\",\"\",INDIRECT(\"'\"&B298&\"'!$Z$129\"))","v":{"$error":"#REF!"}},{"$f":"IF(B298=\"\",\"\",INDIRECT(\"'\"&B298&\"'!$AA$129\"))","v":{"$error":"#REF!"}},{"$error":"#REF!"}]
[{"$nulls":4},{"$f":"IF(B298=\"\",\"\",INDIRECT(\"'\"&B298&\"'!$A$131\"))","v":{"$error":"#REF!"}},{"$f":"IF(B298=\"\",\"\",INDIRECT(\"'\"&B298&\"'!$K$167\"))","v":{"$error":"#REF!"}},{"$f":"IF(B298=\"\",\"\",INDIRECT(\"'\"&B298&\"'!$L$167\"))","v":{"$error":"#REF!"}},{"$f":"IF(B298=\"\",\"\",INDIRECT(\"'\"&B298&\"'!$H$167\"))","v":{"$error":"#REF!"}},{"$f":"IF(B298=\"\",\"\",INDIRECT(\"'\"&B298&\"'!$I$167\"))","v":{"$error":"#REF!"}},{"$f":"IF(B298=\"\",\"\",INDIRECT(\"'\"&B298&\"'!$R$167\"))","v":{"$error":"#REF!"}},{"$f":"IF(B298=\"\",\"\",INDIRECT(\"'\"&B298&\"'!$U$167\"))","v":{"$error":"#REF!"}},{"$f":"IF(B298=\"\",\"\",INDIRECT(\"'\"&B298&\"'!$X$167\"))","v":{"$error":"#REF!"}},{"$f":"IF(B298=\"\",\"\",INDIRECT(\"'\"&B298&\"'!$Z$167\"))","v":{"$error":"#REF!"}},{"$f":"IF(B298=\"\",\"\",INDIRECT(\"'\"&B298&\"'!$AA$167\"))","v":{"$error":"#REF!"}},{"$error":"#REF!"}]
[null,{"$f":"MID(INDEX(nom_feuilles,ROW(Masque!K42)),SEARCH(\"]\",INDEX(nom_feuilles,ROW(Masque!K42)))+1,30)","v":{"$error":"#REF!"}},{"$error":"#REF!"},{"$f":"IF(B306=\"\",\"\",INDIRECT(\"'\"&B306&\"'!$A$2\"))","v":{"$error":"#REF!"}},{"$f":"IF(B306=\"\",\"\",INDIRECT(\"'\"&B306&\"'!$A$8\"))","v":{"$error":"#REF!"}},{"$f":"IF(B306=\"\",\"\",INDIRECT(\"'\"&B306&\"'!$K$30\"))","v":{"$error":"#REF!"}},{"$f":"IF(B306=\"\",\"\",INDIRECT(\"'\"&B306&\"'!$L$30\"))","v":{"$error":"#REF!"}},{"$f":"IF(B306=\"\",\"\",INDIRECT(\"'\"&B306&\"'!$H$30\"))","v":{"$error":"#REF!"}},{"$f":"IF(B306=\"\",\"\",INDIRECT(\"'\"&B306&\"'!$I$30\"))","v":{"$error":"#REF!"}},{"$f":"IF(B306=\"\",\"\",INDIRECT(\"'\"&B306&\"'!$R$30\"))","v":{"$error":"#REF!"}},{"$f":"IF(B306=\"\",\"\",INDIRECT(\"'\"&B306&\"'!$U$30\"))","v":{"$error":"#REF!"}},{"$f":"IF(B306=\"\",\"\",INDIRECT(\"'\"&B306&\"'!$X$30\"))","v":{"$error":"#REF!"}},{"$f":"IF(B306=\"\",\"\",INDIRECT(\"'\"&B306&\"'!$Z$30\"))","v":{"$error":"#REF!"}},{"$f":"IF(B306=\"\",\"\",INDIRECT(\"'\"&B306&\"'!$AA$30\"))","v":{"$error":"#REF!"}},{"$error":"#REF!"},{"$f":"SUM(O306:O313)","v":{"$error":"#REF!"}},{"$f":"IF(B306=\"\",\"\",INDIRECT(\"'\"&B306&\"'!$H$4\"))","v":{"$error":"#REF!"}},{"$f":"P306-Q306","v":{"$error":"#REF!"}}]
[{"$nulls":4},{"$f":"IF(B306=\"\",\"\",INDIRECT(\"'\"&B306&\"'!$A$32\"))","v":{"$error":"#REF!"}},{"$f":"IF(B306=\"\",\"\",INDIRECT(\"'\"&B306&\"'!$K$54\"))","v":{"$error":"#REF!"}},{"$f":"IF(B306=\"\",\"\",INDIRECT(\"'\"&B306&\"'!$L$54\"))","v":{"$error":"#REF!"}},{"$f":"IF(B306=\"\",\"\",INDIRECT(\"'\"&B306&\"'!$H$54\"))","v":{"$error":"#REF!"}},{"$f":"IF(B306=\"\",\"\",INDIRECT(\"'\"&B306&\"'!$I$54\"))","v":{"$error":"#REF!"}},{"$f":"IF(B306=\"\",\"\",INDIRECT(\"'\"&B306&\"'!$R$54\"))","v":{"$error":"#REF!"}},{"$f":"IF(B306=\"\",\"\",INDIRECT(\"'\"&B306&\"'!$U$54\"))","v":{"$error":"#REF!"}},{"$f":"IF(B306=\"\",\"\",INDIRECT(\"'\"&B306&\"'!$X$54\"))","v":{"$error":"#REF!"}},{"$f":"IF(B306=\"\",\"\",INDIRECT(\"'\"&B306&\"'!$Z$54\"))","v":{"$error":"#REF!"}},{"$f":"IF(B306=\"\",\"\",INDIRECT(\"'\"&B306&\"'!$AA$54\"))","v":{"$error":"#REF!"}},{"$error":"#REF!"}]
[{"$nulls":4},{"$f":"IF(B306=\"\",\"\",INDIRECT(\"'\"&B306&\"'!$A$56\"))","v":{"$error":"#REF!"}},{"$f":"IF(B306=\"\",\"\",INDIRECT(\"'\"&B306&\"'!$K$78\"))","v":{"$error":"#REF!"}},{"$f":"IF(B306=\"\",\"\",INDIRECT(\"'\"&B306&\"'!$L$78\"))","v":{"$error":"#REF!"}},{"$f":"IF(B306=\"\",\"\",INDIRECT(\"'\"&B306&\"'!$H$78\"))","v":{"$error":"#REF!"}},{"$f":"IF(B306=\"\",\"\",INDIRECT(\"'\"&B306&\"'!$I$78\"))","v":{"$error":"#REF!"}},{"$f":"IF(B306=\"\",\"\",INDIRECT(\"'\"&B306&\"'!$R$78\"))","v":{"$error":"#REF!"}},{"$f":"IF(B306=\"\",\"\",INDIRECT(\"'\"&B306&\"'!$U$78\"))","v":{"$error":"#REF!"}},{"$f":"IF(B306=\"\",\"\",INDIRECT(\"'\"&B306&\"'!$X$78\"))","v":{"$error":"#REF!"}},{"$f":"IF(B306=\"\",\"\",INDIRECT(\"'\"&B306&\"'!$Z$78\"))","v":{"$error":"#REF!"}},{"$f":"IF(B306=\"\",\"\",INDIRECT(\"'\"&B306&\"'!$AA$78\"))","v":{"$error":"#REF!"}},{"$error":"#REF!"}]
[{"$nulls":4},{"$f":"IF(B306=\"\",\"\",INDIRECT(\"'\"&B306&\"'!$A$80\"))","v":{"$error":"#REF!"}},{"$f":"IF(B306=\"\",\"\",INDIRECT(\"'\"&B306&\"'!$K$102\"))","v":{"$error":"#REF!"}},{"$f":"IF(B306=\"\",\"\",INDIRECT(\"'\"&B306&\"'!$L$102\"))","v":{"$error":"#REF!"}},{"$f":"IF(B306=\"\",\"\",INDIRECT(\"'\"&B306&\"'!$H$102\"))","v":{"$error":"#REF!"}},{"$f":"IF(B306=\"\",\"\",INDIRECT(\"'\"&B306&\"'!$I$102\"))","v":{"$error":"#REF!"}},{"$f":"IF(B306=\"\",\"\",INDIRECT(\"'\"&B306&\"'!$R$102\"))","v":{"$error":"#REF!"}},{"$f":"IF(B306=\"\",\"\",INDIRECT(\"'\"&B306&\"'!$U$102\"))","v":{"$error":"#REF!"}},{"$f":"IF(B306=\"\",\"\",INDIRECT(\"'\"&B306&\"'!$X$102\"))","v":{"$error":"#REF!"}},{"$f":"IF(B306=\"\",\"\",INDIRECT(\"'\"&B306&\"'!$Z$102\"))","v":{"$error":"#REF!"}},{"$f":"IF(B306=\"\",\"\",INDIRECT(\"'\"&B306&\"'!$AA$102\"))","v":{"$error":"#REF!"}},{"$error":"#REF!"}]
[{"$nulls":4},{"$f":"IF(B306=\"\",\"\",INDIRECT(\"'\"&B306&\"'!$A$104\"))","v":{"$error":"#REF!"}},{"$f":"IF(B306=\"\",\"\",INDIRECT(\"'\"&B306&\"'!$K$111\"))","v":{"$error":"#REF!"}},{"$f":"IF(B306=\"\",\"\",INDIRECT(\"'\"&B306&\"'!$L$111\"))","v":{"$error":"#REF!"}},{"$f":"IF(B306=\"\",\"\",INDIRECT(\"'\"&B306&\"'!$H$111\"))","v":{"$error":"#REF!"}},{"$f":"IF(B306=\"\",\"\",INDIRECT(\"'\"&B306&\"'!$I$111\"))","v":{"$error":"#REF!"}},{"$f":"IF(B306=\"\",\"\",INDIRECT(\"'\"&B306&\"'!$R$111\"))","v":{"$error":"#REF!"}},{"$f":"IF(B306=\"\",\"\",INDIRECT(\"'\"&B306&\"'!$U$111\"))","v":{"$error":"#REF!"}},{"$f":"IF(B306=\"\",\"\",INDIRECT(\"'\"&B306&\"'!$X$111\"))","v":{"$error":"#REF!"}},{"$f":"IF(B306=\"\",\"\",INDIRECT(\"'\"&B306&\"'!$Z$111\"))","v":{"$error":"#REF!"}},{"$f":"IF(B306=\"\",\"\",INDIRECT(\"'\"&B306&\"'!$AA$111\"))","v":{"$error":"#REF!"}},{"$error":"#REF!"}]
[{"$nulls":4},{"$f":"IF(B306=\"\",\"\",INDIRECT(\"'\"&B306&\"'!$A$113\"))","v":{"$error":"#REF!"}},{"$f":"IF(B306=\"\",\"\",INDIRECT(\"'\"&B306&\"'!$K$120\"))","v":{"$error":"#REF!"}},{"$f":"IF(B306=\"\",\"\",INDIRECT(\"'\"&B306&\"'!$L$120\"))","v":{"$error":"#REF!"}},{"$f":"IF(B306=\"\",\"\",INDIRECT(\"'\"&B306&\"'!$H$120\"))","v":{"$error":"#REF!"}},{"$f":"IF(B306=\"\",\"\",INDIRECT(\"'\"&B306&\"'!$I$120\"))","v":{"$error":"#REF!"}},{"$f":"IF(B306=\"\",\"\",INDIRECT(\"'\"&B306&\"'!$R$120\"))","v":{"$error":"#REF!"}},{"$f":"IF(B306=\"\",\"\",INDIRECT(\"'\"&B306&\"'!$U$120\"))","v":{"$error":"#REF!"}},{"$f":"IF(B306=\"\",\"\",INDIRECT(\"'\"&B306&\"'!$X$120\"))","v":{"$error":"#REF!"}},{"$f":"IF(B306=\"\",\"\",INDIRECT(\"'\"&B306&\"'!$Z$120\"))","v":{"$error":"#REF!"}},{"$f":"IF(B306=\"\",\"\",INDIRECT(\"'\"&B306&\"'!$AA$120\"))","v":{"$error":"#REF!"}},{"$error":"#REF!"}]
[{"$nulls":4},{"$f":"IF(B306=\"\",\"\",INDIRECT(\"'\"&B306&\"'!$A$122\"))","v":{"$error":"#REF!"}},{"$f":"IF(B306=\"\",\"\",INDIRECT(\"'\"&B306&\"'!$K$129\"))","v":{"$error":"#REF!"}},{"$f":"IF(B306=\"\",\"\",INDIRECT(\"'\"&B306&\"'!$L$129\"))","v":{"$error":"#REF!"}},{"$f":"IF(B306=\"\",\"\",INDIRECT(\"'\"&B306&\"'!$H$129\"))","v":{"$error":"#REF!"}},{"$f":"IF(B306=\"\",\"\",INDIRECT(\"'\"&B306&\"'!$I$129\"))","v":{"$error":"#REF!"}},{"$f":"IF(B306=\"\",\"\",INDIRECT(\"'\"&B306&\"'!$R$129\"))","v":{"$error":"#REF!"}},{"$f":"IF(B306=\"\",\"\",INDIRECT(\"'\"&B306&\"'!$U$129\"))","v":{"$error":"#REF!"}},{"$f":"IF(B306=\"\",\"\",INDIRECT(\"'\"&B306&\"'!$X$129\"))","v":{"$error":"#REF!"}},{"$f":"IF(B306=\"\",\"\",INDIRECT(\"'\"&B306&\"'!$Z$129\"))","v":{"$error":"#REF!"}},{"$f":"IF(B306=\"\",\"\",INDIRECT(\"'\"&B306&\"'!$AA$129\"))","v":{"$error":"#REF!"}},{"$error":"#REF!"}]
[{"$nulls":4},{"$f":"IF(B306=\"\",\"\",INDIRECT(\"'\"&B306&\"'!$A$131\"))","v":{"$error":"#REF!"}},{"$f":"IF(B306=\"\",\"\",INDIRECT(\"'\"&B306&\"'!$K$167\"))","v":{"$error":"#REF!"}},{"$f":"IF(B306=\"\",\"\",INDIRECT(\"'\"&B306&\"'!$L$167\"))","v":{"$error":"#REF!"}},{"$f":"IF(B306=\"\",\"\",INDIRECT(\"'\"&B306&\"'!$H$167\"))","v":{"$error":"#REF!"}},{"$f":"IF(B306=\"\",\"\",INDIRECT(\"'\"&B306&\"'!$I$167\"))","v":{"$error":"#REF!"}},{"$f":"IF(B306=\"\",\"\",INDIRECT(\"'\"&B306&\"'!$R$167\"))","v":{"$error":"#REF!"}},{"$f":"IF(B306=\"\",\"\",INDIRECT(\"'\"&B306&\"'!$U$167\"))","v":{"$error":"#REF!"}},{"$f":"IF(B306=\"\",\"\",INDIRECT(\"'\"&B306&\"'!$X$167\"))","v":{"$error":"#REF!"}},{"$f":"IF(B306=\"\",\"\",INDIRECT(\"'\"&B306&\"'!$Z$167\"))","v":{"$error":"#REF!"}},{"$f":"IF(B306=\"\",\"\",INDIRECT(\"'\"&B306&\"'!$AA$167\"))","v":{"$error":"#REF!"}},{"$error":"#REF!"}]
[null,{"$f":"MID(INDEX(nom_feuilles,ROW(Masque!K43)),SEARCH(\"]\",INDEX(nom_feuilles,ROW(Masque!K43)))+1,30)","v":{"$error":"#REF!"}},{"$error":"#REF!"},{"$f":"IF(B314=\"\",\"\",INDIRECT(\"'\"&B314&\"'!$A$2\"))","v":{"$error":"#REF!"}},{"$f":"IF(B314=\"\",\"\",INDIRECT(\"'\"&B314&\"'!$A$8\"))","v":{"$error":"#REF!"}},{"$f":"IF(B314=\"\",\"\",INDIRECT(\"'\"&B314&\"'!$K$30\"))","v":{"$error":"#REF!"}},{"$f":"IF(B314=\"\",\"\",INDIRECT(\"'\"&B314&\"'!$L$30\"))","v":{"$error":"#REF!"}},{"$f":"IF(B314=\"\",\"\",INDIRECT(\"'\"&B314&\"'!$H$30\"))","v":{"$error":"#REF!"}},{"$f":"IF(B314=\"\",\"\",INDIRECT(\"'\"&B314&\"'!$I$30\"))","v":{"$error":"#REF!"}},{"$f":"IF(B314=\"\",\"\",INDIRECT(\"'\"&B314&\"'!$R$30\"))","v":{"$error":"#REF!"}},{"$f":"IF(B314=\"\",\"\",INDIRECT(\"'\"&B314&\"'!$U$30\"))","v":{"$error":"#REF!"}},{"$f":"IF(B314=\"\",\"\",INDIRECT(\"'\"&B314&\"'!$X$30\"))","v":{"$error":"#REF!"}},{"$f":"IF(B314=\"\",\"\",INDIRECT(\"'\"&B314&\"'!$Z$30\"))","v":{"$error":"#REF!"}},{"$f":"IF(B314=\"\",\"\",INDIRECT(\"'\"&B314&\"'!$AA$30\"))","v":{"$error":"#REF!"}},{"$error":"#REF!"},{"$f":"SUM(O314:O321)","v":{"$error":"#REF!"}},{"$f":"IF(B314=\"\",\"\",INDIRECT(\"'\"&B314&\"'!$H$4\"))","v":{"$error":"#REF!"}},{"$f":"P314-Q314","v":{"$error":"#REF!"}}]
[{"$nulls":4},{"$f":"IF(B314=\"\",\"\",INDIRECT(\"'\"&B314&\"'!$A$32\"))","v":{"$error":"#REF!"}},{"$f":"IF(B314=\"\",\"\",INDIRECT(\"'\"&B314&\"'!$K$54\"))","v":{"$error":"#REF!"}},{"$f":"IF(B314=\"\",\"\",INDIRECT(\"'\"&B314&\"'!$L$54\"))","v":{"$error":"#REF!"}},{"$f":"IF(B314=\"\",\"\",INDIRECT(\"'\"&B314&\"'!$H$54\"))","v":{"$error":"#REF!"}},{"$f":"IF(B314=\"\",\"\",INDIRECT(\"'\"&B314&\"'!$I$54\"))","v":{"$error":"#REF!"}},{"$f":"IF(B314=\"\",\"\",INDIRECT(\"'\"&B314&\"'!$R$54\"))","v":{"$error":"#REF!"}},{"$f":"IF(B314=\"\",\"\",INDIRECT(\"'\"&B314&\"'!$U$54\"))","v":{"$error":"#REF!"}},{"$f":"IF(B314=\"\",\"\",INDIRECT(\"'\"&B314&\"'!$X$54\"))","v":{"$error":"#REF!"}},{"$f":"IF(B314=\"\",\"\",INDIRECT(\"'\"&B314&\"'!$Z$54\"))","v":{"$error":"#REF!"}},{"$f":"IF(B314=\"\",\"\",INDIRECT(\"'\"&B314&\"'!$AA$54\"))","v":{"$error":"#REF!"}},{"$error":"#REF!"}]
[{"$nulls":4},{"$f":"IF(B314=\"\",\"\",INDIRECT(\"'\"&B314&\"'!$A$56\"))","v":{"$error":"#REF!"}},{"$f":"IF(B314=\"\",\"\",INDIRECT(\"'\"&B314&\"'!$K$78\"))","v":{"$error":"#REF!"}},{"$f":"IF(B314=\"\",\"\",INDIRECT(\"'\"&B314&\"'!$L$78\"))","v":{"$error":"#REF!"}},{"$f":"IF(B314=\"\",\"\",INDIRECT(\"'\"&B314&\"'!$H$78\"))","v":{"$error":"#REF!"}},{"$f":"IF(B314=\"\",\"\",INDIRECT(\"'\"&B314&\"'!$I$78\"))","v":{"$error":"#REF!"}},{"$f":"IF(B314=\"\",\"\",INDIRECT(\"'\"&B314&\"'!$R$78\"))","v":{"$error":"#REF!"}},{"$f":"IF(B314=\"\",\"\",INDIRECT(\"'\"&B314&\"'!$U$78\"))","v":{"$error":"#REF!"}},{"$f":"IF(B314=\"\",\"\",INDIRECT(\"'\"&B314&\"'!$X$78\"))","v":{"$error":"#REF!"}},{"$f":"IF(B314=\"\",\"\",INDIRECT(\"'\"&B314&\"'!$Z$78\"))","v":{"$error":"#REF!"}},{"$f":"IF(B314=\"\",\"\",INDIRECT(\"'\"&B314&\"'!$AA$78\"))","v":{"$error":"#REF!"}},{"$error":"#REF!"}]
[{"$nulls":4},{"$f":"IF(B314=\"\",\"\",INDIRECT(\"'\"&B314&\"'!$A$80\"))","v":{"$error":"#REF!"}},{"$f":"IF(B314=\"\",\"\",INDIRECT(\"'\"&B314&\"'!$K$102\"))","v":{"$error":"#REF!"}},{"$f":"IF(B314=\"\",\"\",INDIRECT(\"'\"&B314&\"'!$L$102\"))","v":{"$error":"#REF!"}},{"$f":"IF(B314=\"\",\"\",INDIRECT(\"'\"&B314&\"'!$H$102\"))","v":{"$error":"#REF!"}},{"$f":"IF(B314=\"\",\"\",INDIRECT(\"'\"&B314&\"'!$I$102\"))","v":{"$error":"#REF!"}},{"$f":"IF(B314=\"\",\"\",INDIRECT(\"'\"&B314&\"'!$R$102\"))","v":{"$error":"#REF!"}},{"$f":"IF(B314=\"\",\"\",INDIRECT(\"'\"&B314&\"'!$U$102\"))","v":{"$error":"#REF!"}},{"$f":"IF(B314=\"\",\"\",INDIRECT(\"'\"&B314&\"'!$X$102\"))","v":{"$error":"#REF!"}},{"$f":"IF(B314=\"\",\"\",INDIRECT(\"'\"&B314&\"'!$Z$102\"))","v":{"$error":"#REF!"}},{"$f":"IF(B314=\"\",\"\",INDIRECT(\"'\"&B314&\"'!$AA$102\"))","v":{"$error":"#REF!"}},{"$error":"#REF!"}]
[{"$nulls":4},{"$f":"IF(B314=\"\",\"\",INDIRECT(\"'\"&B314&\"'!$A$104\"))","v":{"$error":"#REF!"}},{"$f":"IF(B314=\"\",\"\",INDIRECT(\"'\"&B314&\"'!$K$111\"))","v":{"$error":"#REF!"}},{"$f":"IF(B314=\"\",\"\",INDIRECT(\"'\"&B314&\"'!$L$111\"))","v":{"$error":"#REF!"}},{"$f":"IF(B314=\"\",\"\",INDIRECT(\"'\"&B314&\"'!$H$111\"))","v":{"$error":"#REF!"}},{"$f":"IF(B314=\"\",\"\",INDIRECT(\"'\"&B314&\"'!$I$111\"))","v":{"$error":"#REF!"}},{"$f":"IF(B314=\"\",\"\",INDIRECT(\"'\"&B314&\"'!$R$111\"))","v":{"$error":"#REF!"}},{"$f":"IF(B314=\"\",\"\",INDIRECT(\"'\"&B314&\"'!$U$111\"))","v":{"$error":"#REF!"}},{"$f":"IF(B314=\"\",\"\",INDIRECT(\"'\"&B314&\"'!$X$111\"))","v":{"$error":"#REF!"}},{"$f":"IF(B314=\"\",\"\",INDIRECT(\"'\"&B314&\"'!$Z$111\"))","v":{"$error":"#REF!"}},{"$f":"IF(B314=\"\",\"\",INDIRECT(\"'\"&B314&\"'!$AA$111\"))","v":{"$error":"#REF!"}},{"$error":"#REF!"}]
[{"$nulls":4},{"$f":"IF(B314=\"\",\"\",INDIRECT(\"'\"&B314&\"'!$A$113\"))","v":{"$error":"#REF!"}},{"$f":"IF(B314=\"\",\"\",INDIRECT(\"'\"&B314&\"'!$K$120\"))","v":{"$error":"#REF!"}},{"$f":"IF(B314=\"\",\"\",INDIRECT(\"'\"&B314&\"'!$L$120\"))","v":{"$error":"#REF!"}},{"$f":"IF(B314=\"\",\"\",INDIRECT(\"'\"&B314&\"'!$H$120\"))","v":{"$error":"#REF!"}},{"$f":"IF(B314=\"\",\"\",INDIRECT(\"'\"&B314&\"'!$I$120\"))","v":{"$error":"#REF!"}},{"$f":"IF(B314=\"\",\"\",INDIRECT(\"'\"&B314&\"'!$R$120\"))","v":{"$error":"#REF!"}},{"$f":"IF(B314=\"\",\"\",INDIRECT(\"'\"&B314&\"'!$U$120\"))","v":{"$error":"#REF!"}},{"$f":"IF(B314=\"\",\"\",INDIRECT(\"'\"&B314&\"'!$X$120\"))","v":{"$error":"#REF!"}},{"$f":"IF(B314=\"\",\"\",INDIRECT(\"'\"&B314&\"'!$Z$120\"))","v":{"$error":"#REF!"}},{"$f":"IF(B314=\"\",\"\",INDIRECT(\"'\"&B314&\"'!$AA$120\"))","v":{"$error":"#REF!"}},{"$error":"#REF!"}]
[{"$nulls":4},{"$f":"IF(B314=\"\",\"\",INDIRECT(\"'\"&B314&\"'!$A$122\"))","v":{"$error":"#REF!"}},{"$f":"IF(B314=\"\",\"\",INDIRECT(\"'\"&B314&\"'!$K$129\"))","v":{"$error":"#REF!"}},{"$f":"IF(B314=\"\",\"\",INDIRECT(\"'\"&B314&\"'!$L$129\"))","v":{"$error":"#REF!"}},{"$f":"IF(B314=\"\",\"\",INDIRECT(\"'\"&B314&\"'!$H$129\"))","v":{"$error":"#REF!"}},{"$f":"IF(B314=\"\",\"\",INDIRECT(\"'\"&B314&\"'!$I$129\"))","v":{"$error":"#REF!"}},{"$f":"IF(B314=\"\",\"\",INDIRECT(\"'\"&B314&\"'!$R$129\"))","v":{"$error":"#REF!"}},{"$f":"IF(B314=\"\",\"\",INDIRECT(\"'\"&B314&\"'!$U$129\"))","v":{"$error":"#REF!"}},{"$f":"IF(B314=\"\",\"\",INDIRECT(\"'\"&B314&\"'!$X$129\"))","v":{"$error":"#REF!"}},{"$f":"IF(B314=\"\",\"\",INDIRECT(\"'\"&B314&\"'!$Z$129\"))","v":{"$error":"#REF!"}},{"$f":"IF(B314=\"\",\"\",INDIRECT(\"'\"&B314&\"'!$AA$129\"))","v":{"$error":"#REF!"}},{"$error":"#REF!"}]
[{"$nulls":4},{"$f":"IF(B314=\"\",\"\",INDIRECT(\"'\"&B314&\"'!$A$131\"))","v":{"$error":"#REF!"}},{"$f":"IF(B314=\"\",\"\",INDIRECT(\"'\"&B314&\"'!$K$167\"))","v":{"$error":"#REF!"}},{"$f":"IF(B314=\"\",\"\",INDIRECT(\"'\"&B314&\"'!$L$167\"))","v":{"$error":"#REF!"}},{"$f":"IF(B314=\"\",\"\",INDIRECT(\"'\"&B314&\"'!$H$167\"))","v":{"$error":"#REF!"}},{"$f":"IF(B314=\"\",\"\",INDIRECT(\"'\"&B314&\"'!$I$167\"))","v":{"$error":"#REF!"}},{"$f":"IF(B314=\"\",\"\",INDIRECT(\"'\"&B314&\"'!$R$167\"))","v":{"$error":"#REF!"}},{"$f":"IF(B314=\"\",\"\",INDIRECT(\"'\"&B314&\"'!$U$167\"))","v":{"$error":"#REF!"}},{"$f":"IF(B314=\"\",\"\",INDIRECT(\"'\"&B314&\"'!$X$167\"))","v":{"$error":"#REF!"}},{"$f":"IF(B314=\"\",\"\",INDIRECT(\"'\"&B314&\"'!$Z$167\"))","v":{"$error":"#REF!"}},{"$f":"IF(B314=\"\",\"\",INDIRECT(\"'\"&B314&\"'!$AA$167\"))","v":{"$error":"#REF!"}},{"$error":"#REF!"}]
[null,null,"TOTAUX",null,null,{"$f":"SUM(F9:F321)","v":{"$error":"#REF!"}},{"$f":"SUM(G9:G321)","v":{"$error":"#REF!"}},{"$error":"#REF!"},{"$error":"#REF!"},{"$error":"#REF!"},{"$error":"#REF!"},{"$error":"#REF!"},{"$error":"#REF!"},{"$error":"#REF!"},{"$error":"#REF!"},{"$error":"#REF!"},{"$error":"#REF!"},{"$f":"SUM(R9:R321)","v":{"$error":"#REF!"}}]

{"sheet":"RECAP","index":2,"n_rows":131,"n_cols":27,"rows_kept":131,"merged":[[0,3,0,6],[0,7,0,8],[0,9,0,12],[0,14,0,19],[0,21,0,24],[0,25,0,26]]}
[null,null,"Date","Informations personnelles",{"$nulls":3},"Factures",null,"Salaires",{"$nulls":3},"Détails","Hôtel",{"$nulls":5},"Repas","Transport",{"$nulls":3},"Location"]
[{"$nulls":3},"Nom","Prénom","Instrument","Fonction","Cession","Frais de Prod","Net","Brut","Charges","Total","Coord     ","S","T","Nuits","Total Nuitées","Date\narrivée","Date\nDépart","Ticket\nResto","Date\narrivée","Date\nDépart","Coûts de transport","Trajet","Location Son","Location Studio"]
[{"$nulls":9},"(Vide)",{"v":0,"d":"0 €"},{"v":0,"d":"0 €"},{"v":0,"d":"0 €"},{"$nulls":4},{"v":0,"d":"0 €"}]
[{"$nulls":9},"(Vide)",{"v":0,"d":"0 €"},{"v":0,"d":"0 €"},{"v":0,"d":"0 €"},{"$nulls":4},{"v":0,"d":"0 €"}]
[{"$nulls":9},"(Vide)",{"v":0,"d":"0 €"},{"v":0,"d":"0 €"},{"v":0,"d":"0 €"},{"$nulls":4},{"v":0,"d":"0 €"}]
[{"$nulls":9},"(Vide)",{"v":0,"d":"0 €"},{"v":0,"d":"0 €"},{"v":0,"d":"0 €"},{"$nulls":4},{"v":0,"d":"0 €"}]
[{"$nulls":9},"(Vide)",{"v":0,"d":"0 €"},{"v":0,"d":"0 €"},{"v":0,"d":"0 €"},{"$nulls":4},{"v":0,"d":"0 €"}]
[{"$nulls":9},"(Vide)",{"v":0,"d":"0 €"},{"v":0,"d":"0 €"},{"v":0,"d":"0 €"},{"$nulls":4},{"v":0,"d":"0 €"}]
[{"$nulls":9},"(Vide)",{"v":0,"d":"0 €"},{"v":0,"d":"0 €"},{"v":0,"d":"0 €"},{"$nulls":4},{"v":0,"d":"0 €"}]
[{"$nulls":9},"(Vide)",{"v":0,"d":"0 €"},{"v":0,"d":"0 €"},{"v":0,"d":"0 €"},{"$nulls":4},{"v":0,"d":"0 €"}]
[{"$nulls":9},"(Vide)",{"v":0,"d":"0 €"},{"v":0,"d":"0 €"},{"v":0,"d":"0 €"},{"$nulls":4},{"v":0,"d":"0 €"}]
[{"$nulls":9},"(Vide)",{"v":0,"d":"0 €"},{"v":0,"d":"0 €"},{"v":0,"d":"0 €"},{"$nulls":4},{"v":0,"d":"0 €"}]
[{"$nulls":9},"(Vide)",{"v":0,"d":"0 €"},{"v":0,"d":"0 €"},{"v":0,"d":"0 €"},{"$nulls":4},{"v":0,"d":"0 €"}]
[{"$nulls":9},"(Vide)",{"v":0,"d":"0 €"},{"v":0,"d":"0 €"},{"v":0,"d":"0 €"},{"$nulls":4},{"v":0,"d":"0 €"}]
[{"$nulls":9},"(Vide)",{"v":0,"d":"0 €"},{"v":0,"d":"0 €"},{"v":0,"d":"0 €"},{"$nulls":4},{"v":0,"d":"0 €"}]
[{"$nulls":9},"(Vide)",{"v":0,"d":"0 €"},{"v":0,"d":"0 €"},{"v":0,"d":"0 €"},{"$nulls":4},{"v":0,"d":"0 €"}]
[{"$nulls":9},"(Vide)",{"v":0,"d":"0 €"},{"v":0,"d":"0 €"},{"v":0,"d":"0 €"},{"$nulls":4},{"v":0,"d":"0 €"}]
[{"$nulls":9},"(Vide)",{"v":0,"d":"0 €"},{"v":0,"d":"0 €"},{"v":0,"d":"0 €"},{"$nulls":4},{"v":0,"d":"0 €"}]
[{"$nulls":9},"(Vide)",{"v":0,"d":"0 €"},{"v":0,"d":"0 €"},{"v":0,"d":"0 €"},{"$nulls":4},{"v":0,"d":"0 €"}]
[{"$nulls":9},"(Vide)",{"v":0,"d":"0 €"},{"v":0,"d":"0 €"},{"v":0,"d":"0 €"},{"$nulls":4},{"v":0,"d":"0 €"}]
[{"$nulls":9},"(Vide)",{"v":0,"d":"0 €"},{"v":0,"d":"0 €"},{"v":0,"d":"0 €"},{"$nulls":4},{"v":0,"d":"0 €"}]
[{"$nulls":9},"(Vide)",{"v":0,"d":"0 €"},{"v":0,"d":"0 €"},{"v":0,"d":"0 €"},{"$nulls":4},{"v":0,"d":"0 €"}]
[{"$nulls":9},"(Vide)",{"v":0,"d":"0 €"},{"v":0,"d":"0 €"},{"v":0,"d":"0 €"},{"$nulls":4},{"v":0,"d":"0 €"}]
[{"$nulls":9},"(Vide)",{"v":0,"d":"0 €"},{"v":0,"d":"0 €"},{"v":0,"d":"0 €"},{"$nulls":4},{"v":0,"d":"0 €"}]
[{"$nulls":9},"(Vide)",{"v":0,"d":"0 €"},{"v":0,"d":"0 €"},{"v":0,"d":"0 €"},{"$nulls":4},{"v":0,"d":"0 €"}]
[{"$nulls":9},"(Vide)",{"v":0,"d":"0 €"},{"v":0,"d":"0 €"},{"v":0,"d":"0 €"},{"$nulls":4},{"v":0,"d":"0 €"}]
[{"$nulls":9},"(Vide)",{"v":0,"d":"0 €"},{"v":0,"d":"0 €"},{"v":0,"d":"0 €"},{"$nulls":4},{"v":0,"d":"0 €"}]
[{"$nulls":9},"(Vide)",{"v":0,"d":"0 €"},{"v":0,"d":"0 €"},{"v":0,"d":"0 €"},{"$nulls":4},{"v":0,"d":"0 €"}]
[{"$nulls":9},"(Vide)",{"v":0,"d":"0 €"},{"v":0,"d":"0 €"},{"v":0,"d":"0 €"},{"$nulls":4},{"v":0,"d":"0 €"}]
[{"$nulls":9},"(Vide)",{"v":0,"d":"0 €"},{"v":0,"d":"0 €"},{"v":0,"d":"0 €"},{"$nulls":4},{"v":0,"d":"0 €"}]
[{"$nulls":9},"(Vide)",{"v":0,"d":"0 €"},{"v":0,"d":"0 €"},{"v":0,"d":"0 €"},{"$nulls":4},{"v":0,"d":"0 €"}]
[{"$nulls":9},"(Vide)",{"v":0,"d":"0 €"},{"v":0,"d":"0 €"},{"v":0,"d":"0 €"},{"$nulls":4},{"v":0,"d":"0 €"}]
[{"$nulls":9},"(Vide)",{"v":0,"d":"0 €"},{"v":0,"d":"0 €"},{"v":0,"d":"0 €"},{"$nulls":4},{"v":0,"d":"0 €"}]
[{"$nulls":9},"(Vide)",{"v":0,"d":"0 €"},{"v":0,"d":"0 €"},{"v":0,"d":"0 €"},{"$nulls":4},{"v":0,"d":"0 €"}]
[{"$nulls":9},"(Vide)",{"v":0,"d":"0 €"},{"v":0,"d":"0 €"},{"v":0,"d":"0 €"},{"$nulls":4},{"v":0,"d":"0 €"}]
[{"$nulls":9},"(Vide)",{"v":0,"d":"0 €"},{"v":0,"d":"0 €"},{"v":0,"d":"0 €"},{"$nulls":4},{"v":0,"d":"0 €"}]
[{"$nulls":9},"(Vide)",{"v":0,"d":"0 €"},{"v":0,"d":"0 €"},{"v":0,"d":"0 €"},{"$nulls":4},{"v":0,"d":"0 €"}]
[{"$nulls":9},"(Vide)",{"v":0,"d":"0 €"},{"v":0,"d":"0 €"},{"v":0,"d":"0 €"},{"$nulls":4},{"v":0,"d":"0 €"}]
[{"$nulls":9},"(Vide)",{"v":0,"d":"0 €"},{"v":0,"d":"0 €"},{"v":0,"d":"0 €"},{"$nulls":4},{"v":0,"d":"0 €"}]
[{"$nulls":9},"(Vide)",{"v":0,"d":"0 €"},{"v":0,"d":"0 €"},{"v":0,"d":"0 €"},{"$nulls":4},{"v":0,"d":"0 €"}]
[{"$nulls":9},"(Vide)",{"v":0,"d":"0 €"},{"v":0,"d":"0 €"},{"v":0,"d":"0 €"},{"$nulls":4},{"v":0,"d":"0 €"}]
[{"$nulls":9},"(Vide)",{"v":0,"d":"0 €"},{"v":0,"d":"0 €"},{"v":0,"d":"0 €"},{"$nulls":4},{"v":0,"d":"0 €"}]
[{"$nulls":9},"(Vide)",{"v":0,"d":"0 €"},{"v":0,"d":"0 €"},{"v":0,"d":"0 €"},{"$nulls":4},{"v":0,"d":"0 €"}]
[{"$nulls":9},"(Vide)",{"v":0,"d":"0 €"},{"v":0,"d":"0 €"},{"v":0,"d":"0 €"},{"$nulls":4},{"v":0,"d":"0 €"}]
[{"$nulls":9},"(Vide)",{"v":0,"d":"0 €"},{"v":0,"d":"0 €"},{"v":0,"d":"0 €"},{"$nulls":4},{"v":0,"d":"0 €"}]
[{"$nulls":9},"(Vide)",{"v":0,"d":"0 €"},{"v":0,"d":"0 €"},{"v":0,"d":"0 €"},{"$nulls":4},{"v":0,"d":"0 €"}]
[{"$nulls":9},"(Vide)",{"v":0,"d":"0 €"},{"v":0,"d":"0 €"},{"v":0,"d":"0 €"},{"$nulls":4},{"v":0,"d":"0 €"}]
[{"$nulls":9},"(Vide)",{"v":0,"d":"0 €"},{"v":0,"d":"0 €"},{"v":0,"d":"0 €"},{"$nulls":4},{"v":0,"d":"0 €"}]
[{"$nulls":9},"(Vide)",{"v":0,"d":"0 €"},{"v":0,"d":"0 €"},{"v":0,"d":"0 €"},{"$nulls":4},{"v":0,"d":"0 €"}]
[{"$nulls":9},"(Vide)",{"v":0,"d":"0 €"},{"v":0,"d":"0 €"},{"v":0,"d":"0 €"},{"$nulls":4},{"v":0,"d":"0 €"}]
[{"$nulls":9},"(Vide)",{"v":0,"d":"0 €"},{"v":0,"d":"0 €"},{"v":0,"d":"0 €"},{"$nulls":4},{"v":0,"d":"0 €"}]
[{"$nulls":9},"(Vide)",{"v":0,"d":"0 €"},{"v":0,"d":"0 €"},{"v":0,"d":"0 €"},{"$nulls":4},{"v":0,"d":"0 €"}]
[{"$nulls":9},"(Vide)",{"v":0,"d":"0 €"},{"v":0,"d":"0 €"},{"v":0,"d":"0 €"},{"$nulls":4},{"v":0,"d":"0 €"}]
[{"$nulls":9},"(Vide)",{"v":0,"d":"0 €"},{"v":0,"d":"0 €"},{"v":0,"d":"0 €"},{"$nulls":4},{"v":0,"d":"0 €"}]
[{"$nulls":9},"(Vide)",{"v":0,"d":"0 €"},{"v":0,"d":"0 €"},{"v":0,"d":"0 €"},{"$nulls":4},{"v":0,"d":"0 €"}]
[{"$nulls":9},"(Vide)",{"v":0,"d":"0 €"},{"v":0,"d":"0 €"},{"v":0,"d":"0 €"},{"$nulls":4},{"v":0,"d":"0 €"}]
[{"$nulls":9},"(Vide)",{"v":0,"d":"0 €"},{"v":0,"d":"0 €"},{"v":0,"d":"0 €"},{"$nulls":4},{"v":0,"d":"0 €"}]
[{"$nulls":9},"(Vide)",{"v":0,"d":"0 €"},{"v":0,"d":"0 €"},{"v":0,"d":"0 €"},{"$nulls":4},{"v":0,"d":"0 €"}]
[{"$nulls":9},"(Vide)",{"v":0,"d":"0 €"},{"v":0,"d":"0 €"},{"v":0,"d":"0 €"},{"$nulls":4},{"v":0,"d":"0 €"}]
[{"$nulls":9},"(Vide)",{"v":0,"d":"0 €"},{"v":0,"d":"0 €"},{"v":0,"d":"0 €"},{"$nulls":4},{"v":0,"d":"0 €"}]
[{"$nulls":9},"(Vide)",{"v":0,"d":"0 €"},{"v":0,"d":"0 €"},{"v":0,"d":"0 €"},{"$nulls":4},{"v":0,"d":"0 €"}]
[{"$nulls":9},"(Vide)",{"v":0,"d":"0 €"},{"v":0,"d":"0 €"},{"v":0,"d":"0 €"},{"$nulls":4},{"v":0,"d":"0 €"}]
[{"$nulls":9},"(Vide)",{"v":0,"d":"0 €"},{"v":0,"d":"0 €"},{"v":0,"d":"0 €"},{"$nulls":4},{"v":0,"d":"0 €"}]
[{"$nulls":9},"(Vide)",{"v":0,"d":"0 €"},{"v":0,"d":"0 €"},{"v":0,"d":"0 €"},{"$nulls":4},{"v":0,"d":"0 €"}]
[{"$nulls":9},"(Vide)",{"v":0,"d":"0 €"},{"v":0,"d":"0 €"},{"v":0,"d":"0 €"},{"$nulls":4},{"v":0,"d":"0 €"}]
[{"$nulls":9},"(Vide)",{"v":0,"d":"0 €"},{"v":0,"d":"0 €"},{"v":0,"d":"0 €"},{"$nulls":4},{"v":0,"d":"0 €"}]
[{"$nulls":9},"(Vide)",{"v":0,"d":"0 €"},{"v":0,"d":"0 €"},{"v":0,"d":"0 €"},{"$nulls":4},{"v":0,"d":"0 €"}]
[{"$nulls":9},"(Vide)",{"v":0,"d":"0 €"},{"v":0,"d":"0 €"},{"v":0,"d":"0 €"},{"$nulls":4},{"v":0,"d":"0 €"}]
[{"$nulls":9},"(Vide)",{"v":0,"d":"0 €"},{"v":0,"d":"0 €"},{"v":0,"d":"0 €"},{"$nulls":4},{"v":0,"d":"0 €"}]
[{"$nulls":9},"(Vide)",{"v":0,"d":"0 €"},{"v":0,"d":"0 €"},{"v":0,"d":"0 €"},{"$nulls":4},{"v":0,"d":"0 €"}]
[{"$nulls":9},"(Vide)",{"v":0,"d":"0 €"},{"v":0,"d":"0 €"},{"v":0,"d":"0 €"},{"$nulls":4},{"v":0,"d":"0 €"}]
[{"$nulls":9},"(Vide)",{"v":0,"d":"0 €"},{"v":0,"d":"0 €"},{"v":0,"d":"0 €"},{"$nulls":4},{"v":0,"d":"0 €"}]
[{"$nulls":9},"(Vide)",{"v":0,"d":"0 €"},{"v":0,"d":"0 €"},{"v":0,"d":"0 €"},{"$nulls":4},{"v":0,"d":"0 €"}]
[{"$nulls":9},"(Vide)",{"v":0,"d":"0 €"},{"v":0,"d":"0 €"},{"v":0,"d":"0 €"},{"$nulls":4},{"v":0,"d":"0 €"}]
[{"$nulls":9},"(Vide)",{"v":0,"d":"0 €"},{"v":0,"d":"0 €"},{"v":0,"d":"0 €"},{"$nulls":4},{"v":0,"d":"0 €"}]
[{"$nulls":9},"(Vide)",{"v":0,"d":"0 €"},{"v":0,"d":"0 €"},{"v":0,"d":"0 €"},{"$nulls":4},{"v":0,"d":"0 €"}]
[{"$nulls":9},"(Vide)",{"v":0,"d":"0 €"},{"v":0,"d":"0 €"},{"v":0,"d":"0 €"},{"$nulls":4},{"v":0,"d":"0 €"}]
[{"$nulls":9},"(Vide)",{"v":0,"d":"0 €"},{"v":0,"d":"0 €"},{"v":0,"d":"0 €"},{"$nulls":4},{"v":0,"d":"0 €"}]
[{"$nulls":9},"(Vide)",{"v":0,"d":"0 €"},{"v":0,"d":"0 €"},{"v":0,"d":"0 €"},{"$nulls":4},{"v":0,"d":"0 €"}]
[{"$nulls":9},"(Vide)",{"v":0,"d":"0 €"},{"v":0,"d":"0 €"},{"v":0,"d":"0 €"},{"$nulls":4},{"v":0,"d":"0 €"}]
[{"$nulls":9},"(Vide)",{"v":0,"d":"0 €"},{"v":0,"d":"0 €"},{"v":0,"d":"0 €"},{"$nulls":4},{"v":0,"d":"0 €"}]
[{"$nulls":9},"(Vide)",{"v":0,"d":"0 €"},{"v":0,"d":"0 €"},{"v":0,"d":"0 €"},{"$nulls":4},{"v":0,"d":"0 €"}]
[{"$nulls":9},"(Vide)",{"v":0,"d":"0 €"},{"v":0,"d":"0 €"},{"v":0,"d":"0 €"},{"$nulls":4},{"v":0,"d":"0 €"}]
[{"$nulls":9},"(Vide)",{"v":0,"d":"0 €"},{"v":0,"d":"0 €"},{"v":0,"d":"0 €"},{"$nulls":4},{"v":0,"d":"0 €"}]
[{"$nulls":9},"(Vide)",{"v":0,"d":"0 €"},{"v":0,"d":"0 €"},{"v":0,"d":"0 €"},{"$nulls":4},{"v":0,"d":"0 €"}]
[{"$nulls":9},"(Vide)",{"v":0,"d":"0 €"},{"v":0,"d":"0 €"},{"v":0,"d":"0 €"},{"$nulls":4},{"v":0,"d":"0 €"}]
[{"$nulls":9},"(Vide)",{"v":0,"d":"0 €"},{"v":0,"d":"0 €"},{"v":0,"d":"0 €"},{"$nulls":4},{"v":0,"d":"0 €"}]
[{"$nulls":9},"(Vide)",{"v":0,"d":"0 €"},{"v":0,"d":"0 €"},{"v":0,"d":"0 €"},{"$nulls":4},{"v":0,"d":"0 €"}]
[{"$nulls":9},"(Vide)",{"v":0,"d":"0 €"},{"v":0,"d":"0 €"},{"v":0,"d":"0 €"},{"$nulls":4},{"v":0,"d":"0 €"}]
[{"$nulls":9},"(Vide)",{"v":0,"d":"0 €"},{"v":0,"d":"0 €"},{"v":0,"d":"0 €"},{"$nulls":4},{"v":0,"d":"0 €"}]
[{"$nulls":9},"(Vide)",{"v":0,"d":"0 €"},{"v":0,"d":"0 €"},{"v":0,"d":"0 €"},{"$nulls":4},{"v":0,"d":"0 €"}]
[{"$nulls":9},"(Vide)",{"v":0,"d":"0 €"},{"v":0,"d":"0 €"},{"v":0,"d":"0 €"},{"$nulls":4},{"v":0,"d":"0 €"}]
[{"$nulls":9},"(Vide)",{"v":0,"d":"0 €"},{"v":0,"d":"0 €"},{"v":0,"d":"0 €"},{"$nulls":4},{"v":0,"d":"0 €"}]
[{"$nulls":9},"(Vide)",{"v":0,"d":"0 €"},{"v":0,"d":"0 €"},{"v":0,"d":"0 €"},{"$nulls":4},{"v":0,"d":"0 €"}]
[{"$nulls":9},"(Vide)",{"v":0,"d":"0 €"},{"v":0,"d":"0 €"},{"v":0,"d":"0 €"},{"$nulls":4},{"v":0,"d":"0 €"}]
[{"$nulls":9},"(Vide)",{"v":0,"d":"0 €"},{"v":0,"d":"0 €"},{"v":0,"d":"0 €"},{"$nulls":4},{"v":0,"d":"0 €"}]
[{"$nulls":9},"(Vide)",{"v":0,"d":"0 €"},{"v":0,"d":"0 €"},{"v":0,"d":"0 €"},{"$nulls":4},{"v":0,"d":"0 €"}]
[{"$nulls":9},"(Vide)",{"v":0,"d":"0 €"},{"v":0,"d":"0 €"},{"v":0,"d":"0 €"},{"$nulls":4},{"v":0,"d":"0 €"}]
[{"$nulls":9},"(Vide)",{"v":0,"d":"0 €"},{"v":0,"d":"0 €"},{"v":0,"d":"0 €"},{"$nulls":4},{"v":0,"d":"0 €"}]
[{"$nulls":9},"(Vide)",{"v":0,"d":"0 €"},{"v":0,"d":"0 €"},{"v":0,"d":"0 €"},{"$nulls":4},{"v":0,"d":"0 €"}]
[{"$nulls":9},"(Vide)",{"v":0,"d":"0 €"},{"v":0,"d":"0 €"},{"v":0,"d":"0 €"},{"$nulls":4},{"v":0,"d":"0 €"}]
[{"$nulls":9},"(Vide)",{"v":0,"d":"0 €"},{"v":0,"d":"0 €"},{"v":0,"d":"0 €"},{"$nulls":4},{"v":0,"d":"0 €"}]
[{"$nulls":9},"(Vide)",{"v":0,"d":"0 €"},{"v":0,"d":"0 €"},{"v":0,"d":"0 €"},{"$nulls":4},{"v":0,"d":"0 €"}]
[{"$nulls":9},"(Vide)",{"v":0,"d":"0 €"},{"v":0,"d":"0 €"},{"v":0,"d":"0 €"},{"$nulls":4},{"v":0,"d":"0 €"}]
[{"$nulls":9},"(Vide)",{"v":0,"d":"0 €"},{"v":0,"d":"0 €"},{"v":0,"d":"0 €"},{"$nulls":4},{"v":0,"d":"0 €"}]
[{"$nulls":9},"(Vide)",{"v":0,"d":"0 €"},{"v":0,"d":"0 €"},{"v":0,"d":"0 €"},{"$nulls":4},{"v":0,"d":"0 €"}]
[{"$nulls":9},"(Vide)",{"v":0,"d":"0 €"},{"v":0,"d":"0 €"},{"v":0,"d":"0 €"},{"$nulls":4},{"v":0,"d":"0 €"}]
[{"$nulls":9},"(Vide)",{"v":0,"d":"0 €"},{"v":0,"d":"0 €"},{"v":0,"d":"0 €"},{"$nulls":4},{"v":0,"d":"0 €"}]
[{"$nulls":9},"(Vide)",{"v":0,"d":"0 €"},{"v":0,"d":"0 €"},{"v":0,"d":"0 €"},{"$nulls":4},{"v":0,"d":"0 €"}]
[{"$nulls":9},"(Vide)",{"v":0,"d":"0 €"},{"v":0,"d":"0 €"},{"v":0,"d":"0 €"},{"$nulls":4},{"v":0,"d":"0 €"}]
[{"$nulls":9},"(Vide)",{"v":0,"d":"0 €"},{"v":0,"d":"0 €"},{"v":0,"d":"0 €"},{"$nulls":4},{"v":0,"d":"0 €"}]
[{"$nulls":9},"(Vide)",{"v":0,"d":"0 €"},{"v":0,"d":"0 €"},{"v":0,"d":"0 €"},{"$nulls":4},{"v":0,"d":"0 €"}]
[{"$nulls":9},"(Vide)",{"v":0,"d":"0 €"},{"v":0,"d":"0 €"},{"v":0,"d":"0 €"},{"$nulls":4},{"v":0,"d":"0 €"}]
[{"$nulls":9},"(Vide)",{"v":0,"d":"0 €"},{"v":0,"d":"0 €"},{"v":0,"d":"0 €"},{"$nulls":4},{"v":0,"d":"0 €"}]
[{"$nulls":9},"(Vide)",{"v":0,"d":"0 €"},{"v":0,"d":"0 €"},{"v":0,"d":"0 €"},{"$nulls":4},{"v":0,"d":"0 €"}]
[{"$nulls":9},"(Vide)",{"v":0,"d":"0 €"},{"v":0,"d":"0 €"},{"v":0,"d":"0 €"},{"$nulls":4},{"v":0,"d":"0 €"}]
[{"$nulls":9},"(Vide)",{"v":0,"d":"0 €"},{"v":0,"d":"0 €"},{"v":0,"d":"0 €"},{"$nulls":4},{"v":0,"d":"0 €"}]
[{"$nulls":9},"(Vide)",{"v":0,"d":"0 €"},{"v":0,"d":"0 €"},{"v":0,"d":"0 €"},{"$nulls":4},{"v":0,"d":"0 €"}]
[{"$nulls":9},"(Vide)",{"v":0,"d":"0 €"},{"v":0,"d":"0 €"},{"v":0,"d":"0 €"},{"$nulls":4},{"v":0,"d":"0 €"}]
[{"$nulls":9},"(Vide)",{"v":0,"d":"0 €"},{"v":0,"d":"0 €"},{"v":0,"d":"0 €"},{"$nulls":4},{"v":0,"d":"0 €"}]
[{"$nulls":9},"(Vide)",{"v":0,"d":"0 €"},{"v":0,"d":"0 €"},{"v":0,"d":"0 €"},{"$nulls":4},{"v":0,"d":"0 €"}]
[{"$nulls":9},"(Vide)",{"v":0,"d":"0 €"},{"v":0,"d":"0 €"},{"v":0,"d":"0 €"},{"$nulls":4},{"v":0,"d":"0 €"}]
[{"$nulls":9},"(Vide)",{"v":0,"d":"0 €"},{"v":0,"d":"0 €"},{"v":0,"d":"0 €"},{"$nulls":4},{"v":0,"d":"0 €"}]
[{"$nulls":9},"(Vide)",{"v":0,"d":"0 €"},{"v":0,"d":"0 €"},{"v":0,"d":"0 €"},{"$nulls":4},{"v":0,"d":"0 €"}]
[{"$nulls":9},"(Vide)",{"v":0,"d":"0 €"},{"v":0,"d":"0 €"},{"v":0,"d":"0 €"},{"$nulls":4},{"v":0,"d":"0 €"}]
[{"$nulls":9},"(Vide)",{"v":0,"d":"0 €"},{"v":0,"d":"0 €"},{"v":0,"d":"0 €"},{"$nulls":4},{"v":0,"d":"0 €"}]
[{"$nulls":9},"(Vide)",{"v":0,"d":"0 €"},{"v":0,"d":"0 €"},{"v":0,"d":"0 €"},{"$nulls":4},{"v":0,"d":"0 €"}]
[{"$nulls":9},"(Vide)",{"v":0,"d":"0 €"},{"v":0,"d":"0 €"},{"v":0,"d":"0 €"},{"$nulls":4},{"v":0,"d":"0 €"}]
[{"$nulls":9},"(Vide)",{"v":0,"d":"0 €"},{"v":0,"d":"0 €"},{"v":0,"d":"0 €"},{"$nulls":4},{"v":0,"d":"0 €"}]
[{"$nulls":9},"(Vide)",{"v":0,"d":"0 €"},{"v":0,"d":"0 €"},{"v":0,"d":"0 €"},{"$nulls":4},{"v":0,"d":"0 €"}]
[{"$nulls":9},"(Vide)",{"v":0,"d":"0 €"},{"v":0,"d":"0 €"},{"v":0,"d":"0 €"},{"$nulls":4},{"v":0,"d":"0 €"}]

{"sheet":"A-Modèle","index":3,"n_rows":167,"n_cols":27,"rows_kept":167,"merged":[[0,0,0,3],[1,0,1,3],[3,3,4,3],[3,4,4,4],[3,6,4,6],[3,7,4,7],[7,0,8,0],[7,3,7,6],[7,7,7,8],[7,9,7,12],[7,14,7,19],[7,21,7,24],[7,25,7,26],[31,0,32,0],[31,3,31,6],[31,7,31,8],[31,9,31,12],[31,14,31,19],[31,21,31,24],[31,25,31,26],[55,0,56,0],[55,3,55,6],[55,7,55,8],[55,9,55,12],[55,14,55,19],[55,21,55,24],[55,25,55,26],[79,0,80,0],[79,3,79,6],[79,7,79,8],[79,9,79,12],[79,14,79,19],[79,21,79,24],[79,25,79,26],[103,0,104,0],[103,3,103,6],[103,7,103,8],[103,9,103,12],[103,14,103,19],[103,21,103,24],[103,25,103,26],[112,0,113,0],[112,3,112,6],[112,7,112,8],[112,9,112,12],[112,14,112,19],[112,21,112,24],[112,25,112,26],[121,0,122,0],[121,3,121,6],[121,7,121,8],[121,9,121,12],[121,14,121,19],[121,21,121,24],[121,25,121,26],[130,0,131,0],[130,3,130,6],[130,7,130,8],[130,9,130,12],[130,14,130,19],[130,21,130,24],[130,25,130,26]]}
["DATE",{"$nulls":4},"Ne pas toucher","Remplir les cases","Liste déroulante","Contrat Fait","Contrat Envoyé","Contrat Reçu"]
["LIEU"]
[]
[{"$nulls":3},"CHARGES",{"$f":"H30+I30+M30+R30+U30+X30+Z30+AA30+H54+I54+M54+R54+U54+X54+Z54+AA54+H78+I78+M78+R78+U78+X78+Z78+AA78+H102+I102+M102+R102+U102+X102+Z102+AA102+H111+I111+M111+R111+U111+X111+Z111+AA111+H120+I120+H129+I129+M120+M129+R120+R129+U120+U129+X129+X120+Z129+Z120+AA120+AA129+AA167+Z167+X167+U167+R167+M167+I167+H167","v":{"v":0,"d":"0 €"}},null,"RECETTES",{"$f":"J4+J5+L4","v":{"v":0,"d":"0 €"}},"Cession Ville",{"v":0,"d":"0 €"},"Actions Q",{"v":0,"d":"0 €"}]
[{"$nulls":8},"Sub' Ville",{"v":0,"d":"0 €"}]
[]
[]
["Plateau 1 \n(Concert)",null,"Date","Informations personnelles",{"$nulls":3},"Factures",null,"Salaires",{"$nulls":3},"Détails","Hôtel",{"$nulls":5},"Repas","Transport",{"$nulls":3},"Location"]
[{"$nulls":3},"Nom","Prénom","Instrument","Fonction","Cession","Frais de Prod","Net","Brut","Charges","Total","Coord     ","S","T","Nuits","Total Nuitées","Date\narrivée","Date\nDépart","Ticket\nResto","Date\narrivée","Date\nDépart","Coûts de transport","Trajet","Location Son","Location Studio"]
[{"$nulls":9},"(Vide)",{"$f":"VLOOKUP(J10,NetBrut,2,0)","v":{"v":0,"d":"0 €"}},{"$f":"VLOOKUP(K10,BrutCharges,2,0)","v":{"v":0,"d":"0 €"}},{"$f":"K10+L10","v":{"v":0,"d":"0 €"}},{"$nulls":4},{"$f":"+IF(O10>0,O10*Q10*Masque!$H$3,P10*Q10*Masque!$H$4)","v":{"v":0,"d":"0 €"}}]
[{"$nulls":9},"(Vide)",{"v":0,"d":"0 €"},{"v":0,"d":"0 €"},{"$f":"K11+L11","v":{"v":0,"d":"0 €"}},{"$nulls":4},{"$f":"+IF(O11>0,O11*Q11*Masque!$H$3,P11*Q11*Masque!$H$4)","v":{"v":0,"d":"0 €"}}]
[{"$nulls":9},"(Vide)",{"v":0,"d":"0 €"},{"v":0,"d":"0 €"},{"v":0,"d":"0 €"},{"$nulls":4},{"$f":"+IF(O12>0,O12*Q12*Masque!$H$3,P12*Q12*Masque!$H$4)","v":{"v":0,"d":"0 €"}}]
[{"$nulls":9},"(Vide)",{"v":0,"d":"0 €"},{"v":0,"d":"0 €"},{"v":0,"d":"0 €"},{"$nulls":4},{"$f":"+IF(O13>0,O13*Q13*Masque!$H$3,P13*Q13*Masque!$H$4)","v":{"v":0,"d":"0 €"}}]
[{"$nulls":9},"(Vide)",{"v":0,"d":"0 €"},{"v":0,"d":"0 €"},{"v":0,"d":"0 €"},{"$nulls":4},{"$f":"+IF(O14>0,O14*Q14*Masque!$H$3,P14*Q14*Masque!$H$4)","v":{"v":0,"d":"0 €"}}]
[{"$nulls":9},"(Vide)",{"v":0,"d":"0 €"},{"v":0,"d":"0 €"},{"v":0,"d":"0 €"},{"$nulls":4},{"$f":"+IF(O15>0,O15*Q15*Masque!$H$3,P15*Q15*Masque!$H$4)","v":{"v":0,"d":"0 €"}}]
[{"$nulls":9},"(Vide)",{"v":0,"d":"0 €"},{"v":0,"d":"0 €"},{"v":0,"d":"0 €"},{"$nulls":4},{"$f":"+IF(O16>0,O16*Q16*Masque!$H$3,P16*Q16*Masque!$H$4)","v":{"v":0,"d":"0 €"}}]
[{"$nulls":9},"(Vide)",{"v":0,"d":"0 €"},{"v":0,"d":"0 €"},{"v":0,"d":"0 €"},{"$nulls":4},{"$f":"+IF(O17>0,O17*Q17*Masque!$H$3,P17*Q17*Masque!$H$4)","v":{"v":0,"d":"0 €"}}]
[{"$nulls":9},"(Vide)",{"v":0,"d":"0 €"},{"v":0,"d":"0 €"},{"v":0,"d":"0 €"},{"$nulls":4},{"$f":"+IF(O18>0,O18*Q18*Masque!$H$3,P18*Q18*Masque!$H$4)","v":{"v":0,"d":"0 €"}}]
[{"$nulls":9},"(Vide)",{"v":0,"d":"0 €"},{"v":0,"d":"0 €"},{"v":0,"d":"0 €"},{"$nulls":4},{"$f":"+IF(O19>0,O19*Q19*Masque!$H$3,P19*Q19*Masque!$H$4)","v":{"v":0,"d":"0 €"}}]
[{"$nulls":9},"(Vide)",{"v":0,"d":"0 €"},{"v":0,"d":"0 €"},{"v":0,"d":"0 €"},{"$nulls":4},{"$f":"+IF(O20>0,O20*Q20*Masque!$H$3,P20*Q20*Masque!$H$4)","v":{"v":0,"d":"0 €"}}]
[{"$nulls":9},"(Vide)",{"v":0,"d":"0 €"},{"v":0,"d":"0 €"},{"v":0,"d":"0 €"},{"$nulls":4},{"$f":"+IF(O21>0,O21*Q21*Masque!$H$3,P21*Q21*Masque!$H$4)","v":{"v":0,"d":"0 €"}}]
[{"$nulls":9},"(Vide)",{"v":0,"d":"0 €"},{"v":0,"d":"0 €"},{"v":0,"d":"0 €"},{"$nulls":4},{"$f":"+IF(O22>0,O22*Q22*Masque!$H$3,P22*Q22*Masque!$H$4)","v":{"v":0,"d":"0 €"}}]
[{"$nulls":9},"(Vide)",{"v":0,"d":"0 €"},{"v":0,"d":"0 €"},{"v":0,"d":"0 €"},{"$nulls":4},{"$f":"+IF(O23>0,O23*Q23*Masque!$H$3,P23*Q23*Masque!$H$4)","v":{"v":0,"d":"0 €"}}]
[{"$nulls":9},"(Vide)",{"v":0,"d":"0 €"},{"v":0,"d":"0 €"},{"v":0,"d":"0 €"},{"$nulls":4},{"$f":"+IF(O24>0,O24*Q24*Masque!$H$3,P24*Q24*Masque!$H$4)","v":{"v":0,"d":"0 €"}}]
[{"$nulls":9},"(Vide)",{"v":0,"d":"0 €"},{"v":0,"d":"0 €"},{"v":0,"d":"0 €"},{"$nulls":4},{"$f":"+IF(O25>0,O25*Q25*Masque!$H$3,P25*Q25*Masque!$H$4)","v":{"v":0,"d":"0 €"}}]
[{"$nulls":9},"(Vide)",{"v":0,"d":"0 €"},{"v":0,"d":"0 €"},{"v":0,"d":"0 €"},{"$nulls":4},{"$f":"+IF(O26>0,O26*Q26*Masque!$H$3,P26*Q26*Masque!$H$4)","v":{"v":0,"d":"0 €"}}]
[{"$nulls":9},"(Vide)",{"v":0,"d":"0 €"},{"v":0,"d":"0 €"},{"v":0,"d":"0 €"},{"$nulls":4},{"$f":"+IF(O27>0,O27*Q27*Masque!$H$3,P27*Q27*Masque!$H$4)","v":{"v":0,"d":"0 €"}}]
[{"$nulls":9},"(Vide)",{"v":0,"d":"0 €"},{"v":0,"d":"0 €"},{"v":0,"d":"0 €"},{"$nulls":4},{"$f":"+IF(O28>0,O28*Q28*Masque!$H$3,P28*Q28*Masque!$H$4)","v":{"v":0,"d":"0 €"}}]
[{"$nulls":9},"(Vide)",{"v":0,"d":"0 €"},{"$f":"VLOOKUP(K29,BrutCharges,2,0)","v":{"v":0,"d":"0 €"}},{"$f":"K29+L29","v":{"v":0,"d":"0 €"}},{"$nulls":4},{"$f":"+IF(O29>0,O29*Q29*Masque!$H$3,P29*Q29*Masque!$H$4)","v":{"v":0,"d":"0 €"}}]
[{"$nulls":6},"Total",{"$f":"SUM(H10:H29)","v":{"v":0,"d":"0 €"}},{"$f":"SUM(I10:I29)","v":{"v":0,"d":"0 €"}},null,{"$f":"SUM(K10:K29)","v":{"v":0,"d":"0 €"}},{"$f":"SUM(L10:L29)","v":{"v":0,"d":"0 €"}},{"$f":"SUM(M10:M29)","v":{"v":0,"d":"0 €"}},null,{"$f":"SUM(O10:O29)","v":0},{"$f":"SUM(P10:P29)","v":0},null,{"$f":"SUM(R10:R29)","v":{"v":0,"d":"0 €"}},null,"Total",{"$f":"SUM(U10:U29)*14","v":0},null,null,{"$f":"SUM(X10:X29)","v":0},null,{"$f":"SUM(Z10:Z29)","v":0},{"$f":"SUM(AA10:AA29)","v":0}]
[]
["Plateau 2 \n(Concert)",null,"Date","Informations personnelles",{"$nulls":3},"Factures",null,"Salaires",{"$nulls":3},"Détails","Hôtel",{"$nulls":5},"Repas","Transport",{"$nulls":3},"Location"]
[{"$nulls":3},"Nom","Prénom","Instrument","Fonction","Cession","Frais de Prod","Net","Brut","Charges","Total","Coord     ","S","T","Nuits","Total Nuitées","Date\narrivée","Date\nDépart","Ticket\nResto","Date\narrivée","Date\nDépart","Coûts de transport","Trajet","Location Son","Location Studio"]
[{"$nulls":9},"(Vide)",{"$f":"VLOOKUP(J34,NetBrut,2,0)","v":{"v":0,"d":"0 €"}},{"$f":"VLOOKUP(K34,BrutCharges,2,0)","v":{"v":0,"d":"0 €"}},{"$f":"K34+L34","v":{"v":0,"d":"0 €"}},{"$nulls":4},{"$f":"+IF(O34>0,O34*Q34*Masque!$H$3,P34*Q34*Masque!$H$4)","v":{"v":0,"d":"0 €"}}]
[{"$nulls":9},"(Vide)",{"v":0,"d":"0 €"},{"v":0,"d":"0 €"},{"$f":"K35+L35","v":{"v":0,"d":"0 €"}},{"$nulls":4},{"$f":"+IF(O35>0,O35*Q35*Masque!$H$3,P35*Q35*Masque!$H$4)","v":{"v":0,"d":"0 €"}}]
[{"$nulls":9},"(Vide)",{"v":0,"d":"0 €"},{"v":0,"d":"0 €"},{"v":0,"d":"0 €"},{"$nulls":4},{"$f":"+IF(O36>0,O36*Q36*Masque!$H$3,P36*Q36*Masque!$H$4)","v":{"v":0,"d":"0 €"}}]
[{"$nulls":9},"(Vide)",{"v":0,"d":"0 €"},{"v":0,"d":"0 €"},{"v":0,"d":"0 €"},{"$nulls":4},{"$f":"+IF(O37>0,O37*Q37*Masque!$H$3,P37*Q37*Masque!$H$4)","v":{"v":0,"d":"0 €"}}]
[{"$nulls":9},"(Vide)",{"v":0,"d":"0 €"},{"v":0,"d":"0 €"},{"v":0,"d":"0 €"},{"$nulls":4},{"$f":"+IF(O38>0,O38*Q38*Masque!$H$3,P38*Q38*Masque!$H$4)","v":{"v":0,"d":"0 €"}}]
[{"$nulls":9},"(Vide)",{"v":0,"d":"0 €"},{"v":0,"d":"0 €"},{"v":0,"d":"0 €"},{"$nulls":4},{"$f":"+IF(O39>0,O39*Q39*Masque!$H$3,P39*Q39*Masque!$H$4)","v":{"v":0,"d":"0 €"}}]
[{"$nulls":9},"(Vide)",{"v":0,"d":"0 €"},{"v":0,"d":"0 €"},{"v":0,"d":"0 €"},{"$nulls":4},{"$f":"+IF(O40>0,O40*Q40*Masque!$H$3,P40*Q40*Masque!$H$4)","v":{"v":0,"d":"0 €"}}]
[{"$nulls":9},"(Vide)",{"v":0,"d":"0 €"},{"v":0,"d":"0 €"},{"v":0,"d":"0 €"},{"$nulls":4},{"$f":"+IF(O41>0,O41*Q41*Masque!$H$3,P41*Q41*Masque!$H$4)","v":{"v":0,"d":"0 €"}}]
[{"$nulls":9},"(Vide)",{"v":0,"d":"0 €"},{"v":0,"d":"0 €"},{"v":0,"d":"0 €"},{"$nulls":4},{"$f":"+IF(O42>0,O42*Q42*Masque!$H$3,P42*Q42*Masque!$H$4)","v":{"v":0,"d":"0 €"}}]
[{"$nulls":9},"(Vide)",{"v":0,"d":"0 €"},{"v":0,"d":"0 €"},{"v":0,"d":"0 €"},{"$nulls":4},{"$f":"+IF(O43>0,O43*Q43*Masque!$H$3,P43*Q43*Masque!$H$4)","v":{"v":0,"d":"0 €"}}]
[{"$nulls":9},"(Vide)",{"v":0,"d":"0 €"},{"v":0,"d":"0 €"},{"v":0,"d":"0 €"},{"$nulls":4},{"$f":"+IF(O44>0,O44*Q44*Masque!$H$3,P44*Q44*Masque!$H$4)","v":{"v":0,"d":"0 €"}}]
[{"$nulls":9},"(Vide)",{"v":0,"d":"0 €"},{"v":0,"d":"0 €"},{"v":0,"d":"0 €"},{"$nulls":4},{"$f":"+IF(O45>0,O45*Q45*Masque!$H$3,P45*Q45*Masque!$H$4)","v":{"v":0,"d":"0 €"}}]
[{"$nulls":9},"(Vide)",{"v":0,"d":"0 €"},{"v":0,"d":"0 €"},{"v":0,"d":"0 €"},{"$nulls":4},{"$f":"+IF(O46>0,O46*Q46*Masque!$H$3,P46*Q46*Masque!$H$4)","v":{"v":0,"d":"0 €"}}]
[{"$nulls":9},"(Vide)",{"v":0,"d":"0 €"},{"v":0,"d":"0 €"},{"v":0,"d":"0 €"},{"$nulls":4},{"$f":"+IF(O47>0,O47*Q47*Masque!$H$3,P47*Q47*Masque!$H$4)","v":{"v":0,"d":"0 €"}}]
[{"$nulls":9},"(Vide)",{"v":0,"d":"0 €"},{"v":0,"d":"0 €"},{"v":0,"d":"0 €"},{"$nulls":4},{"$f":"+IF(O48>0,O48*Q48*Masque!$H$3,P48*Q48*Masque!$H$4)","v":{"v":0,"d":"0 €"}}]
[{"$nulls":9},"(Vide)",{"v":0,"d":"0 €"},{"v":0,"d":"0 €"},{"v":0,"d":"0 €"},{"$nulls":4},{"$f":"+IF(O49>0,O49*Q49*Masque!$H$3,P49*Q49*Masque!$H$4)","v":{"v":0,"d":"0 €"}}]
[{"$nulls":9},"(Vide)",{"v":0,"d":"0 €"},{"v":0,"d":"0 €"},{"v":0,"d":"0 €"},{"$nulls":4},{"$f":"+IF(O50>0,O50*Q50*Masque!$H$3,P50*Q50*Masque!$H$4)","v":{"v":0,"d":"0 €"}}]
[{"$nulls":9},"(Vide)",{"v":0,"d":"0 €"},{"v":0,"d":"0 €"},{"v":0,"d":"0 €"},{"$nulls":4},{"$f":"+IF(O51>0,O51*Q51*Masque!$H$3,P51*Q51*Masque!$H$4)","v":{"v":0,"d":"0 €"}}]
[{"$nulls":9},"(Vide)",{"v":0,"d":"0 €"},{"v":0,"d":"0 €"},{"v":0,"d":"0 €"},{"$nulls":4},{"$f":"+IF(O52>0,O52*Q52*Masque!$H$3,P52*Q52*Masque!$H$4)","v":{"v":0,"d":"0 €"}}]
[{"$nulls":9},"(Vide)",{"v":0,"d":"0 €"},{"v":0,"d":"0 €"},{"v":0,"d":"0 €"},{"$nulls":4},{"$f":"+IF(O53>0,O53*Q53*Masque!$H$3,P53*Q53*Masque!$H$4)","v":{"v":0,"d":"0 €"}}]
[{"$nulls":6},"Total",{"$f":"SUM(H34:H53)","v":{"v":0,"d":"0 €"}},{"$f":"SUM(I34:I53)","v":{"v":0,"d":"0 €"}},null,{"$f":"SUM(K34:K53)","v":{"v":0,"d":"0 €"}},{"$f":"SUM(L34:L53)","v":{"v":0,"d":"0 €"}},{"$f":"SUM(M34:M53)","v":{"v":0,"d":"0 €"}},null,{"$f":"SUM(O34:O53)","v":0},{"$f":"SUM(P34:P53)","v":0},null,{"$f":"SUM(R34:R53)","v":{"v":0,"d":"0 €"}},null,"Total",{"$f":"SUM(U34:U53)*14","v":0},null,null,{"$f":"SUM(X34:X53)","v":0},null,{"$f":"SUM(Z34:Z53)","v":0},{"$f":"SUM(AA34:AA53)","v":0}]
[]
["Plateau 1 \n(Résidence)",null,"Date","Informations personnelles",{"$nulls":3},"Factures",null,"Salaires",{"$nulls":3},"Détails","Hôtel",{"$nulls":5},"Repas","Transport",{"$nulls":3},"Location"]
[{"$nulls":3},"Nom","Prénom","Instrument","Fonction","Cession","Frais de Prod","Net","Brut","Charges","Total","Coord     ","S","T","Nuits","Total Nuitées","Date\narrivée","Date\nDépart","Ticket\nResto","Date\narrivée","Date\nDépart","Coûts de transport","Trajet","Location Son","Location Studio"]
[{"$nulls":9},"(Vide)",{"$f":"VLOOKUP(J58,NetBrut,2,0)","v":{"v":0,"d":"0 €"}},{"$f":"VLOOKUP(K58,BrutCharges,2,0)","v":{"v":0,"d":"0 €"}},{"$f":"K58+L58","v":{"v":0,"d":"0 €"}},{"$nulls":4},{"$f":"+IF(O58>0,O58*Q58*Masque!$H$3,P58*Q58*Masque!$H$4)","v":{"v":0,"d":"0 €"}}]
[{"$nulls":9},"(Vide)",{"v":0,"d":"0 €"},{"v":0,"d":"0 €"},{"$f":"K59+L59","v":{"v":0,"d":"0 €"}},{"$nulls":4},{"$f":"+IF(O59>0,O59*Q59*Masque!$H$3,P59*Q59*Masque!$H$4)","v":{"v":0,"d":"0 €"}}]
[{"$nulls":9},"(Vide)",{"v":0,"d":"0 €"},{"v":0,"d":"0 €"},{"v":0,"d":"0 €"},{"$nulls":4},{"$f":"+IF(O60>0,O60*Q60*Masque!$H$3,P60*Q60*Masque!$H$4)","v":{"v":0,"d":"0 €"}}]
[{"$nulls":9},"(Vide)",{"v":0,"d":"0 €"},{"v":0,"d":"0 €"},{"v":0,"d":"0 €"},{"$nulls":4},{"$f":"+IF(O61>0,O61*Q61*Masque!$H$3,P61*Q61*Masque!$H$4)","v":{"v":0,"d":"0 €"}}]
[{"$nulls":9},"(Vide)",{"v":0,"d":"0 €"},{"v":0,"d":"0 €"},{"v":0,"d":"0 €"},{"$nulls":4},{"$f":"+IF(O62>0,O62*Q62*Masque!$H$3,P62*Q62*Masque!$H$4)","v":{"v":0,"d":"0 €"}}]
[{"$nulls":9},"(Vide)",{"v":0,"d":"0 €"},{"v":0,"d":"0 €"},{"v":0,"d":"0 €"},{"$nulls":4},{"$f":"+IF(O63>0,O63*Q63*Masque!$H$3,P63*Q63*Masque!$H$4)","v":{"v":0,"d":"0 €"}}]
[{"$nulls":9},"(Vide)",{"v":0,"d":"0 €"},{"v":0,"d":"0 €"},{"v":0,"d":"0 €"},{"$nulls":4},{"$f":"+IF(O64>0,O64*Q64*Masque!$H$3,P64*Q64*Masque!$H$4)","v":{"v":0,"d":"0 €"}}]
[{"$nulls":9},"(Vide)",{"v":0,"d":"0 €"},{"v":0,"d":"0 €"},{"v":0,"d":"0 €"},{"$nulls":4},{"$f":"+IF(O65>0,O65*Q65*Masque!$H$3,P65*Q65*Masque!$H$4)","v":{"v":0,"d":"0 €"}}]
[{"$nulls":9},"(Vide)",{"v":0,"d":"0 €"},{"v":0,"d":"0 €"},{"v":0,"d":"0 €"},{"$nulls":4},{"$f":"+IF(O66>0,O66*Q66*Masque!$H$3,P66*Q66*Masque!$H$4)","v":{"v":0,"d":"0 €"}}]
[{"$nulls":9},"(Vide)",{"v":0,"d":"0 €"},{"v":0,"d":"0 €"},{"v":0,"d":"0 €"},{"$nulls":4},{"$f":"+IF(O67>0,O67*Q67*Masque!$H$3,P67*Q67*Masque!$H$4)","v":{"v":0,"d":"0 €"}}]
[{"$nulls":9},"(Vide)",{"v":0,"d":"0 €"},{"v":0,"d":"0 €"},{"v":0,"d":"0 €"},{"$nulls":4},{"$f":"+IF(O68>0,O68*Q68*Masque!$H$3,P68*Q68*Masque!$H$4)","v":{"v":0,"d":"0 €"}}]
[{"$nulls":9},"(Vide)",{"v":0,"d":"0 €"},{"v":0,"d":"0 €"},{"v":0,"d":"0 €"},{"$nulls":4},{"$f":"+IF(O69>0,O69*Q69*Masque!$H$3,P69*Q69*Masque!$H$4)","v":{"v":0,"d":"0 €"}}]
[{"$nulls":9},"(Vide)",{"v":0,"d":"0 €"},{"v":0,"d":"0 €"},{"v":0,"d":"0 €"},{"$nulls":4},{"$f":"+IF(O70>0,O70*Q70*Masque!$H$3,P70*Q70*Masque!$H$4)","v":{"v":0,"d":"0 €"}}]
[{"$nulls":9},"(Vide)",{"v":0,"d":"0 €"},{"v":0,"d":"0 €"},{"v":0,"d":"0 €"},{"$nulls":4},{"$f":"+IF(O71>0,O71*Q71*Masque!$H$3,P71*Q71*Masque!$H$4)","v":{"v":0,"d":"0 €"}}]
[{"$nulls":9},"(Vide)",{"v":0,"d":"0 €"},{"v":0,"d":"0 €"},{"v":0,"d":"0 €"},{"$nulls":4},{"$f":"+IF(O72>0,O72*Q72*Masque!$H$3,P72*Q72*Masque!$H$4)","v":{"v":0,"d":"0 €"}}]
[{"$nulls":9},"(Vide)",{"v":0,"d":"0 €"},{"v":0,"d":"0 €"},{"v":0,"d":"0 €"},{"$nulls":4},{"$f":"+IF(O73>0,O73*Q73*Masque!$H$3,P73*Q73*Masque!$H$4)","v":{"v":0,"d":"0 €"}}]
[{"$nulls":9},"(Vide)",{"v":0,"d":"0 €"},{"v":0,"d":"0 €"},{"v":0,"d":"0 €"},{"$nulls":4},{"$f":"+IF(O74>0,O74*Q74*Masque!$H$3,P74*Q74*Masque!$H$4)","v":{"v":0,"d":"0 €"}}]
[{"$nulls":9},"(Vide)",{"v":0,"d":"0 €"},{"v":0,"d":"0 €"},{"v":0,"d":"0 €"},{"$nulls":4},{"$f":"+IF(O75>0,O75*Q75*Masque!$H$3,P75*Q75*Masque!$H$4)","v":{"v":0,"d":"0 €"}}]
[{"$nulls":9},"(Vide)",{"v":0,"d":"0 €"},{"v":0,"d":"0 €"},{"v":0,"d":"0 €"},{"$nulls":4},{"$f":"+IF(O76>0,O76*Q76*Masque!$H$3,P76*Q76*Masque!$H$4)","v":{"v":0,"d":"0 €"}}]
[{"$nulls":9},"(Vide)",{"v":0,"d":"0 €"},{"v":0,"d":"0 €"},{"v":0,"d":"0 €"},{"$nulls":4},{"$f":"+IF(O77>0,O77*Q77*Masque!$H$3,P77*Q77*Masque!$H$4)","v":{"v":0,"d":"0 €"}}]
[{"$nulls":6},"Total",{"$f":"SUM(H58:H77)","v":{"v":0,"d":"0 €"}},{"$f":"SUM(I58:I77)","v":{"v":0,"d":"0 €"}},null,{"$f":"SUM(K58:K77)","v":{"v":0,"d":"0 €"}},{"$f":"SUM(L58:L77)","v":{"v":0,"d":"0 €"}},{"$f":"SUM(M58:M77)","v":{"v":0,"d":"0 €"}},null,{"$f":"SUM(O58:O77)","v":0},{"$f":"SUM(P58:P77)","v":0},null,{"$f":"SUM(R58:R77)","v":{"v":0,"d":"0 €"}},null,"Total",{"$f":"SUM(U58:U77)*14","v":0},null,null,{"$f":"SUM(X58:X77)","v":0},null,{"$f":"SUM(Z58:Z77)","v":0},{"$f":"SUM(AA58:AA77)","v":0}]
[]
["Plateau 2 \n(Résidence)",null,"Date","Informations personnelles",{"$nulls":3},"Factures",null,"Salaires",{"$nulls":3},"Détails","Hôtel",{"$nulls":5},"Repas","Transport",{"$nulls":3},"Location"]
[{"$nulls":3},"Nom","Prénom","Instrument","Fonction","Cession","Frais de Prod","Net","Brut","Charges","Total","Coord     ","S","T","Nuits","Total Nuitées","Date\narrivée","Date\nDépart","Ticket\nResto","Date\narrivée","Date\nDépart","Coûts de transport","Trajet","Location Son","Location Studio"]
[{"$nulls":9},"(Vide)",{"$f":"VLOOKUP(J82,NetBrut,2,0)","v":{"v":0,"d":"0 €"}},{"$f":"VLOOKUP(K82,BrutCharges,2,0)","v":{"v":0,"d":"0 €"}},{"$f":"K82+L82","v":{"v":0,"d":"0 €"}},{"$nulls":4},{"$f":"+IF(O82>0,O82*Q82*Masque!$H$3,P82*Q82*Masque!$H$4)","v":{"v":0,"d":"0 €"}}]
[{"$nulls":9},"(Vide)",{"v":0,"d":"0 €"},{"v":0,"d":"0 €"},{"$f":"K83+L83","v":{"v":0,"d":"0 €"}},{"$nulls":4},{"$f":"+IF(O83>0,O83*Q83*Masque!$H$3,P83*Q83*Masque!$H$4)","v":{"v":0,"d":"0 €"}}]
[{"$nulls":9},"(Vide)",{"v":0,"d":"0 €"},{"v":0,"d":"0 €"},{"v":0,"d":"0 €"},{"$nulls":4},{"$f":"+IF(O84>0,O84*Q84*Masque!$H$3,P84*Q84*Masque!$H$4)","v":{"v":0,"d":"0 €"}}]
[{"$nulls":9},"(Vide)",{"v":0,"d":"0 €"},{"v":0,"d":"0 €"},{"v":0,"d":"0 €"},{"$nulls":4},{"$f":"+IF(O85>0,O85*Q85*Masque!$H$3,P85*Q85*Masque!$H$4)","v":{"v":0,"d":"0 €"}}]
[{"$nulls":9},"(Vide)",{"v":0,"d":"0 €"},{"v":0,"d":"0 €"},{"v":0,"d":"0 €"},{"$nulls":4},{"$f":"+IF(O86>0,O86*Q86*Masque!$H$3,P86*Q86*Masque!$H$4)","v":{"v":0,"d":"0 €"}}]
[{"$nulls":9},"(Vide)",{"v":0,"d":"0 €"},{"v":0,"d":"0 €"},{"v":0,"d":"0 €"},{"$nulls":4},{"$f":"+IF(O87>0,O87*Q87*Masque!$H$3,P87*Q87*Masque!$H$4)","v":{"v":0,"d":"0 €"}}]
[{"$nulls":9},"(Vide)",{"v":0,"d":"0 €"},{"v":0,"d":"0 €"},{"v":0,"d":"0 €"},{"$nulls":4},{"$f":"+IF(O88>0,O88*Q88*Masque!$H$3,P88*Q88*Masque!$H$4)","v":{"v":0,"d":"0 €"}}]
[{"$nulls":9},"(Vide)",{"v":0,"d":"0 €"},{"v":0,"d":"0 €"},{"v":0,"d":"0 €"},{"$nulls":4},{"$f":"+IF(O89>0,O89*Q89*Masque!$H$3,P89*Q89*Masque!$H$4)","v":{"v":0,"d":"0 €"}}]
[{"$nulls":9},"(Vide)",{"v":0,"d":"0 €"},{"v":0,"d":"0 €"},{"v":0,"d":"0 €"},{"$nulls":4},{"$f":"+IF(O90>0,O90*Q90*Masque!$H$3,P90*Q90*Masque!$H$4)","v":{"v":0,"d":"0 €"}}]
[{"$nulls":9},"(Vide)",{"v":0,"d":"0 €"},{"v":0,"d":"0 €"},{"v":0,"d":"0 €"},{"$nulls":4},{"$f":"+IF(O91>0,O91*Q91*Masque!$H$3,P91*Q91*Masque!$H$4)","v":{"v":0,"d":"0 €"}}]
[{"$nulls":9},"(Vide)",{"v":0,"d":"0 €"},{"v":0,"d":"0 €"},{"v":0,"d":"0 €"},{"$nulls":4},{"$f":"+IF(O92>0,O92*Q92*Masque!$H$3,P92*Q92*Masque!$H$4)","v":{"v":0,"d":"0 €"}}]
[{"$nulls":9},"(Vide)",{"v":0,"d":"0 €"},{"v":0,"d":"0 €"},{"v":0,"d":"0 €"},{"$nulls":4},{"$f":"+IF(O93>0,O93*Q93*Masque!$H$3,P93*Q93*Masque!$H$4)","v":{"v":0,"d":"0 €"}}]
[{"$nulls":9},"(Vide)",{"v":0,"d":"0 €"},{"v":0,"d":"0 €"},{"v":0,"d":"0 €"},{"$nulls":4},{"$f":"+IF(O94>0,O94*Q94*Masque!$H$3,P94*Q94*Masque!$H$4)","v":{"v":0,"d":"0 €"}}]
[{"$nulls":9},"(Vide)",{"v":0,"d":"0 €"},{"v":0,"d":"0 €"},{"v":0,"d":"0 €"},{"$nulls":4},{"$f":"+IF(O95>0,O95*Q95*Masque!$H$3,P95*Q95*Masque!$H$4)","v":{"v":0,"d":"0 €"}}]
[{"$nulls":9},"(Vide)",{"v":0,"d":"0 €"},{"v":0,"d":"0 €"},{"v":0,"d":"0 €"},{"$nulls":4},{"$f":"+IF(O96>0,O96*Q96*Masque!$H$3,P96*Q96*Masque!$H$4)","v":{"v":0,"d":"0 €"}}]
[{"$nulls":9},"(Vide)",{"v":0,"d":"0 €"},{"v":0,"d":"0 €"},{"v":0,"d":"0 €"},{"$nulls":4},{"$f":"+IF(O97>0,O97*Q97*Masque!$H$3,P97*Q97*Masque!$H$4)","v":{"v":0,"d":"0 €"}}]
[{"$nulls":9},"(Vide)",{"v":0,"d":"0 €"},{"v":0,"d":"0 €"},{"v":0,"d":"0 €"},{"$nulls":4},{"$f":"+IF(O98>0,O98*Q98*Masque!$H$3,P98*Q98*Masque!$H$4)","v":{"v":0,"d":"0 €"}}]
[{"$nulls":9},"(Vide)",{"v":0,"d":"0 €"},{"v":0,"d":"0 €"},{"v":0,"d":"0 €"},{"$nulls":4},{"$f":"+IF(O99>0,O99*Q99*Masque!$H$3,P99*Q99*Masque!$H$4)","v":{"v":0,"d":"0 €"}}]
[{"$nulls":9},"(Vide)",{"v":0,"d":"0 €"},{"v":0,"d":"0 €"},{"v":0,"d":"0 €"},{"$nulls":4},{"$f":"+IF(O100>0,O100*Q100*Masque!$H$3,P100*Q100*Masque!$H$4)","v":{"v":0,"d":"0 €"}}]
[{"$nulls":9},"(Vide)",{"v":0,"d":"0 €"},{"v":0,"d":"0 €"},{"v":0,"d":"0 €"},{"$nulls":4},{"$f":"+IF(O101>0,O101*Q101*Masque!$H$3,P101*Q101*Masque!$H$4)","v":{"v":0,"d":"0 €"}}]
[{"$nulls":6},"Total",{"$f":"SUM(H82:H101)","v":{"v":0,"d":"0 €"}},{"$f":"SUM(I82:I101)","v":{"v":0,"d":"0 €"}},null,{"$f":"SUM(K82:K101)","v":{"v":0,"d":"0 €"}},{"$f":"SUM(L82:L101)","v":{"v":0,"d":"0 €"}},{"$f":"SUM(M82:M101)","v":{"v":0,"d":"0 €"}},null,{"$f":"SUM(O82:O101)","v":0},{"$f":"SUM(P82:P101)","v":0},null,{"$f":"SUM(R82:R101)","v":{"v":0,"d":"0 €"}},null,"Total",{"$f":"SUM(U82:U101)*14","v":0},null,null,{"$f":"SUM(X82:X101)","v":0},null,{"$f":"SUM(Z82:Z101)","v":0},{"$f":"SUM(AA82:AA101)","v":0}]
[]
["Techniciens Plateau 1",null,"Date","Informations personnelles",{"$nulls":3},"Factures",null,"Salaires",{"$nulls":3},"Détails","Hôtel",{"$nulls":5},"Repas","Transport",{"$nulls":3},"Location"]
[{"$nulls":3},"Nom","Prénom","Instrument","Fonction","Facture","Frais de Prod","Net","Brut","Charges","Total","Coord     ","S","T","Nuits","Total Nuitées","Date\narrivée","Date\nDépart","Ticket\nResto","Date\narrivée","Date\nDépart","Coûts de transport","Trajet","Location Son","Location Studio"]
[{"$nulls":9},"(Vide)",{"$f":"VLOOKUP(J106,NetBrut,2,0)","v":{"v":0,"d":"0 €"}},{"$f":"VLOOKUP(K106,BrutCharges,2,0)","v":{"v":0,"d":"0 €"}},{"v":0,"d":"0 €"},{"$nulls":4},{"$f":"+IF(O106>0,O106*Q106*Masque!$H$3,P106*Q106*Masque!$H$4)","v":{"v":0,"d":"0 €"}}]
[{"$nulls":9},"(Vide)",{"v":0,"d":"0 €"},{"v":0,"d":"0 €"},{"v":0,"d":"0 €"},{"$nulls":4},{"$f":"+IF(O107>0,O107*Q107*Masque!$H$3,P107*Q107*Masque!$H$4)","v":{"v":0,"d":"0 €"}}]
[{"$nulls":9},"(Vide)",{"v":0,"d":"0 €"},{"v":0,"d":"0 €"},{"v":0,"d":"0 €"},{"$nulls":4},{"$f":"+IF(O108>0,O108*Q108*Masque!$H$3,P108*Q108*Masque!$H$4)","v":{"v":0,"d":"0 €"}}]
[{"$nulls":9},"(Vide)",{"v":0,"d":"0 €"},{"v":0,"d":"0 €"},{"v":0,"d":"0 €"},{"$nulls":4},{"$f":"+IF(O109>0,O109*Q109*Masque!$H$3,P109*Q109*Masque!$H$4)","v":{"v":0,"d":"0 €"}}]
[{"$nulls":9},"(Vide)",{"v":0,"d":"0 €"},{"v":0,"d":"0 €"},{"v":0,"d":"0 €"},{"$nulls":4},{"$f":"+IF(O110>0,O110*Q110*Masque!$H$3,P110*Q110*Masque!$H$4)","v":{"v":0,"d":"0 €"}}]
[{"$nulls":6},"Total",{"$f":"SUM(H106:H110)","v":{"v":0,"d":"0 €"}},{"$f":"SUM(I106:I110)","v":{"v":0,"d":"0 €"}},null,{"$f":"SUM(K106:K110)","v":{"v":0,"d":"0 €"}},{"$f":"SUM(L106:L110)","v":{"v":0,"d":"0 €"}},{"$f":"SUM(M106:M110)","v":{"v":0,"d":"0 €"}},null,{"$f":"SUM(O106:O110)","v":0},{"$f":"SUM(P106:P110)","v":0},null,{"$f":"SUM(R106:R110)","v":{"v":0,"d":"0 €"}},null,"Total",{"$f":"SUM(U106:U110)*14","v":0},null,null,{"$f":"SUM(X106:X110)","v":0},null,{"$f":"SUM(Z106:Z110)","v":0},{"$f":"SUM(AA106:AA110)","v":0}]
[]
["Techniciens Plateau 2",null,"Date","Informations personnelles",{"$nulls":3},"Factures",null,"Salaires",{"$nulls":3},"Détails","Hôtel",{"$nulls":5},"Repas","Transport",{"$nulls":3},"Location"]
[{"$nulls":3},"Nom","Prénom","Instrument","Fonction","Facture","Frais de Prod","Net","Brut","Charges","Total","Coord     ","S","T","Nuits","Total Nuitées","Date\narrivée","Date\nDépart","Ticket\nResto","Date\narrivée","Date\nDépart","Coûts de transport","Trajet","Location Son","Location Studio"]
[{"$nulls":9},"(Vide)",{"$f":"VLOOKUP(J115,NetBrut,2,0)","v":{"v":0,"d":"0 €"}},{"$f":"VLOOKUP(K115,BrutCharges,2,0)","v":{"v":0,"d":"0 €"}},{"$f":"K115+L115","v":{"v":0,"d":"0 €"}},{"$nulls":4},{"$f":"+IF(O115>0,O115*Q115*Masque!$H$3,P115*Q115*Masque!$H$4)","v":{"v":0,"d":"0 €"}}]
[{"$nulls":9},"(Vide)",{"v":0,"d":"0 €"},{"v":0,"d":"0 €"},{"v":0,"d":"0 €"},{"$nulls":4},{"$f":"+IF(O116>0,O116*Q116*Masque!$H$3,P116*Q116*Masque!$H$4)","v":{"v":0,"d":"0 €"}}]
[{"$nulls":9},"(Vide)",{"v":0,"d":"0 €"},{"v":0,"d":"0 €"},{"v":0,"d":"0 €"},{"$nulls":4},{"$f":"+IF(O117>0,O117*Q117*Masque!$H$3,P117*Q117*Masque!$H$4)","v":{"v":0,"d":"0 €"}}]
[{"$nulls":9},"(Vide)",{"v":0,"d":"0 €"},{"v":0,"d":"0 €"},{"v":0,"d":"0 €"},{"$nulls":4},{"$f":"+IF(O118>0,O118*Q118*Masque!$H$3,P118*Q118*Masque!$H$4)","v":{"v":0,"d":"0 €"}}]
[{"$nulls":9},"(Vide)",{"v":0,"d":"0 €"},{"v":0,"d":"0 €"},{"v":0,"d":"0 €"},{"$nulls":4},{"$f":"+IF(O119>0,O119*Q119*Masque!$H$3,P119*Q119*Masque!$H$4)","v":{"v":0,"d":"0 €"}}]
[{"$nulls":6},"Total",{"$f":"SUM(H115:H119)","v":{"v":0,"d":"0 €"}},{"$f":"SUM(I115:I119)","v":{"v":0,"d":"0 €"}},null,{"$f":"SUM(K115:K119)","v":{"v":0,"d":"0 €"}},{"$f":"SUM(L115:L119)","v":{"v":0,"d":"0 €"}},{"$f":"SUM(M115:M119)","v":{"v":0,"d":"0 €"}},null,{"$f":"SUM(O115:O119)","v":0},{"$f":"SUM(P115:P119)","v":0},null,{"$f":"SUM(R115:R119)","v":{"v":0,"d":"0 €"}},null,"Total",{"$f":"SUM(U115:U119)*14","v":0},null,null,{"$f":"SUM(X115:X119)","v":0},null,{"$f":"SUM(Z115:Z119)","v":0},{"$f":"SUM(AA115:AA119)","v":0}]
[]
["Techniciens Africolor",null,"Date","Informations personnelles",{"$nulls":3},"Factures",null,"Salaires",{"$nulls":3},"Détails","Hôtel",{"$nulls":5},"Repas","Transport",{"$nulls":3},"Location"]
[{"$nulls":3},"Nom","Prénom","Instrument","Fonction","Facture","Frais de Prod","Net","Brut","Charges","Total","Coord     ","S","T","Nuits","Total Nuitées","Date\narrivée","Date\nDépart","Ticket\nResto","Date\narrivée","Date\nDépart","Coûts de transport","Trajet","Location Son","Location Studio"]
[{"$nulls":9},"(Vide)",{"v":0,"d":"0 €"},{"v":0,"d":"0 €"},{"v":0,"d":"0 €"},{"$nulls":4},{"$f":"+IF(O124>0,O124*Q124*Masque!$H$3,P124*Q124*Masque!$H$4)","v":{"v":0,"d":"0 €"}}]
[{"$nulls":9},"(Vide)",{"v":0,"d":"0 €"},{"v":0,"d":"0 €"},{"v":0,"d":"0 €"},{"$nulls":4},{"$f":"+IF(O125>0,O125*Q125*Masque!$H$3,P125*Q125*Masque!$H$4)","v":{"v":0,"d":"0 €"}}]
[{"$nulls":9},"(Vide)",{"v":0,"d":"0 €"},{"v":0,"d":"0 €"},{"v":0,"d":"0 €"},{"$nulls":4},{"$f":"+IF(O126>0,O126*Q126*Masque!$H$3,P126*Q126*Masque!$H$4)","v":{"v":0,"d":"0 €"}}]
[{"$nulls":9},"(Vide)",{"v":0,"d":"0 €"},{"v":0,"d":"0 €"},{"v":0,"d":"0 €"},{"$nulls":4},{"$f":"+IF(O127>0,O127*Q127*Masque!$H$3,P127*Q127*Masque!$H$4)","v":{"v":0,"d":"0 €"}}]
[{"$nulls":9},"(Vide)",{"v":0,"d":"0 €"},{"v":0,"d":"0 €"},{"v":0,"d":"0 €"},{"$nulls":4},{"$f":"+IF(O128>0,O128*Q128*Masque!$H$3,P128*Q128*Masque!$H$4)","v":{"v":0,"d":"0 €"}}]
[{"$nulls":6},"Total",{"$f":"SUM(H124:H128)","v":{"v":0,"d":"0 €"}},{"$f":"SUM(I124:I128)","v":{"v":0,"d":"0 €"}},null,{"$f":"SUM(K124:K128)","v":{"v":0,"d":"0 €"}},{"$f":"SUM(L124:L128)","v":{"v":0,"d":"0 €"}},{"$f":"SUM(M124:M128)","v":{"v":0,"d":"0 €"}},null,{"$f":"SUM(O124:O128)","v":0},{"$f":"SUM(P124:P128)","v":0},null,{"$f":"SUM(R124:R128)","v":{"v":0,"d":"0 €"}},null,"Total",{"$f":"SUM(U124:U128)*14","v":0},null,null,{"$f":"SUM(X124:X128)","v":0},null,{"$f":"SUM(Z124:Z128)","v":0},{"$f":"SUM(AA124:AA128)","v":0}]
[]
["Actions Culturelles",null,"Date","Informations personnelles",{"$nulls":3},"Factures",null,"Salaires",{"$nulls":3},"Détails","Hôtel",{"$nulls":5},"Repas","Transport",{"$nulls":3},"Location"]
[{"$nulls":3},"Nom","Prénom","Instrument","Fonction","Facture","Frais de Prod","Net","Brut","Charges","Total","Coord     ","S","T","Nuits","Total Nuitées","Date\narrivée","Date\nDépart","Ticket\nResto","Date\narrivée","Date\nDépart","Coûts de transport","Trajet","Location Son","Location Studio"]
[{"$nulls":9},"(Vide)",{"v":0,"d":"0 €"},{"v":0,"d":"0 €"},{"v":0,"d":"0 €"},{"$nulls":4},{"$f":"+IF(O133>0,O133*Q133*Masque!$H$3,P133*Q133*Masque!$H$4)","v":{"v":0,"d":"0 €"}}]
[{"$nulls":9},"(Vide)",{"v":0,"d":"0 €"},{"v":0,"d":"0 €"},{"v":0,"d":"0 €"},{"$nulls":4},{"$f":"+IF(O134>0,O134*Q134*Masque!$H$3,P134*Q134*Masque!$H$4)","v":{"v":0,"d":"0 €"}}]
[{"$nulls":9},"(Vide)",{"v":0,"d":"0 €"},{"v":0,"d":"0 €"},{"v":0,"d":"0 €"},{"$nulls":4},{"$f":"+IF(O135>0,O135*Q135*Masque!$H$3,P135*Q135*Masque!$H$4)","v":{"v":0,"d":"0 €"}}]
[{"$nulls":9},"(Vide)",{"v":0,"d":"0 €"},{"v":0,"d":"0 €"},{"v":0,"d":"0 €"},{"$nulls":4},{"$f":"+IF(O136>0,O136*Q136*Masque!$H$3,P136*Q136*Masque!$H$4)","v":{"v":0,"d":"0 €"}}]
[{"$nulls":9},"(Vide)",{"$f":"VLOOKUP(J137,NetBrut,2,0)","v":{"v":0,"d":"0 €"}},{"$f":"VLOOKUP(K137,BrutCharges,2,0)","v":{"v":0,"d":"0 €"}},{"$f":"K137+L137","v":{"v":0,"d":"0 €"}},{"$nulls":4},{"$f":"+IF(O137>0,O137*Q137*Masque!$H$3,P137*Q137*Masque!$H$4)","v":{"v":0,"d":"0 €"}}]
[{"$nulls":9},"(Vide)",{"v":0,"d":"0 €"},{"v":0,"d":"0 €"},{"v":0,"d":"0 €"},{"$nulls":4},{"$f":"+IF(O138>0,O138*Q138*Masque!$H$3,P138*Q138*Masque!$H$4)","v":{"v":0,"d":"0 €"}}]
[{"$nulls":9},"(Vide)",{"v":0,"d":"0 €"},{"v":0,"d":"0 €"},{"v":0,"d":"0 €"},{"$nulls":4},{"$f":"+IF(O139>0,O139*Q139*Masque!$H$3,P139*Q139*Masque!$H$4)","v":{"v":0,"d":"0 €"}}]
[{"$nulls":9},"(Vide)",{"v":0,"d":"0 €"},{"v":0,"d":"0 €"},{"v":0,"d":"0 €"},{"$nulls":4},{"$f":"+IF(O140>0,O140*Q140*Masque!$H$3,P140*Q140*Masque!$H$4)","v":{"v":0,"d":"0 €"}}]
[{"$nulls":9},"(Vide)",{"v":0,"d":"0 €"},{"v":0,"d":"0 €"},{"v":0,"d":"0 €"},{"$nulls":4},{"$f":"+IF(O141>0,O141*Q141*Masque!$H$3,P141*Q141*Masque!$H$4)","v":{"v":0,"d":"0 €"}}]
[{"$nulls":9},"(Vide)",{"v":0,"d":"0 €"},{"v":0,"d":"0 €"},{"v":0,"d":"0 €"},{"$nulls":4},{"$f":"+IF(O142>0,O142*Q142*Masque!$H$3,P142*Q142*Masque!$H$4)","v":{"v":0,"d":"0 €"}}]
[{"$nulls":9},"(Vide)",{"v":0,"d":"0 €"},{"v":0,"d":"0 €"},{"v":0,"d":"0 €"},{"$nulls":4},{"$f":"+IF(O143>0,O143*Q143*Masque!$H$3,P143*Q143*Masque!$H$4)","v":{"v":0,"d":"0 €"}}]
[{"$nulls":9},"(Vide)",{"v":0,"d":"0 €"},{"v":0,"d":"0 €"},{"v":0,"d":"0 €"},{"$nulls":4},{"$f":"+IF(O144>0,O144*Q144*Masque!$H$3,P144*Q144*Masque!$H$4)","v":{"v":0,"d":"0 €"}}]
[{"$nulls":9},"(Vide)",{"v":0,"d":"0 €"},{"v":0,"d":"0 €"},{"v":0,"d":"0 €"},{"$nulls":4},{"$f":"+IF(O145>0,O145*Q145*Masque!$H$3,P145*Q145*Masque!$H$4)","v":{"v":0,"d":"0 €"}}]
[{"$nulls":9},"(Vide)",{"v":0,"d":"0 €"},{"v":0,"d":"0 €"},{"v":0,"d":"0 €"},{"$nulls":4},{"$f":"+IF(O146>0,O146*Q146*Masque!$H$3,P146*Q146*Masque!$H$4)","v":{"v":0,"d":"0 €"}}]
[{"$nulls":9},"(Vide)",{"v":0,"d":"0 €"},{"v":0,"d":"0 €"},{"v":0,"d":"0 €"},{"$nulls":4},{"$f":"+IF(O147>0,O147*Q147*Masque!$H$3,P147*Q147*Masque!$H$4)","v":{"v":0,"d":"0 €"}}]
[{"$nulls":9},"(Vide)",{"v":0,"d":"0 €"},{"v":0,"d":"0 €"},{"v":0,"d":"0 €"},{"$nulls":4},{"$f":"+IF(O148>0,O148*Q148*Masque!$H$3,P148*Q148*Masque!$H$4)","v":{"v":0,"d":"0 €"}}]
[{"$nulls":9},"(Vide)",{"v":0,"d":"0 €"},{"v":0,"d":"0 €"},{"v":0,"d":"0 €"},{"$nulls":4},{"$f":"+IF(O149>0,O149*Q149*Masque!$H$3,P149*Q149*Masque!$H$4)","v":{"v":0,"d":"0 €"}}]
[{"$nulls":9},"(Vide)",{"v":0,"d":"0 €"},{"v":0,"d":"0 €"},{"$f":"K150+L150","v":{"v":0,"d":"0 €"}},{"$nulls":4},{"$f":"+IF(O150>0,O150*Q150*Masque!$H$3,P150*Q150*Masque!$H$4)","v":{"v":0,"d":"0 €"}}]
[{"$nulls":9},"(Vide)",{"v":0,"d":"0 €"},{"v":0,"d":"0 €"},{"v":0,"d":"0 €"},{"$nulls":4},{"$f":"+IF(O151>0,O151*Q151*Masque!$H$3,P151*Q151*Masque!$H$4)","v":{"v":0,"d":"0 €"}}]
[{"$nulls":9},"(Vide)",{"v":0,"d":"0 €"},{"v":0,"d":"0 €"},{"v":0,"d":"0 €"},{"$nulls":4},{"$f":"+IF(O152>0,O152*Q152*Masque!$H$3,P152*Q152*Masque!$H$4)","v":{"v":0,"d":"0 €"}}]
[{"$nulls":9},"(Vide)",{"v":0,"d":"0 €"},{"v":0,"d":"0 €"},{"v":0,"d":"0 €"},{"$nulls":4},{"$f":"+IF(O153>0,O153*Q153*Masque!$H$3,P153*Q153*Masque!$H$4)","v":{"v":0,"d":"0 €"}}]
[{"$nulls":9},"(Vide)",{"v":0,"d":"0 €"},{"v":0,"d":"0 €"},{"v":0,"d":"0 €"},{"$nulls":4},{"$f":"+IF(O154>0,O154*Q154*Masque!$H$3,P154*Q154*Masque!$H$4)","v":{"v":0,"d":"0 €"}}]
[{"$nulls":9},"(Vide)",{"v":0,"d":"0 €"},{"v":0,"d":"0 €"},{"v":0,"d":"0 €"},{"$nulls":4},{"$f":"+IF(O155>0,O155*Q155*Masque!$H$3,P155*Q155*Masque!$H$4)","v":{"v":0,"d":"0 €"}}]
[{"$nulls":9},"(Vide)",{"v":0,"d":"0 €"},{"v":0,"d":"0 €"},{"v":0,"d":"0 €"},{"$nulls":4},{"$f":"+IF(O156>0,O156*Q156*Masque!$H$3,P156*Q156*Masque!$H$4)","v":{"v":0,"d":"0 €"}}]
[{"$nulls":9},"(Vide)",{"v":0,"d":"0 €"},{"v":0,"d":"0 €"},{"v":0,"d":"0 €"},{"$nulls":4},{"$f":"+IF(O157>0,O157*Q157*Masque!$H$3,P157*Q157*Masque!$H$4)","v":{"v":0,"d":"0 €"}}]
[{"$nulls":9},"(Vide)",{"v":0,"d":"0 €"},{"v":0,"d":"0 €"},{"v":0,"d":"0 €"},{"$nulls":4},{"$f":"+IF(O158>0,O158*Q158*Masque!$H$3,P158*Q158*Masque!$H$4)","v":{"v":0,"d":"0 €"}}]
[{"$nulls":9},"(Vide)",{"v":0,"d":"0 €"},{"v":0,"d":"0 €"},{"v":0,"d":"0 €"},{"$nulls":4},{"$f":"+IF(O159>0,O159*Q159*Masque!$H$3,P159*Q159*Masque!$H$4)","v":{"v":0,"d":"0 €"}}]
[{"$nulls":9},"(Vide)",{"v":0,"d":"0 €"},{"v":0,"d":"0 €"},{"v":0,"d":"0 €"},{"$nulls":4},{"$f":"+IF(O160>0,O160*Q160*Masque!$H$3,P160*Q160*Masque!$H$4)","v":{"v":0,"d":"0 €"}}]
[{"$nulls":9},"(Vide)",{"v":0,"d":"0 €"},{"v":0,"d":"0 €"},{"v":0,"d":"0 €"},{"$nulls":4},{"$f":"+IF(O161>0,O161*Q161*Masque!$H$3,P161*Q161*Masque!$H$4)","v":{"v":0,"d":"0 €"}}]
[{"$nulls":9},"(Vide)",{"v":0,"d":"0 €"},{"v":0,"d":"0 €"},{"v":0,"d":"0 €"},{"$nulls":4},{"$f":"+IF(O162>0,O162*Q162*Masque!$H$3,P162*Q162*Masque!$H$4)","v":{"v":0,"d":"0 €"}}]
[{"$nulls":9},"(Vide)",{"v":0,"d":"0 €"},{"v":0,"d":"0 €"},{"v":0,"d":"0 €"},{"$nulls":4},{"$f":"+IF(O163>0,O163*Q163*Masque!$H$3,P163*Q163*Masque!$H$4)","v":{"v":0,"d":"0 €"}}]
[{"$nulls":9},"(Vide)",{"v":0,"d":"0 €"},{"v":0,"d":"0 €"},{"v":0,"d":"0 €"},{"$nulls":4},{"$f":"+IF(O164>0,O164*Q164*Masque!$H$3,P164*Q164*Masque!$H$4)","v":{"v":0,"d":"0 €"}}]
[{"$nulls":9},"(Vide)",{"v":0,"d":"0 €"},{"v":0,"d":"0 €"},{"v":0,"d":"0 €"},{"$nulls":4},{"$f":"+IF(O165>0,O165*Q165*Masque!$H$3,P165*Q165*Masque!$H$4)","v":{"v":0,"d":"0 €"}}]
[{"$nulls":9},"(Vide)",{"v":0,"d":"0 €"},{"v":0,"d":"0 €"},{"v":0,"d":"0 €"},{"$nulls":4},{"$f":"+IF(O166>0,O166*Q166*Masque!$H$3,P166*Q166*Masque!$H$4)","v":{"v":0,"d":"0 €"}}]
[{"$nulls":6},"Total",{"$f":"SUM(H133:H166)","v":{"v":0,"d":"0 €"}},{"$f":"SUM(I133:I166)","v":{"v":0,"d":"0 €"}},null,{"$f":"SUM(K133:K166)","v":{"v":0,"d":"0 €"}},{"$f":"SUM(L133:L166)","v":{"v":0,"d":"0 €"}},{"$f":"SUM(M133:M166)","v":{"v":0,"d":"0 €"}},null,{"$f":"SUM(O133:O166)","v":0},{"$f":"SUM(P133:P166)","v":0},null,{"$f":"SUM(R133:R166)","v":{"v":0,"d":"0 €"}},null,"Total",{"$f":"SUM(U133:U166)*14","v":0},null,null,{"$f":"SUM(X133:X166)","v":0},null,{"$f":"SUM(Z133:Z166)","v":0},{"$f":"SUM(AA133:AA166)","v":0}]