{"text_format":"3","workbook":"xlsx","n_sheets":4,"sheets":["Masque","Récap-","RECAP","A-Modèle"],"not_rendered":{"images":1,"macros":1,"defined_names":13},"read":"whole","date_system":"1900"}

{"sheet":"Masque","index":0,"n_rows":68,"n_cols":13,"rows_kept":68,"hidden":true,"merged":[[0,5,0,7]]}
["Prestation","Fonctions","Nets","Brut","Charges","Hébergement",null,null,"Ticket Resto","Oui/Non","Nom_feuilles","Factures","Paiement"]
["Concert","Musicien(ne)","(Vide)",0,0,"(Vide)",null,null,14,"Oui",null,"Envoyée","Reçu"]
["Résidence","Chanteur(se)","France",null,null,"Twin",0,65,null,"Non",null,"Pas envoyée","Pas reçu"]
["Arrangements","Danseur(se)",{"v":30,"d":"30 €"},{"v":39,"d":"39 €"},{"$f":"D4/2","v":{"v":19.5,"d":"20 €"}},"Single",1,60]
["Conférence","Son",{"v":40,"d":"40 €"},{"$f":"C5*D4/C4","v":{"v":52,"d":"52 €"}},{"$f":"D5/2","v":{"v":26,"d":"26 €"}},null,2]
["Projection","Lumière",{"v":50,"d":"50 €"},{"$f":"C6*D5/C5","v":{"v":65,"d":"65 €"}},{"v":32.5,"d":"33 €"},null,3]
["Ateliers","Régisseur(se)",{"v":60,"d":"60 €"},{"$f":"C7*D6/C6","v":{"v":78,"d":"78 €"}},{"v":39,"d":"39 €"},null,4]
[null,"Manageur(se)",{"v":70,"d":"70 €"},{"v":91,"d":"91 €"},{"v":45.5,"d":"46 €"},null,5]
[null,"Comédien(ne)",{"v":80,"d":"80 €"},{"v":104,"d":"104 €"},{"v":52,"d":"52 €"},null,6]
[null,"Intervenant(e)",{"v":90,"d":"90 €"},{"v":117,"d":"117 €"},{"v":58.5,"d":"59 €"},null,7]
[null,"Runner(euse)",{"v":100,"d":"100 €"},{"v":130,"d":"130 €"},{"v":65,"d":"65 €"},null,8]
[null,null,{"v":110,"d":"110 €"},{"v":143,"d":"143 €"},{"v":71.5,"d":"72 €"},null,9]
[null,null,{"v":120,"d":"120 €"},{"v":156,"d":"156 €"},{"v":78,"d":"78 €"},null,10]
[null,null,{"v":130,"d":"130 €"},{"v":169,"d":"169 €"},{"v":84.5,"d":"85 €"},null,11]
[null,null,{"v":140,"d":"140 €"},{"v":182,"d":"182 €"},{"v":91,"d":"91 €"},null,12]
{"$rows_left_out":54}
{"sheet":"Récap-","index":1,"n_rows":322,"n_cols":33,"rows_kept":322,"merged":[[0,0,1,17],[0,19,1,23],[2,2,2,17],[2,19,2,23],[3,5,3,6],[3,25,3,27],[3,28,3,30],[9,1,16,1],[9,2,16,2],[9,3,16,3],[9,15,16,15],[9,16,16,16],[9,17,16,17],[9,25,16,25],[9,26,16,26],[9,27,16,27],[9,28,16,28],[9,29,16,29],[9,30,16,30],[9,31,16,31],[9,32,16,32],[17,1,24,1],[17,2,24,2],[17,3,24,3],[17,15,24,15],[17,16,24,16],[17,17,24,17],[17,25,24,25],[17,26,24,26],[17,27,24,27],[17,28,24,28],[17,29,24,29],[17,30,24,30],[17,31,24,31],[17,32,24,32],[25,1,32,1],[25,2,32,2],[25,3,32,3],[25,15,32,15],[25,16,32,16],[25,17,32,17],[25,25,32,25],[25,26,32,26],[25,27,32,27],[25,28,32,28],[25,29,32,29],[25,30,32,30],[25,31,32,31],[25,32,32,32],[33,1,40,1],[33,2,40,2],[33,3,40,3],[33,15,40,15],[33,16,40,16],[33,17,40,17],[33,25,40,25],[33,26,40,26],[33,27,40,27],[33,28,40,28],[33,29,40,29],[33,30,40,30],[33,31,40,31],[33,32,40,32],[41,1,48,1],[41,2,48,2],[41,3,48,3],[41,15,48,15],[41,16,48,16],[41,17,48,17],[41,25,48,25],[41,26,48,26],[41,27,48,27],[41,28,48,28],[41,29,48,29],[41,30,48,30],[41,31,48,31],[41,32,48,32],[48,19,48,20],[49,1,56,1],[49,2,56,2],[49,3,56,3],[49,15,56,15],[49,16,56,16],[49,17,56,17],[49,25,56,25],[49,26,56,26],[49,27,56,27],[49,28,56,28],[49,29,56,29],[49,30,56,30],[49,31,56,31],[49,32,56,32],[57,1,64,1],[57,2,64,2],[57,3,64,3],[57,15,64,15],[57,16,64,16],[57,17,64,17],[57,25,64,25],[57,26,64,26],[57,27,64,27],[57,28,64,28],[57,29,64,29],[57,30,64,30],[57,31,64,31],[57,32,64,32],[65,1,72,1],[65,2,72,2],[65,3,72,3],[65,15,72,15],[65,16,72,16],[65,17,72,17],[65,25,72,25],[65,26,72,26],[65,27,72,27],[65,28,72,28],[65,29,72,29],[65,30,72,30],[65,31,72,31],[65,32,72,32],[73,1,80,1],[73,2,80,2],[73,3,80,3],[73,15,80,15],[73,16,80,16],[73,17,80,17],[73,25,80,25],[73,26,80,26],[73,27,80,27],[73,28,80,28],[73,29,80,29],[73,30,80,30],[73,31,80,31],[73,32,80,32],[81,1,88,1],[81,2,88,2],[81,3,88,3],[81,15,88,15],[81,16,88,16],[81,17,88,17],[81,25,88,25],[81,26,88,26],[81,27,88,27],[81,28,88,28],[81,29,88,29],[81,30,88,30],[81,31,88,31],[81,32,88,32],[89,1,96,1],[89,2,96,2],[89,3,96,3],[89,15,96,15],[89,16,96,16],[89,17,96,17],[89,25,96,25],[89,26,96,26],[89,27,96,27],[89,28,96,28],[89,29,96,29],[89,30,96,30],[89,31,96,31],[89,32,96,32],[97,1,104,1],[97,2,104,2],[97,3,104,3],[97,15,104,15],[97,16,104,16],[97,17,104,17],[97,25,104,25],[97,26,104,26],[97,27,104,27],[97,28,104,28],[97,29,104,29],[97,30,104,30],[97,31,104,31],[97,32,104,32],[105,1,112,1],[105,2,112,2],[105,3,112,3],[105,15,112,15],[105,16,112,16],[105,17,112,17],[105,25,112,25],[105,26,112,26],[105,27,112,27],[105,28,112,28],[105,29,112,29],[105,30,112,30],[105,31,112,31],[105,32,112,32],[113,1,120,1],[113,2,120,2],[113,3,120,3],[113,15,120,15],[113,16,120,16],[113,17,120,17],[113,25,120,25],[113,26,120,26],[113,27,120,27],[113,28,120,28],[113,29,120,29],[113,30,120,30],[113,31,120,31],[113,32,120,32],[121,1,128,1],[121,2,128,2],[121,3,128,3],[121,15,128,15],[121,16,128,16],[121,17,128,17],[121,25,128,25],[121,26,128,26],[121,27,128,27],[121,28,128,28],[121,29,128,29],[121,30,128,30],[121,31,128,31],[121,32,128,32],[129,1,136,1],[129,2,136,2],[129,3,136,3],[129,15,136,15],[129,16,136,16],[129,17,136,17],[129,25,136,25],[129,26,136,26],[129,27,136,27],[129,28,136,28],[129,29,136,29],[129,30,136,30],[129,31,136,31],[129,32,136,32],[137,1,144,1],[137,2,144,2],[137,3,144,3],[137,15,144,15],[137,16,144,16],[137,17,144,17],[137,25,144,25],[137,26,144,26],[137,27,144,27],[137,28,144,28],[137,29,144,29],[137,30,144,30],[137,31,144,31],[137,32,144,32],[145,1,152,1],[145,2,152,2],[145,3,152,3],[145,15,152,15],[145,16,152,16],[145,17,152,17],[145,25,152,25],[145,26,152,26],[145,27,152,27],[145,28,152,28],[145,29,152,29],[145,30,152,30],[145,31,152,31],[145,32,152,32],[153,1,160,1],[153,2,160,2],[153,3,160,3],[153,15,160,15],[153,16,160,16],[153,17,160,17],[153,25,160,25],[153,26,160,26],[153,27,160,27],[153,28,160,28],[153,29,160,29],[153,30,160,30],[153,31,160,31],[153,32,160,32],[161,1,168,1],[161,2,168,2],[161,3,168,3],[161,15,168,15],[161,16,168,16],[161,17,168,17],[161,25,168,25],[161,26,168,26],[161,27,168,27],[161,28,168,28],[161,29,168,29],[161,30,168,30],[161,31,168,31],[161,32,168,32],[169,1,176,1],[169,2,176,2],[169,3,176,3],[169,15,176,15],[169,16,176,16],[169,17,176,17],[169,25,176,25],[169,26,176,26],[169,27,176,27],[169,28,176,28],[169,29,176,29],[169,30,176,30],[169,31,176,31],[169,32,176,32],[177,1,184,1],[177,2,184,2],[177,3,184,3],[177,15,184,15],[177,16,184,16],[177,17,184,17],[177,25,184,25],[177,26,184,26],[177,27,184,27],[177,28,184,28],[177,29,184,29],[177,30,184,30],[177,31,184,31],[177,32,184,32],[185,1,192,1],[185,2,192,2],[185,3,192,3],[185,15,192,15],[185,16,192,16],[185,17,192,17],[185,25,192,25],[185,26,192,26],[185,27,192,27],[185,28,192,28],[185,29,192,29],[185,30,192,30],[185,31,192,31],[185,32,192,32],[193,1,200,1],[193,2,200,2],[193,3,200,3],[193,15,200,15],[193,16,200,16],[193,17,200,17],[193,25,200,25],[193,26,200,26],[193,27,200,27],[193,28,200,28],[193,29,200,29],[193,30,200,30],[193,31,200,31],[193,32,200,32],[201,1,208,1],[201,2,208,2],[201,3,208,3],[201,15,208,15],[201,16,208,16],[201,17,208,17],[201,25,208,25],[201,26,208,26],[201,27,208,27],[201,28,208,28],[201,29,208,29],[201,30,208,30],[201,31,208,31],[201,32,208,32],[209,1,216,1],[209,2,216,2],[209,3,216,3],[209,15,216,15],[209,16,216,16],[209,17,216,17],[209,25,216,25],[209,26,216,26],[209,27,216,27],[209,28,216,28],[209,29,216,29],[209,30,216,30],[209,31,216,31],[209,32,216,32],[217,1,224,1],[217,2,224,2],[217,3,224,3],[217,15,224,15],[217,16,224,16],[217,17,224,17],[217,25,224,25],[217,26,224,26],[217,27,224,27],[217,28,224,28],[217,29,224,29],[217,30,224,30],[217,31,224,31],[217,32,224,32],[225,1,232,1],[225,2,232,2],[225,3,232,3],[225,15,232,15],[225,16,232,16],[225,17,232,17],[225,25,232,25],[225,26,232,26],[225,27,232,27],[225,28,232,28],[225,29,232,29],[225,30,232,30],[225,31,232,31],[225,32,232,32],[233,1,240,1],[233,2,240,2],[233,3,240,3],[233,15,240,15],[233,16,240,16],[233,17,240,17],[233,25,240,25],[233,26,240,26],[233,27,240,27],[233,28,240,28],[233,29,240,29],[233,30,240,30],[233,31,240,31],[233,32,240,32],[241,1,248,1],[241,2,248,2],[241,3,248,3],[241,15,248,15],[241,16,248,16],[241,17,248,17],[241,25,248,25],[241,26,248,26],[241,27,248,27],[241,28,248,28],[241,29,248,29],[241,30,248,30],[241,31,248,31],[241,32,248,32],[249,1,256,1],[249,2,256,2],[249,3,256,3],[249,15,256,15],[249,16,256,16],[249,17,256,17],[249,25,256,25],[249,26,256,26],[249,27,256,27],[249,28,256,28],[249,29,256,29],[249,30,256,30],[249,31,256,31],[249,32,256,32],[257,1,264,1],[257,2,264,2],[257,3,264,3],[257,15,264,15],[257,16,264,16],[257,17,264,17],[257,25,264,25],[257,26,264,26],[257,27,264,27],[257,28,264,28],[257,29,264,29],[257,30,264,30],[257,31,264,31],[257,32,264,32],[265,1,272,1],[265,2,272,2],[265,3,272,3],[265,15,272,15],[265,16,272,16],[265,17,272,17],[265,25,272,25],[265,26,272,26],[265,27,272,27],[265,28,272,28],[265,29,272,29],[265,30,272,30],[265,31,272,31],[265,32,272,32],[273,1,280,1],[273,2,280,2],[273,3,280,3],[273,15,280,15],[273,16,280,16],[273,17,280,17],[273,25,280,25],[273,26,280,26],[273,27,280,27],[273,28,280,28],[273,29,280,29],[273,30,280,30],[273,31,280,31],[273,32,280,32],[281,1,288,1],[281,2,288,2],[281,3,288,3],[281,15,288,15],[281,16,288,16],[281,17,288,17],[281,25,288,25],[281,26,288,26],[281,27,288,27],[281,28,288,28],[281,29,288,29],[281,30,288,30],[281,31,288,31],[281,32,288,32],[289,1,296,1],[289,2,296,2],[289,3,296,3],[289,15,296,15],[289,16,296,16],[289,17,296,17],[289,25,296,25],[289,26,296,26],[289,27,296,27],[289,28,296,28],[289,29,296,29],[289,30,296,30],[289,31,296,31],[289,32,296,32],[297,1,304,1],[297,2,304,2],[297,3,304,3],[297,15,304,15],[297,16,304,16],[297,17,304,17],[297,25,304,25],[297,26,304,26],[297,27,304,27],[297,28,304,28],[297,29,304,29],[297,30,304,30],[297,31,304,31],[297,32,304,32],[305,1,312,1],[305,2,312,2],[305,3,312,3],[305,15,312,15],[305,16,312,16],[305,17,312,17],[305,25,312,25],[305,26,312,26],[305,27,312,27],[305,28,312,28],[305,29,312,29],[305,30,312,30],[305,31,312,31],[305,32,312,32],[313,1,320,1],[313,2,320,2],[313,3,320,3],[313,15,320,15],[313,16,320,16],[313,17,320,17],[313,25,320,25],[313,26,320,26],[313,27,320,27],[313,28,320,28],[313,29,320,29],[313,30,320,30],[313,31,320,31],[313,32,320,32],[321,2,322,4],[321,5,322,5],[321,6,322,6],[321,7,322,7],[321,8,322,8],[321,9,322,9],[321,10,322,10],[321,11,322,11],[321,12,322,12],[321,13,322,13],[321,14,322,14],[321,15,322,15],[321,16,322,16],[321,17,322,17]]}
["Tableau récapitulatif / Edition 2015",{"$nulls":18},"Tableau + que récapitulatif / Edition 2015"]
[]
[null,null,"Ne rien modifier, tout est automatisé sur cette page",{"$nulls":16},"Ne rien modifier, tout est automatisé sur cette page"]
[{"$nulls":25},"Convention Ville",null,null,"Cession Groupes"]
["Lien>Feuille","Feuille","Date","Ville",null,"Brut","Charges","Cession","Frais de Prod","Hôtel","Repas","Transport","Location Son","Location Studio","Sous-Total Charges","Total Charges","Total \nRecettes","Résultat",null,"Date","Ville","Total Charges","Total \nRecettes","Résultat",null,"Faite","Envoyée","Reçue","Faite","Envoyée","Reçue","SACEM","CNV"]
[null,{"$f":"MID(INDEX(nom_feuilles,ROW(Masque!K1)),SEARCH(\"]\",INDEX(nom_feuilles,ROW(Masque!K1)))+1,30)","v":"Masque"},null,{"$f":"IF(B6=\"\",\"\",INDIRECT(\"'\"&B6&\"'!$A$4\"))","v":"Arrangements"},{"$nulls":10},{"$f":"IF(B6=\"\",\"\",INDIRECT(\"'\"&B6&\"'!$B$5\"))","v":"Son"}]
[null,{"$f":"MID(INDEX(nom_feuilles,ROW(Masque!K2)),SEARCH(\"]\",INDEX(nom_feuilles,ROW(Masque!K2)))+1,30)","v":"Récap-"},null,{"$f":"IF(B7=\"\",\"\",INDIRECT(\"'\"&B7&\"'!$A$4\"))","v":0},{"$nulls":10},{"$f":"IF(B7=\"\",\"\",INDIRECT(\"'\"&B7&\"'!$B$7\"))","v":"Récap-"},null,{"$f":"IF(B7=\"\",\"\",INDIRECT(\"'\"&B7&\"'!$B$11\"))","v":0}]
[null,{"$f":"MID(INDEX(nom_feuilles,ROW(Masque!K3)),SEARCH(\"]\",INDEX(nom_feuilles,ROW(Masque!K3)))+1,30)","v":"RECAP"},null,{"$f":"IF(B8=\"\",\"\",INDIRECT(\"'\"&B8&\"'!$A$5\"))","v":0},{"$nulls":3},{"$f":"IF(B8=\"\",\"\",INDIRECT(\"'\"&B8&\"'!$B$13\"))","v":0},{"$f":"IF(B8=\"\",\"\",INDIRECT(\"'\"&B8&\"'!$B$15\"))","v":0},{"$f":"IF(B8=\"\",\"\",INDIRECT(\"'\"&B8&\"'!$D$18\"))","v":0},{"$f":"IF(B8=\"\",\"\",INDIRECT(\"'\"&B8&\"'!$c$22\"))","v":0},{"$f":"IF(B8=\"\",\"\",INDIRECT(\"'\"&B8&\"'!$B$27\"))","v":0},{"$f":"IF(B8=\"\",\"\",INDIRECT(\"'\"&B8&\"'!$B$29\"))","v":0},null,{"$f":"IF(B8=\"\",\"\",INDIRECT(\"'\"&B8&\"'!$B$7\"))","v":0},null,{"$f":"IF(B8=\"\",\"\",INDIRECT(\"'\"&B8&\"'!$B$9\"))","v":0}]
["Modèle",{"$f":"MID(INDEX(nom_feuilles,ROW(Masque!K4)),SEARCH(\"]\",INDEX(nom_feuilles,ROW(Masque!K4)))+1,30)","v":"A-Modèle"},null,{"$f":"IF(B9=\"\",\"\",INDIRECT(\"'\"&B9&\"'!$A$5\"))","v":0},null,{"$f":"IF(B9=\"\",\"\",INDIRECT(\"'\"&B9&\"'!$H$140\"))","v":0},{"$f":"IF(B9=\"\",\"\",INDIRECT(\"'\"&B9&\"'!$I$140\"))","v":0},{"$f":"IF(B9=\"\",\"\",INDIRECT(\"'\"&B9&\"'!$B$13\"))","v":0},{"$f":"IF(B9=\"\",\"\",INDIRECT(\"'\"&B9&\"'!$B$15\"))","v":0},{"$f":"IF(B9=\"\",\"\",INDIRECT(\"'\"&B9&\"'!$D$18\"))","v":0},{"$f":"IF(B9=\"\",\"\",INDIRECT(\"'\"&B9&\"'!$c$22\"))","v":0},{"$f":"IF(B9=\"\",\"\",INDIRECT(\"'\"&B9&\"'!$B$24\"))","v":0},{"$f":"IF(B9=\"\",\"\",INDIRECT(\"'\"&B9&\"'!$B$30\"))","v":0},null,{"$f":"SUM(F9:M9)","v":0},null,{"$f":"IF(B9=\"\",\"\",INDIRECT(\"'\"&B9&\"'!$B$9\"))","v":0},{"$f":"Q9-O9","v":0}]
[null,{"$f":"MID(INDEX(nom_feuilles,ROW(Masque!K5)),SEARCH(\"]\",INDEX(nom_feuilles,ROW(Masque!K5)))+1,30)","v":{"$error":"#REF!"}},{"$f":"IF(B10=\"\",\"\",INDIRECT(\"'\"&B10&\"'!$A$1\"))","v":{"$error":"#REF!"}},{"$f":"IF(B10=\"\",\"\",INDIRECT(\"'\"&B10&\"'!$A$2\"))","v":{"$error":"#REF!"}},{"$f":"IF(B10=\"\",\"\",INDIRECT(\"'\"&B10&\"'!$A$8\"))","v":{"$error":"#REF!"}},{"$f":"IF(B10=\"\",\"\",INDIRECT(\"'\"&B10&\"'!$K$30\"))","v":{"$error":"#REF!"}},{"$f":"IF(B10=\"\",\"\",INDIRECT(\"'\"&B10&\"'!$L$30\"))","v":{"$error":"#REF!"}},{"$f":"IF(B10=\"\",\"\",INDIRECT(\"'\"&B10&\"'!$H$30\"))","v":{"$error":"#REF!"}},{"$f":"IF(B10=\"\",\"\",INDIRECT(\"'\"&B10&\"'!$I$30\"))","v":{"$error":"#REF!"}},{"$f":"IF(B10=\"\",\"\",INDIRECT(\"'\"&B10&\"'!$R$30\"))","v":{"$error":"#REF!"}},{"$f":"IF(B10=\"\",\"\",INDIRECT(\"'\"&B10&\"'!$U$30\"))","v":{"$error":"#REF!"}},{"$f":"IF(B10=\"\",\"\",INDIRECT(\"'\"&B10&\"'!$X$30\"))","v":{"$error":"#REF!"}},{"$f":"IF(B10=\"\",\"\",INDIRECT(\"'\"&B10&\"'!$Z$30\"))","v":{"$error":"#REF!"}},{"$f":"IF(B10=\"\",\"\",INDIRECT(\"'\"&B10&\"'!$AA$30\"))","v":{"$error":"#REF!"}},{"$f":"SUM(F10:N10)","v":{"$error":"#REF!"}},{"$f":"SUM(O10:O17)","v":{"$error":"#REF!"}},{"$f":"IF(B10=\"\",\"\",INDIRECT(\"'\"&B10&\"'!$H$4\"))","v":{"$error":"#REF!"}},{"$f":"P10-Q10","v":{"$error":"#REF!"}},null,{"$f":"C10","v":{"$error":"#REF!"}},{"$f":"D10","v":{"$error":"#REF!"}},{"$f":"P10","v":{"$error":"#REF!"}},{"$f":"Q10","v":{"$error":"#REF!"}},{"$f":"V10-W10","v":{"$error":"#REF!"}}]
[{"$nulls":4},{"$f":"IF(B10=\"\",\"\",INDIRECT(\"'\"&B10&\"'!$A$32\"))","v":{"$error":"#REF!"}},{"$f":"IF(B10=\"\",\"\",INDIRECT(\"'\"&B10&\"'!$K$54\"))","v":{"$error":"#REF!"}},{"$f":"IF(B10=\"\",\"\",INDIRECT(\"'\"&B10&\"'!$L$54\"))","v":{"$error":"#REF!"}},{"$f":"IF(B10=\"\",\"\",INDIRECT(\"'\"&B10&\"'!$H$54\"))","v":{"$error":"#REF!"}},{"$f":"IF(B10=\"\",\"\",INDIRECT(\"'\"&B10&\"'!$I$54\"))","v":{"$error":"#REF!"}},{"$f":"IF(B10=\"\",\"\",INDIRECT(\"'\"&B10&\"'!$R$54\"))","v":{"$error":"#REF!"}},{"$f":"IF(B10=\"\",\"\",INDIRECT(\"'\"&B10&\"'!$U$54\"))","v":{"$error":"#REF!"}},{"$f":"IF(B10=\"\",\"\",INDIRECT(\"'\"&B10&\"'!$X$54\"))","v":{"$error":"#REF!"}},{"$f":"IF(B10=\"\",\"\",INDIRECT(\"'\"&B10&\"'!$Z$54\"))","v":{"$error":"#REF!"}},{"$f":"IF(B10=\"\",\"\",INDIRECT(\"'\"&B10&\"'!$AA$54\"))","v":{"$error":"#REF!"}},{"$f":"SUM(F11:N11)","v":{"$error":"#REF!"}},{"$nulls":4},{"$f":"C18","v":{"$error":"#REF!"}},{"$f":"D18","v":{"$error":"#REF!"}},{"$f":"P18","v":{"$error":"#REF!"}},{"$f":"Q18","v":{"$error":"#REF!"}},{"$f":"V11-W11","v":{"$error":"#REF!"}}]
[{"$nulls":4},{"$f":"IF(B10=\"\",\"\",INDIRECT(\"'\"&B10&\"'!$A$56\"))","v":{"$error":"#REF!"}},{"$f":"IF(B10=\"\",\"\",INDIRECT(\"'\"&B10&\"'!$K$78\"))","v":{"$error":"#REF!"}},{"$f":"IF(B10=\"\",\"\",INDIRECT(\"'\"&B10&\"'!$L$78\"))","v":{"$error":"#REF!"}},{"$f":"IF(B10=\"\",\"\",INDIRECT(\"'\"&B10&\"'!$H$78\"))","v":{"$error":"#REF!"}},{"$f":"IF(B10=\"\",\"\",INDIRECT(\"'\"&B10&\"'!$I$78\"))","v":{"$error":"#REF!"}},{"$f":"IF(B10=\"\",\"\",INDIRECT(\"'\"&B10&\"'!$R$78\"))","v":{"$error":"#REF!"}},{"$f":"IF(B10=\"\",\"\",INDIRECT(\"'\"&B10&\"'!$U$78\"))","v":{"$error":"#REF!"}},{"$f":"IF(B10=\"\",\"\",INDIRECT(\"'\"&B10&\"'!$X$78\"))","v":{"$error":"#REF!"}},{"$f":"IF(B10=\"\",\"\",INDIRECT(\"'\"&B10&\"'!$Z$78\"))","v":{"$error":"#REF!"}},{"$f":"IF(B10=\"\",\"\",INDIRECT(\"'\"&B10&\"'!$AA$78\"))","v":{"$error":"#REF!"}},{"$f":"SUM(F12:N12)","v":{"$error":"#REF!"}},{"$nulls":4},{"$f":"C26","v":{"$error":"#REF!"}},{"$f":"D26","v":{"$error":"#REF!"}},{"$f":"P26","v":{"$error":"#REF!"}},{"$f":"Q26","v":{"$error":"#REF!"}},{"$error":"#REF!"}]
[{"$nulls":4},{"$f":"IF(B10=\"\",\"\",INDIRECT(\"'\"&B10&\"'!$A$80\"))","v":{"$error":"#REF!"}},{"$f":"IF(B10=\"\",\"\",INDIRECT(\"'\"&B10&\"'!$K$102\"))","v":{"$error":"#REF!"}},{"$f":"IF(B10=\"\",\"\",INDIRECT(\"'\"&B10&\"'!$L$102\"))","v":{"$error":"#REF!"}},{"$f":"IF(B10=\"\",\"\",INDIRECT(\"'\"&B10&\"'!$H$102\"))","v":{"$error":"#REF!"}},{"$f":"IF(B10=\"\",\"\",INDIRECT(\"'\"&B10&\"'!$I$102\"))","v":{"$error":"#REF!"}},{"$f":"IF(B10=\"\",\"\",INDIRECT(\"'\"&B10&\"'!$R$102\"))","v":{"$error":"#REF!"}},{"$f":"IF(B10=\"\",\"\",INDIRECT(\"'\"&B10&\"'!$U$102\"))","v":{"$error":"#REF!"}},{"$f":"IF(B10=\"\",\"\",INDIRECT(\"'\"&B10&\"'!$X$102\"))","v":{"$error":"#REF!"}},{"$f":"IF(B10=\"\",\"\",INDIRECT(\"'\"&B10&\"'!$Z$102\"))","v":{"$error":"#REF!"}},{"$f":"IF(B10=\"\",\"\",INDIRECT(\"'\"&B10&\"'!$AA$102\"))","v":{"$error":"#REF!"}},{"$error":"#REF!"},{"$nulls":4},{"$f":"C34","v":{"$error":"#REF!"}},{"$f":"D34","v":{"$error":"#REF!"}},{"$f":"P34","v":{"$error":"#REF!"}},{"$f":"Q34","v":{"$error":"#REF!"}},{"$error":"#REF!"}]
[{"$nulls":4},{"$f":"IF(B10=\"\",\"\",INDIRECT(\"'\"&B10&\"'!$A$104\"))","v":{"$error":"#REF!"}},{"$f":"IF(B10=\"\",\"\",INDIRECT(\"'\"&B10&\"'!$K$111\"))","v":{"$error":"#REF!"}},{"$f":"IF(B10=\"\",\"\",INDIRECT(\"'\"&B10&\"'!$L$111\"))","v":{"$error":"#REF!"}},{"$f":"IF(B10=\"\",\"\",INDIRECT(\"'\"&B10&\"'!$H$111\"))","v":{"$error":"#REF!"}},{"$f":"IF(B10=\"\",\"\",INDIRECT(\"'\"&B10&\"'!$I$111\"))","v":{"$error":"#REF!"}},{"$f":"IF(B10=\"\",\"\",INDIRECT(\"'\"&B10&\"'!$R$111\"))","v":{"$error":"#REF!"}},{"$f":"IF(B10=\"\",\"\",INDIRECT(\"'\"&B10&\"'!$U$111\"))","v":{"$error":"#REF!"}},{"$f":"IF(B10=\"\",\"\",INDIRECT(\"'\"&B10&\"'!$X$111\"))","v":{"$error":"#REF!"}},{"$f":"IF(B10=\"\",\"\",INDIRECT(\"'\"&B10&\"'!$Z$111\"))","v":{"$error":"#REF!"}},{"$f":"IF(B10=\"\",\"\",INDIRECT(\"'\"&B10&\"'!$AA$111\"))","v":{"$error":"#REF!"}},{"$f":"SUM(F14:N14)","v":{"$error":"#REF!"}},{"$nulls":4},{"$f":"C42","v":{"$error":"#REF!"}},{"$f":"D42","v":{"$error":"#REF!"}},{"$f":"P42","v":{"$error":"#REF!"}},{"$f":"Q42","v":{"$error":"#REF!"}},{"$error":"#REF!"}]
[{"$nulls":4},{"$f":"IF(B10=\"\",\"\",INDIRECT(\"'\"&B10&\"'!$A$113\"))","v":{"$error":"#REF!"}},{"$f":"IF(B10=\"\",\"\",INDIRECT(\"'\"&B10&\"'!$K$120\"))","v":{"$error":"#REF!"}},{"$f":"IF(B10=\"\",\"\",INDIRECT(\"'\"&B10&\"'!$L$120\"))","v":{"$error":"#REF!"}},{"$f":"IF(B10=\"\",\"\",INDIRECT(\"'\"&B10&\"'!$H$120\"))","v":{"$error":"#REF!"}},{"$f":"IF(B10=\"\",\"\",INDIRECT(\"'\"&B10&\"'!$I$120\"))","v":{"$error":"#REF!"}},{"$f":"IF(B10=\"\",\"\",INDIRECT(\"'\"&B10&\"'!$R$120\"))","v":{"$error":"#REF!"}},{"$f":"IF(B10=\"\",\"\",INDIRECT(\"'\"&B10&\"'!$U$120\"))","v":{"$error":"#REF!"}},{"$f":"IF(B10=\"\",\"\",INDIRECT(\"'\"&B10&\"'!$X$120\"))","v":{"$error":"#REF!"}},{"$f":"IF(B10=\"\",\"\",INDIRECT(\"'\"&B10&\"'!$Z$120\"))","v":{"$error":"#REF!"}},{"$f":"IF(B10=\"\",\"\",INDIRECT(\"'\"&B10&\"'!$AA$120\"))","v":{"$error":"#REF!"}},{"$error":"#REF!"},{"$nulls":4},{"$f":"C50","v":{"$error":"#REF!"}},{"$f":"D50","v":{"$error":"#REF!"}},{"$f":"P50","v":{"$error":"#REF!"}},{"$f":"Q50","v":{"$error":"#REF!"}},{"$error":"#REF!"}]
{"$rows_left_out":308}
{"sheet":"RECAP","index":2,"n_rows":131,"n_cols":27,"rows_kept":131,"merged":[[0,3,0,6],[0,7,0,8],[0,9,0,12],[0,14,0,19],[0,21,0,24],[0,25,0,26]]}
[null,null,"Date","Informations personnelles",{"$nulls":3},"Factures",null,"Salaires",{"$nulls":3},"Détails","Hôtel",{"$nulls":5},"Repas","Transport",{"$nulls":3},"Location"]
[{"$nulls":3},"Nom","Prénom","Instrument","Fonction","Cession","Frais de Prod","Net","Brut","Charges","Total","Coord     ","S","T","Nuits","Total Nuitées","Date\narrivée","Date\nDépart","Ticket\nResto","Date\narrivée","Date\nDépart","Coûts de transport","Trajet","Location Son","Location Studio"]
[{"$nulls":9},"(Vide)",{"v":0,"d":"0 €"},{"v":0,"d":"0 €"},{"v":0,"d":"0 €"},{"$nulls":4},{"v":0,"d":"0 €"}]
[{"$nulls":9},"(Vide)",{"v":0,"d":"0 €"},{"v":0,"d":"0 €"},{"v":0,"d":"0 €"},{"$nulls":4},{"v":0,"d":"0 €"}]
[{"$nulls":9},"(Vide)",{"v":0,"d":"0 €"},{"v":0,"d":"0 €"},{"v":0,"d":"0 €"},{"$nulls":4},{"v":0,"d":"0 €"}]
[{"$nulls":9},"(Vide)",{"v":0,"d":"0 €"},{"v":0,"d":"0 €"},{"v":0,"d":"0 €"},{"$nulls":4},{"v":0,"d":"0 €"}]
[{"$nulls":9},"(Vide)",{"v":0,"d":"0 €"},{"v":0,"d":"0 €"},{"v":0,"d":"0 €"},{"$nulls":4},{"v":0,"d":"0 €"}]
[{"$nulls":9},"(Vide)",{"v":0,"d":"0 €"},{"v":0,"d":"0 €"},{"v":0,"d":"0 €"},{"$nulls":4},{"v":0,"d":"0 €"}]
[{"$nulls":9},"(Vide)",{"v":0,"d":"0 €"},{"v":0,"d":"0 €"},{"v":0,"d":"0 €"},{"$nulls":4},{"v":0,"d":"0 €"}]
[{"$nulls":9},"(Vide)",{"v":0,"d":"0 €"},{"v":0,"d":"0 €"},{"v":0,"d":"0 €"},{"$nulls":4},{"v":0,"d":"0 €"}]
[{"$nulls":9},"(Vide)",{"v":0,"d":"0 €"},{"v":0,"d":"0 €"},{"v":0,"d":"0 €"},{"$nulls":4},{"v":0,"d":"0 €"}]
[{"$nulls":9},"(Vide)",{"v":0,"d":"0 €"},{"v":0,"d":"0 €"},{"v":0,"d":"0 €"},{"$nulls":4},{"v":0,"d":"0 €"}]
[{"$nulls":9},"(Vide)",{"v":0,"d":"0 €"},{"v":0,"d":"0 €"},{"v":0,"d":"0 €"},{"$nulls":4},{"v":0,"d":"0 €"}]
[{"$nulls":9},"(Vide)",{"v":0,"d":"0 €"},{"v":0,"d":"0 €"},{"v":0,"d":"0 €"},{"$nulls":4},{"v":0,"d":"0 €"}]
[{"$nulls":9},"(Vide)",{"v":0,"d":"0 €"},{"v":0,"d":"0 €"},{"v":0,"d":"0 €"},{"$nulls":4},{"v":0,"d":"0 €"}]
{"$rows_left_out":117}
{"sheet":"A-Modèle","index":3,"n_rows":167,"n_cols":27,"rows_kept":167,"merged":[[0,0,0,3],[1,0,1,3],[3,3,4,3],[3,4,4,4],[3,6,4,6],[3,7,4,7],[7,0,8,0],[7,3,7,6],[7,7,7,8],[7,9,7,12],[7,14,7,19],[7,21,7,24],[7,25,7,26],[31,0,32,0],[31,3,31,6],[31,7,31,8],[31,9,31,12],[31,14,31,19],[31,21,31,24],[31,25,31,26],[55,0,56,0],[55,3,55,6],[55,7,55,8],[55,9,55,12],[55,14,55,19],[55,21,55,24],[55,25,55,26],[79,0,80,0],[79,3,79,6],[79,7,79,8],[79,9,79,12],[79,14,79,19],[79,21,79,24],[79,25,79,26],[103,0,104,0],[103,3,103,6],[103,7,103,8],[103,9,103,12],[103,14,103,19],[103,21,103,24],[103,25,103,26],[112,0,113,0],[112,3,112,6],[112,7,112,8],[112,9,112,12],[112,14,112,19],[112,21,112,24],[112,25,112,26],[121,0,122,0],[121,3,121,6],[121,7,121,8],[121,9,121,12],[121,14,121,19],[121,21,121,24],[121,25,121,26],[130,0,131,0],[130,3,130,6],[130,7,130,8],[130,9,130,12],[130,14,130,19],[130,21,130,24],[130,25,130,26]]}
["DATE",{"$nulls":4},"Ne pas toucher","Remplir les cases","Liste déroulante","Contrat Fait","Contrat Envoyé","Contrat Reçu"]
["LIEU"]
[]
[{"$nulls":3},"CHARGES",{"$f":"H30+I30+M30+R30+U30+X30+Z30+AA30+H54+I54+M54+R54+U54+X54+Z54+AA54+H78+I78+M78+R78+U78+X78+Z78+AA78+H102+I102+M102+R102+U102+X102+Z102+AA102+H111+I111+M111+R111+U111+X111+Z111+AA111+H120+I120+H129+I129+M120+M129+R120+R129+U120+U129+X129+X120+Z129+Z120+AA120+AA129+AA167+Z167+X167+U167+R167+M167+I167+H167","v":{"v":0,"d":"0 €"}},null,"RECETTES",{"$f":"J4+J5+L4","v":{"v":0,"d":"0 €"}},"Cession Ville",{"v":0,"d":"0 €"},"Actions Q",{"v":0,"d":"0 €"}]
[{"$nulls":8},"Sub' Ville",{"v":0,"d":"0 €"}]
[]
[]
["Plateau 1 \n(Concert)",null,"Date","Informations personnelles",{"$nulls":3},"Factures",null,"Salaires",{"$nulls":3},"Détails","Hôtel",{"$nulls":5},"Repas","Transport",{"$nulls":3},"Location"]
[{"$nulls":3},"Nom","Prénom","Instrument","Fonction","Cession","Frais de Prod","Net","Brut","Charges","Total","Coord     ","S","T","Nuits","Total Nuitées","Date\narrivée","Date\nDépart","Ticket\nResto","Date\narrivée","Date\nDépart","Coûts de transport","Trajet","Location Son","Location Studio"]
[{"$nulls":9},"(Vide)",{"$f":"VLOOKUP(J10,NetBrut,2,0)","v":{"v":0,"d":"0 €"}},{"$f":"VLOOKUP(K10,BrutCharges,2,0)","v":{"v":0,"d":"0 €"}},{"$f":"K10+L10","v":{"v":0,"d":"0 €"}},{"$nulls":4},{"$f":"+IF(O10>0,O10*Q10*Masque!$H$3,P10*Q10*Masque!$H$4)","v":{"v":0,"d":"0 €"}}]
[{"$nulls":9},"(Vide)",{"v":0,"d":"0 €"},{"v":0,"d":"0 €"},{"$f":"K11+L11","v":{"v":0,"d":"0 €"}},{"$nulls":4},{"$f":"+IF(O11>0,O11*Q11*Masque!$H$3,P11*Q11*Masque!$H$4)","v":{"v":0,"d":"0 €"}}]
[{"$nulls":9},"(Vide)",{"v":0,"d":"0 €"},{"v":0,"d":"0 €"},{"v":0,"d":"0 €"},{"$nulls":4},{"$f":"+IF(O12>0,O12*Q12*Masque!$H$3,P12*Q12*Masque!$H$4)","v":{"v":0,"d":"0 €"}}]
[{"$nulls":9},"(Vide)",{"v":0,"d":"0 €"},{"v":0,"d":"0 €"},{"v":0,"d":"0 €"},{"$nulls":4},{"$f":"+IF(O13>0,O13*Q13*Masque!$H$3,P13*Q13*Masque!$H$4)","v":{"v":0,"d":"0 €"}}]
[{"$nulls":9},"(Vide)",{"v":0,"d":"0 €"},{"v":0,"d":"0 €"},{"v":0,"d":"0 €"},{"$nulls":4},{"$f":"+IF(O14>0,O14*Q14*Masque!$H$3,P14*Q14*Masque!$H$4)","v":{"v":0,"d":"0 €"}}]
[{"$nulls":9},"(Vide)",{"v":0,"d":"0 €"},{"v":0,"d":"0 €"},{"v":0,"d":"0 €"},{"$nulls":4},{"$f":"+IF(O15>0,O15*Q15*Masque!$H$3,P15*Q15*Masque!$H$4)","v":{"v":0,"d":"0 €"}}]
{"$rows_left_out":152}