{"text_format":"3","workbook":"xlsx","n_sheets":5,"sheets":["Feuil1","Feuil2","Feuil3","Fusion","resultat"],"not_rendered":{"macros":1,"defined_names":1},"read":"whole","date_system":"1900"}

{"sheet":"Feuil1","index":0,"n_rows":4,"n_cols":3,"rows_kept":4}
["nom","prenom","adresse"]
["A2","B2","C2"]
["A3","B3","C3"]
["A4","B4","C4"]

{"sheet":"Feuil2","index":1,"n_rows":6,"n_cols":3,"rows_kept":6}
["nom","prenom","adresse"]
["A2","B2","C2"]
["A3","B3","C3"]
["A4","B4","C4"]
["A5","B5","C5"]
["A6","B6","C6"]

{"sheet":"Feuil3","index":2,"n_rows":5,"n_cols":3,"rows_kept":5}
["nom","prenom","adresse"]
["A2","B2","C2"]
["A3","B3","C3"]
["A4","B4","C4"]
["A5","B5","C5"]

{"sheet":"Fusion","index":3,"n_rows":0,"n_cols":0,"rows_kept":0}

{"sheet":"resultat","index":4,"n_rows":19,"n_cols":10,"rows_kept":19}
[{"$nulls":3},"prenom","nom","adresse"]
[1,{"$f":"COUNTA(INDIRECT(\"Feuil\"&A2&\"!A:A\"))-1","v":3},{"$f":"\"Feuil\"&A2&\"!A1:C\"&COUNTA(INDIRECT(\"Feuil\"&A2&\"!A:A\"))","v":"Feuil1!A1:C4"},{"$f":"IF(ISERROR(INDEX(Feuil1!$A$1:$C$4,ROW(),MATCH(D1,Feuil1!1:1,0))),,INDEX(Feuil1!$A$1:$C$4,ROW(),MATCH(D1,Feuil1!1:1,0)))","v":"B2"},{"$f":"IF(ISERROR(INDEX(Feuil1!$A$1:$C$4,ROW(),MATCH(E1,Feuil1!1:1,0))),,INDEX(Feuil1!$A$1:$C$4,ROW(),MATCH(E1,Feuil1!1:1,0)))","v":"A2"},{"$f":"IF(ISERROR(INDEX(Feuil1!$A$1:$C$4,ROW(),MATCH(F1,Feuil1!1:1,0))),,INDEX(Feuil1!$A$1:$C$4,ROW(),MATCH(F1,Feuil1!1:1,0)))","v":"C2"},null,{"$f":"IF(ISERROR(INDEX(INDIRECT($C2),ROW(),MATCH(D$1,Feuil1!$1:$1,0))),,INDEX(INDIRECT($C2),ROW(),MATCH(D$1,Feuil1!$1:$1,0)))","v":"B2"},{"$f":"IF(ISERROR(INDEX(INDIRECT($C2),ROW(),MATCH(E$1,Feuil1!$1:$1,0))),,INDEX(INDIRECT($C2),ROW(),MATCH(E$1,Feuil1!$1:$1,0)))","v":"A2"},{"$f":"IF(ISERROR(INDEX(INDIRECT($C2),ROW(),MATCH(F$1,Feuil1!$1:$1,0))),,INDEX(INDIRECT($C2),ROW(),MATCH(F$1,Feuil1!$1:$1,0)))","v":"C2"}]
[1,{"$f":"IF(B2=0,COUNTA(INDIRECT(\"Feuil\"&A3&\"!A:A\"))-1,B2-1)","v":2},{"$f":"\"Feuil\"&A3&\"!A1:C\"&COUNTA(INDIRECT(\"Feuil\"&A3&\"!A:A\"))","v":"Feuil1!A1:C4"},{"$f":"IF(ISERROR(INDEX(Feuil1!$A$1:$C$4,ROW(),MATCH(D2,Feuil1!2:2,0))),,INDEX(Feuil1!$A$1:$C$4,ROW(),MATCH(D2,Feuil1!2:2,0)))","v":"B3"},{"$f":"IF(ISERROR(INDEX(Feuil1!$A$1:$C$4,ROW(),MATCH(E2,Feuil1!2:2,0))),,INDEX(Feuil1!$A$1:$C$4,ROW(),MATCH(E2,Feuil1!2:2,0)))","v":"A3"},{"$f":"IF(ISERROR(INDEX(Feuil1!$A$1:$C$4,ROW(),MATCH(F2,Feuil1!2:2,0))),,INDEX(Feuil1!$A$1:$C$4,ROW(),MATCH(F2,Feuil1!2:2,0)))","v":"C3"},null,{"$f":"IF(ISERROR(INDEX(INDIRECT($C3),ROW(),MATCH(D$1,Feuil1!$1:$1,0))),,INDEX(INDIRECT($C3),ROW(),MATCH(D$1,Feuil1!$1:$1,0)))","v":"B3"},{"$f":"IF(ISERROR(INDEX(INDIRECT($C3),ROW(),MATCH(E$1,Feuil1!$1:$1,0))),,INDEX(INDIRECT($C3),ROW(),MATCH(E$1,Feuil1!$1:$1,0)))","v":"A3"},{"$f":"IF(ISERROR(INDEX(INDIRECT($C3),ROW(),MATCH(F$1,Feuil1!$1:$1,0))),,INDEX(INDIRECT($C3),ROW(),MATCH(F$1,Feuil1!$1:$1,0)))","v":"C3"}]
[1,{"$f":"IF(B3=0,COUNTA(INDIRECT(\"Feuil\"&A4&\"!A:A\"))-1,B3-1)","v":1},{"$f":"\"Feuil\"&A4&\"!A1:C\"&COUNTA(INDIRECT(\"Feuil\"&A4&\"!A:A\"))","v":"Feuil1!A1:C4"},{"$f":"IF(ISERROR(INDEX(Feuil1!$A$1:$C$4,ROW(),MATCH(D3,Feuil1!3:3,0))),,INDEX(Feuil1!$A$1:$C$4,ROW(),MATCH(D3,Feuil1!3:3,0)))","v":"B4"},{"$f":"IF(ISERROR(INDEX(Feuil1!$A$1:$C$4,ROW(),MATCH(E3,Feuil1!3:3,0))),,INDEX(Feuil1!$A$1:$C$4,ROW(),MATCH(E3,Feuil1!3:3,0)))","v":"A4"},{"$f":"IF(ISERROR(INDEX(Feuil1!$A$1:$C$4,ROW(),MATCH(F3,Feuil1!3:3,0))),,INDEX(Feuil1!$A$1:$C$4,ROW(),MATCH(F3,Feuil1!3:3,0)))","v":"C4"},null,{"$f":"IF(ISERROR(INDEX(INDIRECT($C4),ROW(),MATCH(D$1,Feuil1!$1:$1,0))),,INDEX(INDIRECT($C4),ROW(),MATCH(D$1,Feuil1!$1:$1,0)))","v":"B4"},{"$f":"IF(ISERROR(INDEX(INDIRECT($C4),ROW(),MATCH(E$1,Feuil1!$1:$1,0))),,INDEX(INDIRECT($C4),ROW(),MATCH(E$1,Feuil1!$1:$1,0)))","v":"A4"},{"$f":"IF(ISERROR(INDEX(INDIRECT($C4),ROW(),MATCH(F$1,Feuil1!$1:$1,0))),,INDEX(INDIRECT($C4),ROW(),MATCH(F$1,Feuil1!$1:$1,0)))","v":"C4"}]
[1,0,{"$f":"\"Feuil\"&A5&\"!A1:C\"&COUNTA(INDIRECT(\"Feuil\"&A5&\"!A:A\"))","v":"Feuil1!A1:C4"},{"$f":"IF(ISERROR(INDEX(Feuil1!$A$1:$C$4,ROW(),MATCH(D4,Feuil1!4:4,0))),,INDEX(Feuil1!$A$1:$C$4,ROW(),MATCH(D4,Feuil1!4:4,0)))","v":0},{"$f":"IF(ISERROR(INDEX(Feuil1!$A$1:$C$4,ROW(),MATCH(E4,Feuil1!4:4,0))),,INDEX(Feuil1!$A$1:$C$4,ROW(),MATCH(E4,Feuil1!4:4,0)))","v":0},{"$f":"IF(ISERROR(INDEX(Feuil1!$A$1:$C$4,ROW(),MATCH(F4,Feuil1!4:4,0))),,INDEX(Feuil1!$A$1:$C$4,ROW(),MATCH(F4,Feuil1!4:4,0)))","v":0},null,{"$f":"IF(ISERROR(INDEX(INDIRECT($C5),ROW(),MATCH(D$1,Feuil1!$1:$1,0))),,INDEX(INDIRECT($C5),ROW(),MATCH(D$1,Feuil1!$1:$1,0)))","v":0},{"$f":"IF(ISERROR(INDEX(INDIRECT($C5),ROW(),MATCH(E$1,Feuil1!$1:$1,0))),,INDEX(INDIRECT($C5),ROW(),MATCH(E$1,Feuil1!$1:$1,0)))","v":0},{"$f":"IF(ISERROR(INDEX(INDIRECT($C5),ROW(),MATCH(F$1,Feuil1!$1:$1,0))),,INDEX(INDIRECT($C5),ROW(),MATCH(F$1,Feuil1!$1:$1,0)))","v":0}]
[{"$f":"IF(B5=0,A5+1,A5)","v":2},5,{"$f":"\"Feuil\"&A6&\"!A1:C\"&COUNTA(INDIRECT(\"Feuil\"&A6&\"!A:A\"))","v":"Feuil2!A1:C6"},{"$f":"IF(ISERROR(INDEX(Feuil1!$A$1:$C$4,ROW(),MATCH(D5,Feuil1!5:5,0))),,INDEX(Feuil1!$A$1:$C$4,ROW(),MATCH(D5,Feuil1!5:5,0)))","v":0},{"$f":"IF(ISERROR(INDEX(Feuil1!$A$1:$C$4,ROW(),MATCH(E5,Feuil1!5:5,0))),,INDEX(Feuil1!$A$1:$C$4,ROW(),MATCH(E5,Feuil1!5:5,0)))","v":0},{"$f":"IF(ISERROR(INDEX(Feuil1!$A$1:$C$4,ROW(),MATCH(F5,Feuil1!5:5,0))),,INDEX(Feuil1!$A$1:$C$4,ROW(),MATCH(F5,Feuil1!5:5,0)))","v":0},null,{"$f":"IF(ISERROR(INDEX(INDIRECT($C6),ROW(),MATCH(D$1,Feuil1!$1:$1,0))),,INDEX(INDIRECT($C6),ROW(),MATCH(D$1,Feuil1!$1:$1,0)))","v":"B6"},{"$f":"IF(ISERROR(INDEX(INDIRECT($C6),ROW(),MATCH(E$1,Feuil1!$1:$1,0))),,INDEX(INDIRECT($C6),ROW(),MATCH(E$1,Feuil1!$1:$1,0)))","v":"A6"},{"$f":"IF(ISERROR(INDEX(INDIRECT($C6),ROW(),MATCH(F$1,Feuil1!$1:$1,0))),,INDEX(INDIRECT($C6),ROW(),MATCH(F$1,Feuil1!$1:$1,0)))","v":"C6"}]
[{"$f":"IF(B6=0,A6+1,A6)","v":2},4,{"$f":"\"Feuil\"&A7&\"!A1:C\"&COUNTA(INDIRECT(\"Feuil\"&A7&\"!A:A\"))","v":"Feuil2!A1:C6"},{"$nulls":4},{"$f":"IF(ISERROR(INDEX(INDIRECT($C7),ROW(),MATCH(D$1,Feuil1!$1:$1,0))),,INDEX(INDIRECT($C7),ROW(),MATCH(D$1,Feuil1!$1:$1,0)))","v":0},{"$f":"IF(ISERROR(INDEX(INDIRECT($C7),ROW(),MATCH(E$1,Feuil1!$1:$1,0))),,INDEX(INDIRECT($C7),ROW(),MATCH(E$1,Feuil1!$1:$1,0)))","v":0},{"$f":"IF(ISERROR(INDEX(INDIRECT($C7),ROW(),MATCH(F$1,Feuil1!$1:$1,0))),,INDEX(INDIRECT($C7),ROW(),MATCH(F$1,Feuil1!$1:$1,0)))","v":0}]
[2,3,"Feuil2!A1:C6",{"$f":"IF(ISERROR(INDEX(Feuil1!$A$1:$C$4,ROW(),MATCH(D2,Feuil1!2:2,0))),,INDEX(Feuil1!$A$1:$C$4,ROW(),MATCH(D2,Feuil1!2:2,0)))","v":0},{"$f":"IF(ISERROR(INDEX(Feuil1!$A$1:$C$4,ROW(),MATCH(E2,Feuil1!2:2,0))),,INDEX(Feuil1!$A$1:$C$4,ROW(),MATCH(E2,Feuil1!2:2,0)))","v":0},{"$f":"IF(ISERROR(INDEX(Feuil1!$A$1:$C$4,ROW(),MATCH(F2,Feuil1!2:2,0))),,INDEX(Feuil1!$A$1:$C$4,ROW(),MATCH(F2,Feuil1!2:2,0)))","v":0},null,{"$f":"IF(ISERROR(INDEX(INDIRECT($C8),ROW(),MATCH(D$1,Feuil1!$1:$1,0))),,INDEX(INDIRECT($C8),ROW(),MATCH(D$1,Feuil1!$1:$1,0)))","v":0},{"$f":"IF(ISERROR(INDEX(INDIRECT($C8),ROW(),MATCH(E$1,Feuil1!$1:$1,0))),,INDEX(INDIRECT($C8),ROW(),MATCH(E$1,Feuil1!$1:$1,0)))","v":0},{"$f":"IF(ISERROR(INDEX(INDIRECT($C8),ROW(),MATCH(F$1,Feuil1!$1:$1,0))),,INDEX(INDIRECT($C8),ROW(),MATCH(F$1,Feuil1!$1:$1,0)))","v":0}]
[2,2,"Feuil2!A1:C6",{"$f":"IF(ISERROR(INDEX(Feuil1!$A$1:$C$4,ROW(),MATCH(D8,Feuil1!3:3,0))),,INDEX(Feuil1!$A$1:$C$4,ROW(),MATCH(D8,Feuil1!3:3,0)))","v":0},{"$f":"IF(ISERROR(INDEX(Feuil1!$A$1:$C$4,ROW(),MATCH(E8,Feuil1!3:3,0))),,INDEX(Feuil1!$A$1:$C$4,ROW(),MATCH(E8,Feuil1!3:3,0)))","v":0},{"$f":"IF(ISERROR(INDEX(Feuil1!$A$1:$C$4,ROW(),MATCH(F8,Feuil1!3:3,0))),,INDEX(Feuil1!$A$1:$C$4,ROW(),MATCH(F8,Feuil1!3:3,0)))","v":0},null,{"$f":"IF(ISERROR(INDEX(INDIRECT($C9),ROW(),MATCH(D$1,Feuil1!$1:$1,0))),,INDEX(INDIRECT($C9),ROW(),MATCH(D$1,Feuil1!$1:$1,0)))","v":0},{"$f":"IF(ISERROR(INDEX(INDIRECT($C9),ROW(),MATCH(E$1,Feuil1!$1:$1,0))),,INDEX(INDIRECT($C9),ROW(),MATCH(E$1,Feuil1!$1:$1,0)))","v":0},{"$f":"IF(ISERROR(INDEX(INDIRECT($C9),ROW(),MATCH(F$1,Feuil1!$1:$1,0))),,INDEX(INDIRECT($C9),ROW(),MATCH(F$1,Feuil1!$1:$1,0)))","v":0}]
[2,1,"Feuil2!A1:C6",{"$f":"IF(ISERROR(INDEX(Feuil1!$A$1:$C$4,ROW(),MATCH(D9,Feuil1!4:4,0))),,INDEX(Feuil1!$A$1:$C$4,ROW(),MATCH(D9,Feuil1!4:4,0)))","v":0},{"$f":"IF(ISERROR(INDEX(Feuil1!$A$1:$C$4,ROW(),MATCH(E9,Feuil1!4:4,0))),,INDEX(Feuil1!$A$1:$C$4,ROW(),MATCH(E9,Feuil1!4:4,0)))","v":0},{"$f":"IF(ISERROR(INDEX(Feuil1!$A$1:$C$4,ROW(),MATCH(F9,Feuil1!4:4,0))),,INDEX(Feuil1!$A$1:$C$4,ROW(),MATCH(F9,Feuil1!4:4,0)))","v":0},{"$f":"IF(ISERROR(INDEX(INDIRECT($C$2),ROW(),MATCH(D9,Feuil1!4:4,0))),,INDEX(INDIRECT($C$2),ROW(),MATCH(D9,Feuil1!4:4,0)))","v":0},{"$f":"IF(ISERROR(INDEX(INDIRECT($C10),ROW(),MATCH(D$1,Feuil1!$1:$1,0))),,INDEX(INDIRECT($C10),ROW(),MATCH(D$1,Feuil1!$1:$1,0)))","v":0},{"$f":"IF(ISERROR(INDEX(INDIRECT($C10),ROW(),MATCH(E$1,Feuil1!$1:$1,0))),,INDEX(INDIRECT($C10),ROW(),MATCH(E$1,Feuil1!$1:$1,0)))","v":0},{"$f":"IF(ISERROR(INDEX(INDIRECT($C10),ROW(),MATCH(F$1,Feuil1!$1:$1,0))),,INDEX(INDIRECT($C10),ROW(),MATCH(F$1,Feuil1!$1:$1,0)))","v":0}]
[2,0,"Feuil2!A1:C6",{"$f":"IF(ISERROR(INDEX(Feuil1!$A$1:$C$4,ROW(),MATCH(D10,Feuil1!5:5,0))),,INDEX(Feuil1!$A$1:$C$4,ROW(),MATCH(D10,Feuil1!5:5,0)))","v":0},{"$f":"IF(ISERROR(INDEX(Feuil1!$A$1:$C$4,ROW(),MATCH(E10,Feuil1!5:5,0))),,INDEX(Feuil1!$A$1:$C$4,ROW(),MATCH(E10,Feuil1!5:5,0)))","v":0},{"$f":"IF(ISERROR(INDEX(Feuil1!$A$1:$C$4,ROW(),MATCH(F10,Feuil1!5:5,0))),,INDEX(Feuil1!$A$1:$C$4,ROW(),MATCH(F10,Feuil1!5:5,0)))","v":0},null,{"$f":"IF(ISERROR(INDEX(INDIRECT($C11),ROW(),MATCH(D$1,Feuil1!$1:$1,0))),,INDEX(INDIRECT($C11),ROW(),MATCH(D$1,Feuil1!$1:$1,0)))","v":0},{"$f":"IF(ISERROR(INDEX(INDIRECT($C11),ROW(),MATCH(E$1,Feuil1!$1:$1,0))),,INDEX(INDIRECT($C11),ROW(),MATCH(E$1,Feuil1!$1:$1,0)))","v":0},{"$f":"IF(ISERROR(INDEX(INDIRECT($C11),ROW(),MATCH(F$1,Feuil1!$1:$1,0))),,INDEX(INDIRECT($C11),ROW(),MATCH(F$1,Feuil1!$1:$1,0)))","v":0}]
[3,4,"Feuil3!A1:C5",{"$f":"IF(ISERROR(INDEX(Feuil1!$A$1:$C$4,ROW(),MATCH(D11,Feuil1!6:6,0))),,INDEX(Feuil1!$A$1:$C$4,ROW(),MATCH(D11,Feuil1!6:6,0)))","v":0},{"$f":"IF(ISERROR(INDEX(Feuil1!$A$1:$C$4,ROW(),MATCH(E11,Feuil1!6:6,0))),,INDEX(Feuil1!$A$1:$C$4,ROW(),MATCH(E11,Feuil1!6:6,0)))","v":0},{"$f":"IF(ISERROR(INDEX(Feuil1!$A$1:$C$4,ROW(),MATCH(F11,Feuil1!6:6,0))),,INDEX(Feuil1!$A$1:$C$4,ROW(),MATCH(F11,Feuil1!6:6,0)))","v":0},null,{"$f":"IF(ISERROR(INDEX(INDIRECT($C12),ROW(),MATCH(D$1,Feuil1!$1:$1,0))),,INDEX(INDIRECT($C12),ROW(),MATCH(D$1,Feuil1!$1:$1,0)))","v":0},{"$f":"IF(ISERROR(INDEX(INDIRECT($C12),ROW(),MATCH(E$1,Feuil1!$1:$1,0))),,INDEX(INDIRECT($C12),ROW(),MATCH(E$1,Feuil1!$1:$1,0)))","v":0},{"$f":"IF(ISERROR(INDEX(INDIRECT($C12),ROW(),MATCH(F$1,Feuil1!$1:$1,0))),,INDEX(INDIRECT($C12),ROW(),MATCH(F$1,Feuil1!$1:$1,0)))","v":0}]
[3,3,"Feuil3!A1:C5",{"$f":"IF(ISERROR(INDEX(Feuil1!$A$1:$C$4,ROW(),MATCH(D12,Feuil1!7:7,0))),,INDEX(Feuil1!$A$1:$C$4,ROW(),MATCH(D12,Feuil1!7:7,0)))","v":0},{"$f":"IF(ISERROR(INDEX(Feuil1!$A$1:$C$4,ROW(),MATCH(E12,Feuil1!7:7,0))),,INDEX(Feuil1!$A$1:$C$4,ROW(),MATCH(E12,Feuil1!7:7,0)))","v":0},{"$f":"IF(ISERROR(INDEX(Feuil1!$A$1:$C$4,ROW(),MATCH(F12,Feuil1!7:7,0))),,INDEX(Feuil1!$A$1:$C$4,ROW(),MATCH(F12,Feuil1!7:7,0)))","v":0},null,{"$f":"IF(ISERROR(INDEX(INDIRECT($C13),ROW(),MATCH(D$1,Feuil1!$1:$1,0))),,INDEX(INDIRECT($C13),ROW(),MATCH(D$1,Feuil1!$1:$1,0)))","v":0},{"$f":"IF(ISERROR(INDEX(INDIRECT($C13),ROW(),MATCH(E$1,Feuil1!$1:$1,0))),,INDEX(INDIRECT($C13),ROW(),MATCH(E$1,Feuil1!$1:$1,0)))","v":0},{"$f":"IF(ISERROR(INDEX(INDIRECT($C13),ROW(),MATCH(F$1,Feuil1!$1:$1,0))),,INDEX(INDIRECT($C13),ROW(),MATCH(F$1,Feuil1!$1:$1,0)))","v":0}]
[3,2,"Feuil3!A1:C5",{"$f":"IF(ISERROR(INDEX(Feuil1!$A$1:$C$4,ROW(),MATCH(D13,Feuil1!8:8,0))),,INDEX(Feuil1!$A$1:$C$4,ROW(),MATCH(D13,Feuil1!8:8,0)))","v":0},{"$f":"IF(ISERROR(INDEX(Feuil1!$A$1:$C$4,ROW(),MATCH(E13,Feuil1!8:8,0))),,INDEX(Feuil1!$A$1:$C$4,ROW(),MATCH(E13,Feuil1!8:8,0)))","v":0},{"$f":"IF(ISERROR(INDEX(Feuil1!$A$1:$C$4,ROW(),MATCH(F13,Feuil1!8:8,0))),,INDEX(Feuil1!$A$1:$C$4,ROW(),MATCH(F13,Feuil1!8:8,0)))","v":0},null,{"$f":"IF(ISERROR(INDEX(INDIRECT($C14),ROW(),MATCH(D$1,Feuil1!$1:$1,0))),,INDEX(INDIRECT($C14),ROW(),MATCH(D$1,Feuil1!$1:$1,0)))","v":0},{"$f":"IF(ISERROR(INDEX(INDIRECT($C14),ROW(),MATCH(E$1,Feuil1!$1:$1,0))),,INDEX(INDIRECT($C14),ROW(),MATCH(E$1,Feuil1!$1:$1,0)))","v":0},{"$f":"IF(ISERROR(INDEX(INDIRECT($C14),ROW(),MATCH(F$1,Feuil1!$1:$1,0))),,INDEX(INDIRECT($C14),ROW(),MATCH(F$1,Feuil1!$1:$1,0)))","v":0}]
[3,1,"Feuil3!A1:C5",{"$f":"IF(ISERROR(INDEX(Feuil1!$A$1:$C$4,ROW(),MATCH(D14,Feuil1!9:9,0))),,INDEX(Feuil1!$A$1:$C$4,ROW(),MATCH(D14,Feuil1!9:9,0)))","v":0},{"$f":"IF(ISERROR(INDEX(Feuil1!$A$1:$C$4,ROW(),MATCH(E14,Feuil1!9:9,0))),,INDEX(Feuil1!$A$1:$C$4,ROW(),MATCH(E14,Feuil1!9:9,0)))","v":0},{"$f":"IF(ISERROR(INDEX(Feuil1!$A$1:$C$4,ROW(),MATCH(F14,Feuil1!9:9,0))),,INDEX(Feuil1!$A$1:$C$4,ROW(),MATCH(F14,Feuil1!9:9,0)))","v":0},null,{"$f":"IF(ISERROR(INDEX(INDIRECT($C15),ROW(),MATCH(D$1,Feuil1!$1:$1,0))),,INDEX(INDIRECT($C15),ROW(),MATCH(D$1,Feuil1!$1:$1,0)))","v":0},{"$f":"IF(ISERROR(INDEX(INDIRECT($C15),ROW(),MATCH(E$1,Feuil1!$1:$1,0))),,INDEX(INDIRECT($C15),ROW(),MATCH(E$1,Feuil1!$1:$1,0)))","v":0},{"$f":"IF(ISERROR(INDEX(INDIRECT($C15),ROW(),MATCH(F$1,Feuil1!$1:$1,0))),,INDEX(INDIRECT($C15),ROW(),MATCH(F$1,Feuil1!$1:$1,0)))","v":0}]
[{"$f":"IF(B15=0,A15+1,A15)","v":3},0,null,{"$f":"IF(ISERROR(INDEX(Feuil1!$A$1:$C$4,ROW(),MATCH(D15,Feuil1!10:10,0))),,INDEX(Feuil1!$A$1:$C$4,ROW(),MATCH(D15,Feuil1!10:10,0)))","v":0},{"$f":"IF(ISERROR(INDEX(Feuil1!$A$1:$C$4,ROW(),MATCH(E15,Feuil1!10:10,0))),,INDEX(Feuil1!$A$1:$C$4,ROW(),MATCH(E15,Feuil1!10:10,0)))","v":0},{"$f":"IF(ISERROR(INDEX(Feuil1!$A$1:$C$4,ROW(),MATCH(F15,Feuil1!10:10,0))),,INDEX(Feuil1!$A$1:$C$4,ROW(),MATCH(F15,Feuil1!10:10,0)))","v":0},null,{"$f":"IF(ISERROR(INDEX(INDIRECT($C16),ROW(),MATCH(D$1,Feuil1!$1:$1,0))),,INDEX(INDIRECT($C16),ROW(),MATCH(D$1,Feuil1!$1:$1,0)))","v":0},{"$f":"IF(ISERROR(INDEX(INDIRECT($C16),ROW(),MATCH(E$1,Feuil1!$1:$1,0))),,INDEX(INDIRECT($C16),ROW(),MATCH(E$1,Feuil1!$1:$1,0)))","v":0},{"$f":"IF(ISERROR(INDEX(INDIRECT($C16),ROW(),MATCH(F$1,Feuil1!$1:$1,0))),,INDEX(INDIRECT($C16),ROW(),MATCH(F$1,Feuil1!$1:$1,0)))","v":0}]
[{"$f":"IF(B16=0,A16+1,A16)","v":4},0,null,{"$f":"IF(ISERROR(INDEX(Feuil1!$A$1:$C$4,ROW(),MATCH(D16,Feuil1!11:11,0))),,INDEX(Feuil1!$A$1:$C$4,ROW(),MATCH(D16,Feuil1!11:11,0)))","v":0},{"$f":"IF(ISERROR(INDEX(Feuil1!$A$1:$C$4,ROW(),MATCH(E16,Feuil1!11:11,0))),,INDEX(Feuil1!$A$1:$C$4,ROW(),MATCH(E16,Feuil1!11:11,0)))","v":0},{"$f":"IF(ISERROR(INDEX(Feuil1!$A$1:$C$4,ROW(),MATCH(F16,Feuil1!11:11,0))),,INDEX(Feuil1!$A$1:$C$4,ROW(),MATCH(F16,Feuil1!11:11,0)))","v":0},null,{"$f":"IF(ISERROR(INDEX(INDIRECT($C17),ROW(),MATCH(D$1,Feuil1!$1:$1,0))),,INDEX(INDIRECT($C17),ROW(),MATCH(D$1,Feuil1!$1:$1,0)))","v":0},{"$f":"IF(ISERROR(INDEX(INDIRECT($C17),ROW(),MATCH(E$1,Feuil1!$1:$1,0))),,INDEX(INDIRECT($C17),ROW(),MATCH(E$1,Feuil1!$1:$1,0)))","v":0},{"$f":"IF(ISERROR(INDEX(INDIRECT($C17),ROW(),MATCH(F$1,Feuil1!$1:$1,0))),,INDEX(INDIRECT($C17),ROW(),MATCH(F$1,Feuil1!$1:$1,0)))","v":0}]
[{"$f":"IF(B17=0,A17+1,A17)","v":5},{"$f":"COUNTA(INDIRECT(\"Feuil\"&A18&\"!A:A\"))","v":1},{"$nulls":5},{"$f":"IF(ISERROR(INDEX(INDIRECT($C18),ROW(),MATCH(D$1,Feuil1!$1:$1,0))),,INDEX(INDIRECT($C18),ROW(),MATCH(D$1,Feuil1!$1:$1,0)))","v":0},{"$f":"IF(ISERROR(INDEX(INDIRECT($C18),ROW(),MATCH(E$1,Feuil1!$1:$1,0))),,INDEX(INDIRECT($C18),ROW(),MATCH(E$1,Feuil1!$1:$1,0)))","v":0},{"$f":"IF(ISERROR(INDEX(INDIRECT($C18),ROW(),MATCH(F$1,Feuil1!$1:$1,0))),,INDEX(INDIRECT($C18),ROW(),MATCH(F$1,Feuil1!$1:$1,0)))","v":0}]
[{"$nulls":7},{"$f":"IF(ISERROR(INDEX(INDIRECT($C19),ROW(),MATCH(D$1,Feuil1!$1:$1,0))),,INDEX(INDIRECT($C19),ROW(),MATCH(D$1,Feuil1!$1:$1,0)))","v":0},{"$f":"IF(ISERROR(INDEX(INDIRECT($C19),ROW(),MATCH(E$1,Feuil1!$1:$1,0))),,INDEX(INDIRECT($C19),ROW(),MATCH(E$1,Feuil1!$1:$1,0)))","v":0},{"$f":"IF(ISERROR(INDEX(INDIRECT($C19),ROW(),MATCH(F$1,Feuil1!$1:$1,0))),,INDEX(INDIRECT($C19),ROW(),MATCH(F$1,Feuil1!$1:$1,0)))","v":0}]