{"text_format":"3","workbook":"xlsx","n_sheets":6,"sheets":["Questions","Feuil2","Nombre","Calendrier","Verbe","Liste"],"not_rendered":{"images":9,"macros":1,"defined_names":5},"read":"whole","date_system":"1900"}

{"sheet":"Questions","index":0,"n_rows":38,"n_cols":6,"rows_kept":38}
{"$rows_empty":7}
[{"$nulls":5},"Sujet"]
[{"$nulls":5},"Nombre"]
[null,"Lundi",{"$nulls":3},"Calendrier"]
[{"$nulls":5},"Verbe"]
[]
[]
[{"$nulls":4},"A19, je sélectionne la matière."]
[{"$nulls":4},"A23, En principe, s'affiche la question. Même fonctionnement que B36"]
[]
[]
[]
[null,"Sujet"]
[]
[]
[]
[null,{"$f":"INDEX(B19,RANDBETWEEN(1,COUNTA(B19)))","v":"Sujet"}]
[]
[]
[]
[{"$nulls":4},"B35= résultat du tirage au sort.  (Bouton \"Nouvelle question\")"]
[{"$nulls":4},"B36= la question c'est quoi l'image? (bien sur le mot ne sera pas affiché)."]
[{"$nulls":4},"B37= la réponse qui sera entrée au clavier."]
[]
[{"$nulls":4},"B38= Si ma réponse est bonne. ( Comparaison entre  B37 et B36) \"Bravo\". Si la réponse est fausse \"erreur\""]
[{"$nulls":4},"Validation de la réponse  par le Bouton \"Validation de la réponse\""]
[]
[]
["Sujet",{"$f":"INDEX(Nom,RANDBETWEEN(1,COUNTA(Nom)))","v":"Vache"}]
["Question",{"$f":"INDEX(Feuil2!A2:A8,MATCH(Questions!B35,Nom,0))","v":"Vache"}]
["Réponse"]
[null,{"$f":"IF(B37=B36,\"Bravo\",\"Erreur\")","v":"Erreur"}]

{"sheet":"Feuil2","index":1,"n_rows":101,"n_cols":8,"rows_kept":101}
["Nom","Masc/pluriel","Féminin","Fémin/Pluriel","Petits","Pluriel",null,"Photos"]
["Canard",{"$nulls":3},"Caneton",null,"Feuil2!H2"]
["Cheval",{"$nulls":3},"Poulain",null,"Feuil2!H3"]
["Chat",{"$nulls":3},"Chaton",null,"Feuil2!H4"]
["Chien",{"$nulls":3},"Chiot",null,"Feuil2!H5"]
["Oiseau",{"$nulls":3},"Oisillon",null,"Feuil2!H6"]
["Vache",{"$nulls":3},"Veau",null,"Feuil2!H7"]
["Poisson",{"$nulls":3},"Alevin",null,"Feuil2!H8"]
[{"$nulls":6},"Feuil2!H9"]
[{"$nulls":6},"Feuil2!H10"]
[{"$nulls":6},"Feuil2!H11"]
[{"$nulls":6},"Feuil2!H12"]
[{"$nulls":6},"Feuil2!H13"]
[{"$nulls":6},"Feuil2!H14"]
[{"$nulls":6},"Feuil2!H15"]
[{"$nulls":6},"Feuil2!H16"]
[{"$nulls":6},"Feuil2!H17"]
[{"$nulls":6},"Feuil2!H18"]
[{"$nulls":6},"Feuil2!H19"]
[{"$nulls":6},"Feuil2!H20"]
[{"$nulls":6},"Feuil2!H21"]
[{"$nulls":6},"Feuil2!H22"]
[{"$nulls":6},"Feuil2!H23"]
[{"$nulls":6},"Feuil2!H24"]
[{"$nulls":6},"Feuil2!H25"]
[{"$nulls":6},"Feuil2!H26"]
[{"$nulls":6},"Feuil2!H27"]
[{"$nulls":6},"Feuil2!H28"]
[{"$nulls":6},"Feuil2!H29"]
[{"$nulls":6},"Feuil2!H30"]
[{"$nulls":6},"Feuil2!H31"]
[{"$nulls":6},"Feuil2!H32"]
[{"$nulls":6},"Feuil2!H33"]
[{"$nulls":6},"Feuil2!H34"]
[{"$nulls":6},"Feuil2!H35"]
[{"$nulls":6},"Feuil2!H36"]
[{"$nulls":6},"Feuil2!H37"]
[{"$nulls":6},"Feuil2!H38"]
[{"$nulls":6},"Feuil2!H39"]
[{"$nulls":6},"Feuil2!H40"]
[{"$nulls":6},"Feuil2!H41"]
[{"$nulls":6},"Feuil2!H42"]
[{"$nulls":6},"Feuil2!H43"]
[{"$nulls":6},"Feuil2!H44"]
[{"$nulls":6},"Feuil2!H45"]
[{"$nulls":6},"Feuil2!H46"]
[{"$nulls":6},"Feuil2!H47"]
[{"$nulls":6},"Feuil2!H48"]
[{"$nulls":6},"Feuil2!H49"]
[{"$nulls":6},"Feuil2!H50"]
[{"$nulls":6},"Feuil2!H51"]
[{"$nulls":6},"Feuil2!H52"]
[{"$nulls":6},"Feuil2!H53"]
[{"$nulls":6},"Feuil2!H54"]
[{"$nulls":6},"Feuil2!H55"]
[{"$nulls":6},"Feuil2!H56"]
[{"$nulls":6},"Feuil2!H57"]
[{"$nulls":6},"Feuil2!H58"]
[{"$nulls":6},"Feuil2!H59"]
[{"$nulls":6},"Feuil2!H60"]
[{"$nulls":6},"Feuil2!H61"]
[{"$nulls":6},"Feuil2!H62"]
[{"$nulls":6},"Feuil2!H63"]
[{"$nulls":6},"Feuil2!H64"]
[{"$nulls":6},"Feuil2!H65"]
[{"$nulls":6},"Feuil2!H66"]
[{"$nulls":6},"Feuil2!H67"]
[{"$nulls":6},"Feuil2!H68"]
[{"$nulls":6},"Feuil2!H69"]
[{"$nulls":6},"Feuil2!H70"]
[{"$nulls":6},"Feuil2!H71"]
[{"$nulls":6},"Feuil2!H72"]
[{"$nulls":6},"Feuil2!H73"]
[{"$nulls":6},"Feuil2!H74"]
[{"$nulls":6},"Feuil2!H75"]
[{"$nulls":6},"Feuil2!H76"]
[{"$nulls":6},"Feuil2!H77"]
[{"$nulls":6},"Feuil2!H78"]
[{"$nulls":6},"Feuil2!H79"]
[{"$nulls":6},"Feuil2!H80"]
[{"$nulls":6},"Feuil2!H81"]
[{"$nulls":6},"Feuil2!H82"]
[{"$nulls":6},"Feuil2!H83"]
[{"$nulls":6},"Feuil2!H84"]
[{"$nulls":6},"Feuil2!H85"]
[{"$nulls":6},"Feuil2!H86"]
[{"$nulls":6},"Feuil2!H87"]
[{"$nulls":6},"Feuil2!H88"]
[{"$nulls":6},"Feuil2!H89"]
[{"$nulls":6},"Feuil2!H90"]
[{"$nulls":6},"Feuil2!H91"]
[{"$nulls":6},"Feuil2!H92"]
[{"$nulls":6},"Feuil2!H93"]
[{"$nulls":6},"Feuil2!H94"]
[{"$nulls":6},"Feuil2!H95"]
[{"$nulls":6},"Feuil2!H96"]
[{"$nulls":6},"Feuil2!H97"]
[{"$nulls":6},"Feuil2!H98"]
[{"$nulls":6},"Feuil2!H99"]
[{"$nulls":6},"Feuil2!H100"]
[{"$nulls":6},"Feuil2!H101"]

{"sheet":"Nombre","index":2,"n_rows":11,"n_cols":1,"rows_kept":11}
["Nombre"]
[1]
[2]
[3]
[4]
[5]
[6]
[7]
[8]
[9]
[10]

{"sheet":"Calendrier","index":3,"n_rows":8,"n_cols":1,"rows_kept":8}
["Calendrier"]
["Lundi"]
["Mardi"]
["Mercredi"]
["Jeudi"]
["Vendredi"]
["Samedi"]
["Dimanche"]

{"sheet":"Verbe","index":4,"n_rows":7,"n_cols":1,"rows_kept":7}
["Verbe"]
["Avoir"]
["Etre"]
["Lire"]
["Ecrire"]
["Apprendre"]
["Habiter"]

{"sheet":"Liste","index":5,"n_rows":4,"n_cols":1,"rows_kept":4}
["Nombre"]
["Sujet"]
["Calendrier"]
["Verbe"]