{"text_format":"3","workbook":"xlsx","n_sheets":4,"sheets":["Planning","Feuil1","Feuil2","Plan"],"not_rendered":{"macros":1,"defined_names":1},"read":"whole","date_system":"1900"}

{"sheet":"Planning","index":0,"n_rows":199,"n_cols":20,"rows_kept":199,"merged":[[0,1,0,19],[1,1,2,19],[4,4,4,5],[4,6,4,7],[4,8,4,9],[4,10,4,11],[4,12,4,13],[4,14,4,15],[4,16,4,17],[4,18,4,19],[5,3,5,5],[5,6,5,7],[5,8,5,9],[5,10,5,11],[5,12,5,13],[5,14,5,15],[5,16,5,17],[5,18,5,19],[8,1,8,19],[9,3,9,4],[9,6,9,7],[9,8,9,9],[9,10,9,11],[9,12,9,13],[9,14,9,15],[9,16,9,17],[9,18,9,19],[10,3,11,5],[10,6,11,6],[10,7,11,7],[10,8,11,8],[10,9,11,9],[10,10,11,10],[10,11,11,11],[10,12,11,12],[10,13,11,13],[10,14,11,14],[10,15,11,15],[10,16,11,16],[10,17,11,17],[10,18,11,18],[10,19,11,19],[12,1,13,1],[12,2,13,2],[12,3,13,3],[12,4,13,4],[12,5,13,5],[12,6,13,7],[12,8,13,9],[12,10,13,11],[12,12,13,13],[12,14,13,15],[12,16,13,17],[12,18,13,19],[14,6,14,7],[14,8,14,9],[15,0,16,0],[15,1,16,1],[21,10,21,11],[22,0,23,0],[32,0,33,0],[66,0,67,0],[93,0,94,0],[115,0,116,0],[133,0,134,0],[150,0,151,0],[169,0,170,0],[180,0,180,19],[183,2,183,4],[183,6,183,7],[183,8,183,9],[183,10,183,11],[183,12,183,13],[183,14,183,15],[183,16,183,17],[183,18,183,19],[184,3,184,4],[184,6,184,7],[184,8,184,9],[184,10,184,11],[184,12,184,13],[184,14,184,15],[184,16,184,17],[184,18,184,19],[185,3,185,4],[185,6,185,7],[185,8,185,9],[185,10,185,11],[185,12,185,13],[185,14,185,15],[185,16,185,17],[185,18,185,19],[186,3,186,4],[186,6,186,7],[186,8,186,9],[186,10,186,11],[186,12,186,13],[186,14,186,15],[186,16,186,17],[186,18,186,19],[187,3,187,4],[187,6,187,7],[187,8,187,9],[187,10,187,11],[187,12,187,13],[187,14,187,15],[187,16,187,17],[187,18,187,19],[188,3,188,4],[188,6,188,7],[188,8,188,9],[188,10,188,11],[188,12,188,13],[188,14,188,15],[188,16,188,17],[188,18,188,19],[189,3,189,4],[189,6,189,7],[189,8,189,9],[189,10,189,11],[189,12,189,13],[189,14,189,15],[189,16,189,17],[189,18,189,19],[190,3,190,4],[190,6,190,7],[190,8,190,9],[190,10,190,11],[190,12,190,13],[190,14,190,15],[190,16,190,17],[190,18,190,19],[191,3,191,4],[191,6,191,7],[191,8,191,9],[191,10,191,11],[191,12,191,13],[191,14,191,15],[191,16,191,17],[191,18,191,19],[192,3,192,4],[192,6,192,7],[192,8,192,9],[192,10,192,11],[192,12,192,13],[192,14,192,15],[192,16,192,17],[192,18,192,19],[193,3,193,4],[193,6,193,7],[193,8,193,9],[193,10,193,11],[193,12,193,13],[193,14,193,15],[193,16,193,17],[193,18,193,19],[194,3,194,4],[194,6,194,7],[194,8,194,9],[194,10,194,11],[194,12,194,13],[194,14,194,15],[194,16,194,17],[194,18,194,19],[195,3,195,4],[195,6,195,7],[195,8,195,9],[195,10,195,11],[195,12,195,13],[195,14,195,15],[195,16,195,17],[195,18,195,19],[196,3,196,4],[196,6,196,7],[196,8,196,9],[196,10,196,11],[196,12,196,13],[196,14,196,15],[196,16,196,17],[196,18,196,19],[197,3,197,4],[197,6,197,7],[197,8,197,9],[197,10,197,11],[197,12,197,13],[197,14,197,15],[197,16,197,17],[197,18,197,19]]}
[]
[null,{"$f":"Plan!A2","v":"Semaine 16"}]
[]
[null,"une pause de 20 minutes est accordée pour tout horaire dépassant 6 heures consécutives",{"$nulls":17},96]
[{"$nulls":4},""]
[{"$nulls":3},"Nb heures Planifiées / Jour",null,null," 318h03",null," 395h21",null," 394h53",null," 443h23",null," 503h05",null," 500h59",null," 373h56"]
[]
[]
[null,{"$f":"Plan!B2","v":"Du lundi 13/04 au dimanche 19/04/2015"}]
[]
[{"$nulls":3},"SERVICE",null,null,"MIDI","SOIR","MIDI","SOIR","SOIR","SOIR","MIDI","SOIR","MIDI","SOIR","MIDI","SOIR","MIDI","SOIR"]
[]
[null,"QUALIFICATION","NOM","PRENOMS","CONTRAT","SOLDE\nHEBDO",{"$f":"Plan!A3","v":"2015-04-13"},null,{"$f":"Plan!C3","v":"2015-04-14"},null,{"$f":"Plan!E3","v":"2015-04-15"},null,{"$f":"Plan!G3","v":"2015-04-16"},null,{"$f":"Plan!I3","v":"2015-04-17"},null,{"$f":"Plan!K3","v":"2015-04-18"},null,{"$f":"Plan!M3","v":"2015-04-19"}]
[]
["130429","DIR",null,null,{"$f":"VLOOKUP(A15,Plan!$A$6:$V$123,3,TRUE)","v":"39h00"},{"$f":"VLOOKUP(A15,Plan!$A$6:$V$123,7,TRUE)","v":"31h12"},{"$f":"VLOOKUP(A15,Plan!$A$6:$V$123,8,TRUE)","v":"R"},null,{"$f":"VLOOKUP(A15,Plan!$A$6:$V$123,10,TRUE)","v":"R"},null,{"$f":"VLOOKUP(A15,Plan!$A$6:$V$123,12,TRUE)","v":"09h-17h18#"},{"$f":"VLOOKUP(A15,Plan!$A$6:$V$123,13,TRUE)","v":0},{"$f":"VLOOKUP(A15,Plan!$A$6:$V$123,14,TRUE)","v":"09h-17h18#"},{"$f":"VLOOKUP(A15,Plan!$A$6:$V$123,15,TRUE)","v":0},{"$f":"VLOOKUP(A15,Plan!$A$6:$V$123,16,TRUE)","v":"09h-17h18#"},{"$f":"VLOOKUP(A15,Plan!$A$6:$V$123,17,TRUE)","v":0},{"$f":"VLOOKUP(A15,Plan!$A$6:$V$123,18,TRUE)","v":"09h-17h18#"},{"$f":"VLOOKUP(A15,Plan!$A$6:$V$123,19,TRUE)","v":0},{"$f":"VLOOKUP(A15,Plan!$A$6:$V$123,20,TRUE)","v":"CP"},{"$f":"VLOOKUP(A15,Plan!$A$6:$V$123,21,TRUE)","v":0}]
["501221","DIR",null,null,{"$f":"VLOOKUP(A16,Plan!$A$6:$V$123,3,TRUE)","v":"35h00"},{"$f":"VLOOKUP(A16,Plan!$A$6:$V$123,7,TRUE)","v":"35h00"},{"$f":"VLOOKUP(A16,Plan!$A$6:$V$123,8,TRUE)","v":0},{"$f":"VLOOKUP(A16,Plan!$A$6:$V$123,9,TRUE)","v":"15h-22h30#"},{"$f":"VLOOKUP(A16,Plan!$A$6:$V$123,10,TRUE)","v":"R"},{"$f":"VLOOKUP(A16,Plan!$A$6:$V$123,11,TRUE)","v":0},{"$f":"VLOOKUP(A16,Plan!$A$6:$V$123,12,TRUE)","v":"R"},{"$f":"VLOOKUP(A16,Plan!$A$6:$V$123,13,TRUE)","v":0},{"$f":"VLOOKUP(A16,Plan!$A$6:$V$123,14,TRUE)","v":0},{"$f":"VLOOKUP(A16,Plan!$A$6:$V$123,15,TRUE)","v":"15h-22h30#"},{"$f":"VLOOKUP(A16,Plan!$A$6:$V$123,16,TRUE)","v":0},{"$f":"VLOOKUP(A16,Plan!$A$6:$V$123,17,TRUE)","v":"15h-22h30#"},{"$f":"VLOOKUP(A16,Plan!$A$6:$V$123,18,TRUE)","v":0},{"$f":"VLOOKUP(A16,Plan!$A$6:$V$123,19,TRUE)","v":"15h-22h30#"},{"$f":"VLOOKUP(A16,Plan!$A$6:$V$123,20,TRUE)","v":0},{"$f":"VLOOKUP(A16,Plan!$A$6:$V$123,21,TRUE)","v":"15h-22h30#"}]
[{"$nulls":4},{"$f":"VLOOKUP(A17,Plan!$A$6:$V$123,3,TRUE)","v":{"$error":"#N/A"}},{"$f":"VLOOKUP(A17,Plan!$A$6:$V$123,7,TRUE)","v":{"$error":"#N/A"}},{"$f":"VLOOKUP(A17,Plan!$A$6:$V$123,8,TRUE)","v":{"$error":"#N/A"}},{"$f":"VLOOKUP(A17,Plan!$A$6:$V$123,9,TRUE)","v":{"$error":"#N/A"}},{"$f":"VLOOKUP(A17,Plan!$A$6:$V$123,10,TRUE)","v":{"$error":"#N/A"}},{"$f":"VLOOKUP(A17,Plan!$A$6:$V$123,11,TRUE)","v":{"$error":"#N/A"}},{"$f":"VLOOKUP(A17,Plan!$A$6:$V$123,12,TRUE)","v":{"$error":"#N/A"}},{"$f":"VLOOKUP(A17,Plan!$A$6:$V$123,13,TRUE)","v":{"$error":"#N/A"}},{"$f":"VLOOKUP(A17,Plan!$A$6:$V$123,14,TRUE)","v":{"$error":"#N/A"}},{"$f":"VLOOKUP(A17,Plan!$A$6:$V$123,15,TRUE)","v":{"$error":"#N/A"}},{"$f":"VLOOKUP(A17,Plan!$A$6:$V$123,16,TRUE)","v":{"$error":"#N/A"}},{"$f":"VLOOKUP(A17,Plan!$A$6:$V$123,17,TRUE)","v":{"$error":"#N/A"}},{"$f":"VLOOKUP(A17,Plan!$A$6:$V$123,18,TRUE)","v":{"$error":"#N/A"}},{"$f":"VLOOKUP(A17,Plan!$A$6:$V$123,19,TRUE)","v":{"$error":"#N/A"}},{"$f":"VLOOKUP(A17,Plan!$A$6:$V$123,20,TRUE)","v":{"$error":"#N/A"}},{"$f":"VLOOKUP(A17,Plan!$A$6:$V$123,21,TRUE)","v":{"$error":"#N/A"}}]
[{"$nulls":4},{"$f":"VLOOKUP(A18,Plan!$A$6:$V$123,3,TRUE)","v":{"$error":"#N/A"}},{"$f":"VLOOKUP(A18,Plan!$A$6:$V$123,7,TRUE)","v":{"$error":"#N/A"}},{"$f":"VLOOKUP(A18,Plan!$A$6:$V$123,8,TRUE)","v":{"$error":"#N/A"}},{"$f":"VLOOKUP(A18,Plan!$A$6:$V$123,9,TRUE)","v":{"$error":"#N/A"}},{"$f":"VLOOKUP(A18,Plan!$A$6:$V$123,10,TRUE)","v":{"$error":"#N/A"}},{"$f":"VLOOKUP(A18,Plan!$A$6:$V$123,11,TRUE)","v":{"$error":"#N/A"}},{"$f":"VLOOKUP(A18,Plan!$A$6:$V$123,12,TRUE)","v":{"$error":"#N/A"}},{"$f":"VLOOKUP(A18,Plan!$A$6:$V$123,13,TRUE)","v":{"$error":"#N/A"}},{"$f":"VLOOKUP(A18,Plan!$A$6:$V$123,14,TRUE)","v":{"$error":"#N/A"}},{"$f":"VLOOKUP(A18,Plan!$A$6:$V$123,15,TRUE)","v":{"$error":"#N/A"}},{"$f":"VLOOKUP(A18,Plan!$A$6:$V$123,16,TRUE)","v":{"$error":"#N/A"}},{"$f":"VLOOKUP(A18,Plan!$A$6:$V$123,17,TRUE)","v":{"$error":"#N/A"}},{"$f":"VLOOKUP(A18,Plan!$A$6:$V$123,18,TRUE)","v":{"$error":"#N/A"}},{"$f":"VLOOKUP(A18,Plan!$A$6:$V$123,19,TRUE)","v":{"$error":"#N/A"}},{"$f":"VLOOKUP(A18,Plan!$A$6:$V$123,20,TRUE)","v":{"$error":"#N/A"}},{"$f":"VLOOKUP(A18,Plan!$A$6:$V$123,21,TRUE)","v":{"$error":"#N/A"}}]
[{"$nulls":4},{"$f":"VLOOKUP(A19,Plan!$A$6:$V$123,3,TRUE)","v":{"$error":"#N/A"}},{"$f":"VLOOKUP(A19,Plan!$A$6:$V$123,7,TRUE)","v":{"$error":"#N/A"}},{"$f":"VLOOKUP(A19,Plan!$A$6:$V$123,8,TRUE)","v":{"$error":"#N/A"}},{"$f":"VLOOKUP(A19,Plan!$A$6:$V$123,9,TRUE)","v":{"$error":"#N/A"}},{"$f":"VLOOKUP(A19,Plan!$A$6:$V$123,10,TRUE)","v":{"$error":"#N/A"}},{"$f":"VLOOKUP(A19,Plan!$A$6:$V$123,11,TRUE)","v":{"$error":"#N/A"}},{"$f":"VLOOKUP(A19,Plan!$A$6:$V$123,12,TRUE)","v":{"$error":"#N/A"}},{"$f":"VLOOKUP(A19,Plan!$A$6:$V$123,13,TRUE)","v":{"$error":"#N/A"}},{"$f":"VLOOKUP(A19,Plan!$A$6:$V$123,14,TRUE)","v":{"$error":"#N/A"}},{"$f":"VLOOKUP(A19,Plan!$A$6:$V$123,15,TRUE)","v":{"$error":"#N/A"}},{"$f":"VLOOKUP(A19,Plan!$A$6:$V$123,16,TRUE)","v":{"$error":"#N/A"}},{"$f":"VLOOKUP(A19,Plan!$A$6:$V$123,17,TRUE)","v":{"$error":"#N/A"}},{"$f":"VLOOKUP(A19,Plan!$A$6:$V$123,18,TRUE)","v":{"$error":"#N/A"}},{"$f":"VLOOKUP(A19,Plan!$A$6:$V$123,19,TRUE)","v":{"$error":"#N/A"}},{"$f":"VLOOKUP(A19,Plan!$A$6:$V$123,20,TRUE)","v":{"$error":"#N/A"}},{"$f":"VLOOKUP(A19,Plan!$A$6:$V$123,21,TRUE)","v":{"$error":"#N/A"}}]
["020729","D A ",null,null,{"$f":"VLOOKUP(A20,Plan!$A$6:$V$123,3,TRUE)","v":"39h00"},{"$f":"VLOOKUP(A20,Plan!$A$6:$V$123,7,TRUE)","v":"24h00"},{"$f":"VLOOKUP(A20,Plan!$A$6:$V$123,8,TRUE)","v":"CP"},{"$f":"VLOOKUP(A20,Plan!$A$6:$V$123,9,TRUE)","v":0},{"$f":"VLOOKUP(A20,Plan!$A$6:$V$123,10,TRUE)","v":"CP"},{"$f":"VLOOKUP(A20,Plan!$A$6:$V$123,11,TRUE)","v":0},{"$f":"VLOOKUP(A20,Plan!$A$6:$V$123,12,TRUE)","v":0},{"$f":"VLOOKUP(A20,Plan!$A$6:$V$123,13,TRUE)","v":"14h-22h#"},{"$f":"VLOOKUP(A20,Plan!$A$6:$V$123,14,TRUE)","v":0},{"$f":"VLOOKUP(A20,Plan!$A$6:$V$123,15,TRUE)","v":"14h-22h#"},{"$f":"VLOOKUP(A20,Plan!$A$6:$V$123,16,TRUE)","v":"11h-20h30#"},{"$f":"VLOOKUP(A20,Plan!$A$6:$V$123,17,TRUE)","v":0},{"$f":"VLOOKUP(A20,Plan!$A$6:$V$123,18,TRUE)","v":"R"},{"$f":"VLOOKUP(A20,Plan!$A$6:$V$123,19,TRUE)","v":0},{"$f":"VLOOKUP(A20,Plan!$A$6:$V$123,20,TRUE)","v":"R"},{"$f":"VLOOKUP(A20,Plan!$A$6:$V$123,21,TRUE)","v":0}]
["026640","D A ",null,null,{"$f":"VLOOKUP(A21,Plan!$A$6:$V$123,3,TRUE)","v":"39h00"},{"$f":"VLOOKUP(A21,Plan!$A$6:$V$123,7,TRUE)","v":"39h00"},{"$f":"VLOOKUP(A21,Plan!$A$6:$V$123,8,TRUE)","v":"R"},{"$f":"VLOOKUP(A21,Plan!$A$6:$V$123,9,TRUE)","v":0},{"$f":"VLOOKUP(A21,Plan!$A$6:$V$123,10,TRUE)","v":"R"},{"$f":"VLOOKUP(A21,Plan!$A$6:$V$123,11,TRUE)","v":0},{"$f":"VLOOKUP(A21,Plan!$A$6:$V$123,12,TRUE)","v":0},{"$f":"VLOOKUP(A21,Plan!$A$6:$V$123,13,TRUE)","v":"18h30-02h48#"},{"$f":"VLOOKUP(A21,Plan!$A$6:$V$123,14,TRUE)","v":0},{"$f":"VLOOKUP(A21,Plan!$A$6:$V$123,15,TRUE)","v":"18h30-02h48#"},{"$f":"VLOOKUP(A21,Plan!$A$6:$V$123,16,TRUE)","v":0},{"$f":"VLOOKUP(A21,Plan!$A$6:$V$123,17,TRUE)","v":"18h30-02h48#"},{"$f":"VLOOKUP(A21,Plan!$A$6:$V$123,18,TRUE)","v":0},{"$f":"VLOOKUP(A21,Plan!$A$6:$V$123,19,TRUE)","v":"16h-00h18#"},{"$f":"VLOOKUP(A21,Plan!$A$6:$V$123,20,TRUE)","v":0},{"$f":"VLOOKUP(A21,Plan!$A$6:$V$123,21,TRUE)","v":"16h-00h18#"}]
["002011","D A ",null,null,{"$f":"VLOOKUP(A22,Plan!$A$6:$V$123,3,TRUE)","v":"39h00"},{"$f":"VLOOKUP(A22,Plan!$A$6:$V$123,7,TRUE)","v":"39h00"},{"$f":"VLOOKUP(A22,Plan!$A$6:$V$123,8,TRUE)","v":0},{"$f":"VLOOKUP(A22,Plan!$A$6:$V$123,9,TRUE)","v":"18h30-02h48#"},{"$f":"VLOOKUP(A22,Plan!$A$6:$V$123,10,TRUE)","v":0},{"$f":"VLOOKUP(A22,Plan!$A$6:$V$123,11,TRUE)","v":"18h30-02h48#"},{"$f":"VLOOKUP(A22,Plan!$A$6:$V$123,12,TRUE)","v":"R"},null,{"$f":"VLOOKUP(A22,Plan!$A$6:$V$123,14,TRUE)","v":"R"},{"$f":"VLOOKUP(A22,Plan!$A$6:$V$123,15,TRUE)","v":0},{"$f":"VLOOKUP(A22,Plan!$A$6:$V$123,16,TRUE)","v":0},{"$f":"VLOOKUP(A22,Plan!$A$6:$V$123,17,TRUE)","v":"18h30-02h48#"},{"$f":"VLOOKUP(A22,Plan!$A$6:$V$123,18,TRUE)","v":0},{"$f":"VLOOKUP(A22,Plan!$A$6:$V$123,19,TRUE)","v":"18h30-02h48#"},{"$f":"VLOOKUP(A22,Plan!$A$6:$V$123,20,TRUE)","v":0},{"$f":"VLOOKUP(A22,Plan!$A$6:$V$123,21,TRUE)","v":"18h30-02h48#"}]
["004368","1ER MDH RESP",null,null,{"$f":"VLOOKUP(A23,Plan!$A$6:$V$123,3,TRUE)","v":"39h00"},{"$f":"VLOOKUP(A23,Plan!$A$6:$V$123,7,TRUE)","v":"39h00"},{"$f":"VLOOKUP(A23,Plan!$A$6:$V$123,8,TRUE)","v":"09h-17h18#"},{"$f":"VLOOKUP(A23,Plan!$A$6:$V$123,9,TRUE)","v":0},{"$f":"VLOOKUP(A23,Plan!$A$6:$V$123,10,TRUE)","v":"09h-17h18#"},{"$f":"VLOOKUP(A23,Plan!$A$6:$V$123,11,TRUE)","v":0},{"$f":"VLOOKUP(A23,Plan!$A$6:$V$123,12,TRUE)","v":"09h-17h18#"},{"$f":"VLOOKUP(A23,Plan!$A$6:$V$123,13,TRUE)","v":0},{"$f":"VLOOKUP(A23,Plan!$A$6:$V$123,14,TRUE)","v":"09h-17h18#"},{"$f":"VLOOKUP(A23,Plan!$A$6:$V$123,15,TRUE)","v":0},{"$f":"VLOOKUP(A23,Plan!$A$6:$V$123,16,TRUE)","v":"R"},{"$f":"VLOOKUP(A23,Plan!$A$6:$V$123,17,TRUE)","v":0},{"$f":"VLOOKUP(A23,Plan!$A$6:$V$123,18,TRUE)","v":"R"},{"$f":"VLOOKUP(A23,Plan!$A$6:$V$123,19,TRUE)","v":0},{"$f":"VLOOKUP(A23,Plan!$A$6:$V$123,20,TRUE)","v":"09h-17h18#"},{"$f":"VLOOKUP(A23,Plan!$A$6:$V$123,21,TRUE)","v":0}]
[{"$nulls":4},{"$f":"VLOOKUP(A24,Plan!$A$6:$V$123,3,TRUE)","v":{"$error":"#N/A"}},{"$f":"VLOOKUP(A24,Plan!$A$6:$V$123,7,TRUE)","v":{"$error":"#N/A"}},{"$f":"VLOOKUP(A24,Plan!$A$6:$V$123,8,TRUE)","v":{"$error":"#N/A"}},{"$f":"VLOOKUP(A24,Plan!$A$6:$V$123,9,TRUE)","v":{"$error":"#N/A"}},{"$f":"VLOOKUP(A24,Plan!$A$6:$V$123,10,TRUE)","v":{"$error":"#N/A"}},{"$f":"VLOOKUP(A24,Plan!$A$6:$V$123,11,TRUE)","v":{"$error":"#N/A"}},{"$f":"VLOOKUP(A24,Plan!$A$6:$V$123,12,TRUE)","v":{"$error":"#N/A"}},{"$f":"VLOOKUP(A24,Plan!$A$6:$V$123,13,TRUE)","v":{"$error":"#N/A"}},{"$f":"VLOOKUP(A24,Plan!$A$6:$V$123,14,TRUE)","v":{"$error":"#N/A"}},{"$f":"VLOOKUP(A24,Plan!$A$6:$V$123,15,TRUE)","v":{"$error":"#N/A"}},{"$f":"VLOOKUP(A24,Plan!$A$6:$V$123,16,TRUE)","v":{"$error":"#N/A"}},{"$f":"VLOOKUP(A24,Plan!$A$6:$V$123,17,TRUE)","v":{"$error":"#N/A"}},{"$f":"VLOOKUP(A24,Plan!$A$6:$V$123,18,TRUE)","v":{"$error":"#N/A"}},{"$f":"VLOOKUP(A24,Plan!$A$6:$V$123,19,TRUE)","v":{"$error":"#N/A"}},{"$f":"VLOOKUP(A24,Plan!$A$6:$V$123,20,TRUE)","v":{"$error":"#N/A"}},{"$f":"VLOOKUP(A24,Plan!$A$6:$V$123,21,TRUE)","v":{"$error":"#N/A"}}]
[{"$nulls":4},{"$f":"VLOOKUP(A25,Plan!$A$6:$V$123,3,TRUE)","v":{"$error":"#N/A"}},{"$f":"VLOOKUP(A25,Plan!$A$6:$V$123,7,TRUE)","v":{"$error":"#N/A"}},{"$f":"VLOOKUP(A25,Plan!$A$6:$V$123,8,TRUE)","v":{"$error":"#N/A"}},{"$f":"VLOOKUP(A25,Plan!$A$6:$V$123,9,TRUE)","v":{"$error":"#N/A"}},{"$f":"VLOOKUP(A25,Plan!$A$6:$V$123,10,TRUE)","v":{"$error":"#N/A"}},{"$f":"VLOOKUP(A25,Plan!$A$6:$V$123,11,TRUE)","v":{"$error":"#N/A"}},{"$f":"VLOOKUP(A25,Plan!$A$6:$V$123,12,TRUE)","v":{"$error":"#N/A"}},{"$f":"VLOOKUP(A25,Plan!$A$6:$V$123,13,TRUE)","v":{"$error":"#N/A"}},{"$f":"VLOOKUP(A25,Plan!$A$6:$V$123,14,TRUE)","v":{"$error":"#N/A"}},{"$f":"VLOOKUP(A25,Plan!$A$6:$V$123,15,TRUE)","v":{"$error":"#N/A"}},{"$f":"VLOOKUP(A25,Plan!$A$6:$V$123,16,TRUE)","v":{"$error":"#N/A"}},{"$f":"VLOOKUP(A25,Plan!$A$6:$V$123,17,TRUE)","v":{"$error":"#N/A"}},{"$f":"VLOOKUP(A25,Plan!$A$6:$V$123,18,TRUE)","v":{"$error":"#N/A"}},{"$f":"VLOOKUP(A25,Plan!$A$6:$V$123,19,TRUE)","v":{"$error":"#N/A"}},{"$f":"VLOOKUP(A25,Plan!$A$6:$V$123,20,TRUE)","v":{"$error":"#N/A"}},{"$f":"VLOOKUP(A25,Plan!$A$6:$V$123,21,TRUE)","v":{"$error":"#N/A"}}]
[{"$nulls":4},{"$f":"VLOOKUP(A26,Plan!$A$6:$V$123,3,TRUE)","v":{"$error":"#N/A"}},{"$f":"VLOOKUP(A26,Plan!$A$6:$V$123,7,TRUE)","v":{"$error":"#N/A"}},{"$f":"VLOOKUP(A26,Plan!$A$6:$V$123,8,TRUE)","v":{"$error":"#N/A"}},{"$f":"VLOOKUP(A26,Plan!$A$6:$V$123,9,TRUE)","v":{"$error":"#N/A"}},{"$f":"VLOOKUP(A26,Plan!$A$6:$V$123,10,TRUE)","v":{"$error":"#N/A"}},{"$f":"VLOOKUP(A26,Plan!$A$6:$V$123,11,TRUE)","v":{"$error":"#N/A"}},{"$f":"VLOOKUP(A26,Plan!$A$6:$V$123,12,TRUE)","v":{"$error":"#N/A"}},{"$f":"VLOOKUP(A26,Plan!$A$6:$V$123,13,TRUE)","v":{"$error":"#N/A"}},{"$f":"VLOOKUP(A26,Plan!$A$6:$V$123,14,TRUE)","v":{"$error":"#N/A"}},{"$f":"VLOOKUP(A26,Plan!$A$6:$V$123,15,TRUE)","v":{"$error":"#N/A"}},{"$f":"VLOOKUP(A26,Plan!$A$6:$V$123,16,TRUE)","v":{"$error":"#N/A"}},{"$f":"VLOOKUP(A26,Plan!$A$6:$V$123,17,TRUE)","v":{"$error":"#N/A"}},{"$f":"VLOOKUP(A26,Plan!$A$6:$V$123,18,TRUE)","v":{"$error":"#N/A"}},{"$f":"VLOOKUP(A26,Plan!$A$6:$V$123,19,TRUE)","v":{"$error":"#N/A"}},{"$f":"VLOOKUP(A26,Plan!$A$6:$V$123,20,TRUE)","v":{"$error":"#N/A"}},{"$f":"VLOOKUP(A26,Plan!$A$6:$V$123,21,TRUE)","v":{"$error":"#N/A"}}]
[{"$nulls":4},{"$f":"VLOOKUP(A27,Plan!$A$6:$V$123,3,TRUE)","v":{"$error":"#N/A"}},{"$f":"VLOOKUP(A27,Plan!$A$6:$V$123,7,TRUE)","v":{"$error":"#N/A"}},{"$f":"VLOOKUP(A27,Plan!$A$6:$V$123,8,TRUE)","v":{"$error":"#N/A"}},{"$f":"VLOOKUP(A27,Plan!$A$6:$V$123,9,TRUE)","v":{"$error":"#N/A"}},{"$f":"VLOOKUP(A27,Plan!$A$6:$V$123,10,TRUE)","v":{"$error":"#N/A"}},{"$f":"VLOOKUP(A27,Plan!$A$6:$V$123,11,TRUE)","v":{"$error":"#N/A"}},{"$f":"VLOOKUP(A27,Plan!$A$6:$V$123,12,TRUE)","v":{"$error":"#N/A"}},{"$f":"VLOOKUP(A27,Plan!$A$6:$V$123,13,TRUE)","v":{"$error":"#N/A"}},{"$f":"VLOOKUP(A27,Plan!$A$6:$V$123,14,TRUE)","v":{"$error":"#N/A"}},{"$f":"VLOOKUP(A27,Plan!$A$6:$V$123,15,TRUE)","v":{"$error":"#N/A"}},{"$f":"VLOOKUP(A27,Plan!$A$6:$V$123,16,TRUE)","v":{"$error":"#N/A"}},{"$f":"VLOOKUP(A27,Plan!$A$6:$V$123,17,TRUE)","v":{"$error":"#N/A"}},{"$f":"VLOOKUP(A27,Plan!$A$6:$V$123,18,TRUE)","v":{"$error":"#N/A"}},{"$f":"VLOOKUP(A27,Plan!$A$6:$V$123,19,TRUE)","v":{"$error":"#N/A"}},{"$f":"VLOOKUP(A27,Plan!$A$6:$V$123,20,TRUE)","v":{"$error":"#N/A"}},{"$f":"VLOOKUP(A27,Plan!$A$6:$V$123,21,TRUE)","v":{"$error":"#N/A"}}]
[{"$nulls":4},{"$f":"VLOOKUP(A28,Plan!$A$6:$V$123,3,TRUE)","v":{"$error":"#N/A"}},{"$f":"VLOOKUP(A28,Plan!$A$6:$V$123,7,TRUE)","v":{"$error":"#N/A"}},{"$f":"VLOOKUP(A28,Plan!$A$6:$V$123,8,TRUE)","v":{"$error":"#N/A"}},{"$f":"VLOOKUP(A28,Plan!$A$6:$V$123,9,TRUE)","v":{"$error":"#N/A"}},{"$f":"VLOOKUP(A28,Plan!$A$6:$V$123,10,TRUE)","v":{"$error":"#N/A"}},{"$f":"VLOOKUP(A28,Plan!$A$6:$V$123,11,TRUE)","v":{"$error":"#N/A"}},{"$f":"VLOOKUP(A28,Plan!$A$6:$V$123,12,TRUE)","v":{"$error":"#N/A"}},{"$f":"VLOOKUP(A28,Plan!$A$6:$V$123,13,TRUE)","v":{"$error":"#N/A"}},{"$f":"VLOOKUP(A28,Plan!$A$6:$V$123,14,TRUE)","v":{"$error":"#N/A"}},{"$f":"VLOOKUP(A28,Plan!$A$6:$V$123,15,TRUE)","v":{"$error":"#N/A"}},{"$f":"VLOOKUP(A28,Plan!$A$6:$V$123,16,TRUE)","v":{"$error":"#N/A"}},{"$f":"VLOOKUP(A28,Plan!$A$6:$V$123,17,TRUE)","v":{"$error":"#N/A"}},{"$f":"VLOOKUP(A28,Plan!$A$6:$V$123,18,TRUE)","v":{"$error":"#N/A"}},{"$f":"VLOOKUP(A28,Plan!$A$6:$V$123,19,TRUE)","v":{"$error":"#N/A"}},{"$f":"VLOOKUP(A28,Plan!$A$6:$V$123,20,TRUE)","v":{"$error":"#N/A"}},{"$f":"VLOOKUP(A28,Plan!$A$6:$V$123,21,TRUE)","v":{"$error":"#N/A"}}]
["111018","MDH RESP",null,null,{"$f":"VLOOKUP(A29,Plan!$A$6:$V$123,3,TRUE)","v":"35h00"},{"$f":"VLOOKUP(A29,Plan!$A$6:$V$123,7,TRUE)","v":"35h00"},{"$f":"VLOOKUP(A29,Plan!$A$6:$V$123,8,TRUE)","v":0},{"$f":"VLOOKUP(A29,Plan!$A$6:$V$123,9,TRUE)","v":"19h-01h30#"},{"$f":"VLOOKUP(A29,Plan!$A$6:$V$123,10,TRUE)","v":0},{"$f":"VLOOKUP(A29,Plan!$A$6:$V$123,11,TRUE)","v":"19h-02h#"},{"$f":"VLOOKUP(A29,Plan!$A$6:$V$123,12,TRUE)","v":0},{"$f":"VLOOKUP(A29,Plan!$A$6:$V$123,13,TRUE)","v":"14h30-23h#"},{"$f":"VLOOKUP(A29,Plan!$A$6:$V$123,14,TRUE)","v":"R"},{"$f":"VLOOKUP(A29,Plan!$A$6:$V$123,15,TRUE)","v":0},{"$f":"VLOOKUP(A29,Plan!$A$6:$V$123,16,TRUE)","v":"R"},{"$f":"VLOOKUP(A29,Plan!$A$6:$V$123,17,TRUE)","v":0},{"$f":"VLOOKUP(A29,Plan!$A$6:$V$123,18,TRUE)","v":"08h-16h#"},{"$f":"VLOOKUP(A29,Plan!$A$6:$V$123,19,TRUE)","v":0},{"$f":"VLOOKUP(A29,Plan!$A$6:$V$123,20,TRUE)","v":"08h-15h30#"},{"$f":"VLOOKUP(A29,Plan!$A$6:$V$123,21,TRUE)","v":0}]
["509123","MDH RESP",null,null,{"$f":"VLOOKUP(A30,Plan!$A$6:$V$123,3,TRUE)","v":"39h00"},{"$f":"VLOOKUP(A30,Plan!$A$6:$V$123,7,TRUE)","v":"39h00"},{"$f":"VLOOKUP(A30,Plan!$A$6:$V$123,8,TRUE)","v":"R"},{"$f":"VLOOKUP(A30,Plan!$A$6:$V$123,9,TRUE)","v":0},{"$f":"VLOOKUP(A30,Plan!$A$6:$V$123,10,TRUE)","v":"10h-18h30#"},{"$f":"VLOOKUP(A30,Plan!$A$6:$V$123,11,TRUE)","v":0},{"$f":"VLOOKUP(A30,Plan!$A$6:$V$123,12,TRUE)","v":"10h-18h30#"},{"$f":"VLOOKUP(A30,Plan!$A$6:$V$123,13,TRUE)","v":0},{"$f":"VLOOKUP(A30,Plan!$A$6:$V$123,14,TRUE)","v":"10h-18h30#"},{"$f":"VLOOKUP(A30,Plan!$A$6:$V$123,15,TRUE)","v":0},{"$f":"VLOOKUP(A30,Plan!$A$6:$V$123,16,TRUE)","v":"07h30-17h#"},{"$f":"VLOOKUP(A30,Plan!$A$6:$V$123,17,TRUE)","v":0},{"$f":"VLOOKUP(A30,Plan!$A$6:$V$123,18,TRUE)","v":0},{"$f":"VLOOKUP(A30,Plan!$A$6:$V$123,19,TRUE)","v":"17h30-24h#"},{"$f":"VLOOKUP(A30,Plan!$A$6:$V$123,20,TRUE)","v":"R"},{"$f":"VLOOKUP(A30,Plan!$A$6:$V$123,21,TRUE)","v":0}]
{"$rows_left_out":161}
{"sheet":"Feuil1","index":1,"n_rows":0,"n_cols":0,"rows_kept":0}

{"sheet":"Feuil2","index":2,"n_rows":0,"n_cols":0,"rows_kept":0}

{"sheet":"Plan","index":3,"n_rows":89,"n_cols":22,"rows_kept":89}
["205 : La Coupole","SALLE"]
["Semaine 16","Du lundi 13/04 au dimanche 19/04/2015"]
["2015-04-13",null,"2015-04-14",null,"2015-04-15",null,"2015-04-16",null,"2015-04-17",null,"2015-04-18",null,"2015-04-19"]
[" 264h45",null," 327h30",null," 350h54",null," 390h00",null," 458h03",null," 436h51",null," 288h30"]
["19","  24","  25","  26","  24","  30","  26","  34","  29","  40","  26","  42","  26","  23"]
["000401","M","39h00","GERMAY"," JEAN YVES","MDH (MAITRE D'HOTEL)","00h00","MAL",null,"MAL",null,"MAL",null,"MAL",null,"MAL",null,"R",null,"R",null,"-00:35"]
["000443","M","39h00","BARGAIN"," GILLES","MDH (MAITRE D'HOTEL)","00h00","ATJ",null,"ATJ",null,"ATJ",null,"ATJ",null,"ATJ",null,"R",null,"R",null,"-00:35"]
["000614","M","39h00","GROS"," CHRISTIAN","MDH_RES (MAITRE D'HO","39h00","R",null,null,"18h-02h#",null,"18h-02h#",null,"18h-02h#",null,"14h30-23h30#",null,"14h30-23h#","R",null,"+00:00"]
["001921","M","39h00","MEGASSI"," MOHAMED","MDH (MAITRE D'HOTEL)","39h00","11h45-15h#","18h30-23h15#","11h45-15h#","18h30-24h15#","11h45-15h#","18h30-24h15#","11h45-15h#","18h30-24h15#","R",null,"R",null,"11h45-16h#","18h30-23h15#","+00:00"]
["002011","M","39h00","ADAM"," SEBASTIEN","DIR_ADJ (DIRECTEUR","39h00",null,"18h30-02h48#",null,"18h30-02h48#","R",null,"R",null,null,"18h30-02h48#",null,"18h30-02h48#",null,"18h30-02h48#","+00:00"]
["002404","M","39h00","BENAMEUR"," LYES","MDH (MAITRE D'HOTEL)","39h00","R",null,"11h45-15h#","18h30-24h#","11h45-15h#","18h30-24h#","11h45-15h#","18h30-24h#","11h45-15h#","18h30-24h#","11h45-15h#","18h30-00h15#","R",null,"+00:00"]
["003394","M","39h00","COUROUX"," MAURICE","MDH (MAITRE D'HOTEL)","00h00","MAL",null,"MAL",null,"MAL",null,"MAL",null,"MAL",null,"R",null,"R",null,"-00:35"]
["004050","M","39h00","VILAIN"," JEAN LUC","MDH (MAITRE D'HOTEL)","39h00","R",null,"10h-18h18#",null,"10h-18h18#",null,"06h-14h18#",null,"10h-18h18#",null,"10h-18h18#",null,"R",null,"+00:00"]
["004070","M","39h00","LANSON"," HERVE","MDH (MAITRE D'HOTEL)","39h00","07h-15h18#",null,"07h-15h18#",null,"07h-15h18#",null,"07h-15h18#",null,"07h-15h18#",null,"R",null,"R",null,"+00:00"]
["004368","M","39h00","AELLIG"," ERIC","1ERMHR (1ER MAITRE D","39h00","09h-17h18#",null,"09h-17h18#",null,"09h-17h18#",null,"09h-17h18#",null,"R",null,"R",null,"09h-17h18#",null,"+00:00"]
["004523","M","39h00","LOR"," RENE","MDH (MAITRE D'HOTEL)","39h00","09h-17h18#",null,"R",null,"R",null,"09h-17h18#",null,"09h-17h18#",null,"09h-17h18#",null,"09h-17h18#",null,"+00:00"]
["004569","M","39h00","LOUARRADI"," ABDELHAKAM","MDH (MAITRE D'HOTEL)","39h00","11h45-15h#","18h30-23h15#","11h45-15h#","18h30-24h15#","11h45-15h#","18h30-24h15#","R",null,"R",null,"11h45-15h30#","18h30-24h15#","11h45-15h30#","18h30-23h15#","+00:00"]
["006245","M","39h00","TRUONG"," TAN CUONG","CHEF_RANG (CHEF DE R","39h00","11h45-15h#","18h30-23h15#","11h45-15h#","18h30-24h15#","11h45-15h#","18h30-24h15#","11h45-15h#","18h30-24h15#","R",null,"R",null,"11h45-16h#","18h30-23h15#","+00:00"]
["006346","M","39h00","BENATIA"," FATHI","CHEF_RANG (CHEF DE R","23h24","09h-17h18#",null,"09h-17h18#",null,"CP",null,"CP",null,"R",null,"R",null,"09h-17h18#",null,"-00:14"]
["009624","M","39h00","DAKHLI"," AHMED","CHEF_RANG (CHEF DE R","39h00",null,"15h-23h#",null,"15h-24h#","R",null,"R",null,null,"15h-00h30#","11h30-18h45#",null,"11h-18h45#",null,"+00:00"]
["009999","M","39h00","MU"," SONG LEANG","MDH (MAITRE D'HOTEL)","23h15","R",null,"CP",null,"CP",null,"11h45-15h#","18h30-24h#","11h45-15h#","18h30-24h#","11h45-15h#","18h30-24h#","R",null,"-00:23"]
["010220","M","35h00","TENDERO"," STEPHANE","DIR_EXPLOIT (DIRECTE","35h00","R",null,"10h-17h30#",null,"10h-17h30#",null,"10h-17h30#",null,"10h-17h30#",null,"10h-17h30#",null,"R",null,"+00:00"]
["015223","M","39h00","HADDAD"," SLAH","MDH (MAITRE D'HOTEL)","39h00","R",null,"R",null,"11h45-15h#","18h30-24h#","11h45-15h#","18h30-24h15#","11h45-15h#","18h30-24h15#","11h45-15h#","18h30-24h15#","11h45-15h30#","18h30-23h#","+00:00"]
["020729","M","39h00","LEVAVASSEUR"," J-PHILIPPE","DIR_ADJ (DIRECTEUR","24h00","CP",null,"CP",null,null,"14h-22h#",null,"14h-22h#","11h-20h30#",null,"R",null,"R",null,"+00:22"]
["020914","M","35h00","RATEAU"," PAULINE","APP_SALLE (APPRENTI","35h00","R",null,null,"16h30-24h#",null,"16h30-24h#",null,"16h30-24h#",null,"16h30-24h#",null,"16h30-24h#","R",null,"+00:00"]
["022349","M","39h00","VIVIER"," CLAUDE","MDH (MAITRE D'HOTEL)","39h00","R",null,"R",null,"08h-16h18#",null,"08h-16h18#",null,"08h-16h18#",null,"08h-16h18#",null,"08h-16h18#",null,"+00:00"]
["024313","M","39h00","ALLALI"," MOURAD","MDH (MAITRE D'HOTEL)","39h00","09h-17h18#",null,"09h-17h18#",null,"R",null,"R",null,"09h-17h18#",null,"08h-16h18#",null,"08h-16h18#",null,"+00:00"]
["024679","M","39h00","MOUZOUN"," ABDELLAH","MDH (MAITRE D'HOTEL)","39h00",null,"15h-23h#","R",null,"R",null,null,"15h-00h15#",null,"15h-00h15#",null,"15h-00h30#","11h30-17h#",null,"+00:00"]
["026640","M","39h00","COTARD"," YANN","DIR_ADJ (DIRECTEUR","39h00","R",null,"R",null,null,"18h30-02h48#",null,"18h30-02h48#",null,"18h30-02h48#",null,"16h-00h18#",null,"16h-00h18#","+00:00"]
["028742","M","39h00","ESTRADA ALBA"," YARITZA","MDH (MAITRE D'HOTEL)","39h00","R",null,"09h30-17h30#",null,"09h30-17h30#",null,"09h30-17h30#",null,"09h30-17h30#",null,"08h30-18h#",null,"R",null,"+00:00"]
{"$rows_left_out":59}