{"text_format":"3","workbook":"xlsx","n_sheets":4,"sheets":["Planning","Feuil1","Feuil2","Plan"],"not_rendered":{"macros":1,"defined_names":1},"read":"whole","date_system":"1900"}

{"sheet":"Planning","index":0,"n_rows":199,"n_cols":20,"rows_kept":199,"merged":[[0,1,0,19],[1,1,2,19],[4,4,4,5],[4,6,4,7],[4,8,4,9],[4,10,4,11],[4,12,4,13],[4,14,4,15],[4,16,4,17],[4,18,4,19],[5,3,5,5],[5,6,5,7],[5,8,5,9],[5,10,5,11],[5,12,5,13],[5,14,5,15],[5,16,5,17],[5,18,5,19],[8,1,8,19],[9,3,9,4],[9,6,9,7],[9,8,9,9],[9,10,9,11],[9,12,9,13],[9,14,9,15],[9,16,9,17],[9,18,9,19],[10,3,11,5],[10,6,11,6],[10,7,11,7],[10,8,11,8],[10,9,11,9],[10,10,11,10],[10,11,11,11],[10,12,11,12],[10,13,11,13],[10,14,11,14],[10,15,11,15],[10,16,11,16],[10,17,11,17],[10,18,11,18],[10,19,11,19],[12,1,13,1],[12,2,13,2],[12,3,13,3],[12,4,13,4],[12,5,13,5],[12,6,13,7],[12,8,13,9],[12,10,13,11],[12,12,13,13],[12,14,13,15],[12,16,13,17],[12,18,13,19],[14,6,14,7],[14,8,14,9],[15,0,16,0],[15,1,16,1],[21,10,21,11],[22,0,23,0],[32,0,33,0],[66,0,67,0],[93,0,94,0],[115,0,116,0],[133,0,134,0],[150,0,151,0],[169,0,170,0],[180,0,180,19],[183,2,183,4],[183,6,183,7],[183,8,183,9],[183,10,183,11],[183,12,183,13],[183,14,183,15],[183,16,183,17],[183,18,183,19],[184,3,184,4],[184,6,184,7],[184,8,184,9],[184,10,184,11],[184,12,184,13],[184,14,184,15],[184,16,184,17],[184,18,184,19],[185,3,185,4],[185,6,185,7],[185,8,185,9],[185,10,185,11],[185,12,185,13],[185,14,185,15],[185,16,185,17],[185,18,185,19],[186,3,186,4],[186,6,186,7],[186,8,186,9],[186,10,186,11],[186,12,186,13],[186,14,186,15],[186,16,186,17],[186,18,186,19],[187,3,187,4],[187,6,187,7],[187,8,187,9],[187,10,187,11],[187,12,187,13],[187,14,187,15],[187,16,187,17],[187,18,187,19],[188,3,188,4],[188,6,188,7],[188,8,188,9],[188,10,188,11],[188,12,188,13],[188,14,188,15],[188,16,188,17],[188,18,188,19],[189,3,189,4],[189,6,189,7],[189,8,189,9],[189,10,189,11],[189,12,189,13],[189,14,189,15],[189,16,189,17],[189,18,189,19],[190,3,190,4],[190,6,190,7],[190,8,190,9],[190,10,190,11],[190,12,190,13],[190,14,190,15],[190,16,190,17],[190,18,190,19],[191,3,191,4],[191,6,191,7],[191,8,191,9],[191,10,191,11],[191,12,191,13],[191,14,191,15],[191,16,191,17],[191,18,191,19],[192,3,192,4],[192,6,192,7],[192,8,192,9],[192,10,192,11],[192,12,192,13],[192,14,192,15],[192,16,192,17],[192,18,192,19],[193,3,193,4],[193,6,193,7],[193,8,193,9],[193,10,193,11],[193,12,193,13],[193,14,193,15],[193,16,193,17],[193,18,193,19],[194,3,194,4],[194,6,194,7],[194,8,194,9],[194,10,194,11],[194,12,194,13],[194,14,194,15],[194,16,194,17],[194,18,194,19],[195,3,195,4],[195,6,195,7],[195,8,195,9],[195,10,195,11],[195,12,195,13],[195,14,195,15],[195,16,195,17],[195,18,195,19],[196,3,196,4],[196,6,196,7],[196,8,196,9],[196,10,196,11],[196,12,196,13],[196,14,196,15],[196,16,196,17],[196,18,196,19],[197,3,197,4],[197,6,197,7],[197,8,197,9],[197,10,197,11],[197,12,197,13],[197,14,197,15],[197,16,197,17],[197,18,197,19]]}
[]
[null,{"$f":"Plan!A2","v":"Semaine 16"}]
[]
[null,"une pause de 20 minutes est accordée pour tout horaire dépassant 6 heures consécutives",{"$nulls":17},96]
[{"$nulls":4},""]
[{"$nulls":3},"Nb heures Planifiées / Jour",null,null," 318h03",null," 395h21",null," 394h53",null," 443h23",null," 503h05",null," 500h59",null," 373h56"]
[]
[]
[null,{"$f":"Plan!B2","v":"Du lundi 13/04 au dimanche 19/04/2015"}]
[]
[{"$nulls":3},"SERVICE",null,null,"MIDI","SOIR","MIDI","SOIR","SOIR","SOIR","MIDI","SOIR","MIDI","SOIR","MIDI","SOIR","MIDI","SOIR"]
[]
[null,"QUALIFICATION","NOM","PRENOMS","CONTRAT","SOLDE\nHEBDO",{"$f":"Plan!A3","v":"2015-04-13"},null,{"$f":"Plan!C3","v":"2015-04-14"},null,{"$f":"Plan!E3","v":"2015-04-15"},null,{"$f":"Plan!G3","v":"2015-04-16"},null,{"$f":"Plan!I3","v":"2015-04-17"},null,{"$f":"Plan!K3","v":"2015-04-18"},null,{"$f":"Plan!M3","v":"2015-04-19"}]
[]
["130429","DIR",null,null,{"$f":"VLOOKUP(A15,Plan!$A$6:$V$123,3,TRUE)","v":"39h00"},{"$f":"VLOOKUP(A15,Plan!$A$6:$V$123,7,TRUE)","v":"31h12"},{"$f":"VLOOKUP(A15,Plan!$A$6:$V$123,8,TRUE)","v":"R"},null,{"$f":"VLOOKUP(A15,Plan!$A$6:$V$123,10,TRUE)","v":"R"},null,{"$f":"VLOOKUP(A15,Plan!$A$6:$V$123,12,TRUE)","v":"09h-17h18#"},{"$f":"VLOOKUP(A15,Plan!$A$6:$V$123,13,TRUE)","v":0},{"$f":"VLOOKUP(A15,Plan!$A$6:$V$123,14,TRUE)","v":"09h-17h18#"},{"$f":"VLOOKUP(A15,Plan!$A$6:$V$123,15,TRUE)","v":0},{"$f":"VLOOKUP(A15,Plan!$A$6:$V$123,16,TRUE)","v":"09h-17h18#"},{"$f":"VLOOKUP(A15,Plan!$A$6:$V$123,17,TRUE)","v":0},{"$f":"VLOOKUP(A15,Plan!$A$6:$V$123,18,TRUE)","v":"09h-17h18#"},{"$f":"VLOOKUP(A15,Plan!$A$6:$V$123,19,TRUE)","v":0},{"$f":"VLOOKUP(A15,Plan!$A$6:$V$123,20,TRUE)","v":"CP"},{"$f":"VLOOKUP(A15,Plan!$A$6:$V$123,21,TRUE)","v":0}]
["501221","DIR",null,null,{"$f":"VLOOKUP(A16,Plan!$A$6:$V$123,3,TRUE)","v":"35h00"},{"$f":"VLOOKUP(A16,Plan!$A$6:$V$123,7,TRUE)","v":"35h00"},{"$f":"VLOOKUP(A16,Plan!$A$6:$V$123,8,TRUE)","v":0},{"$f":"VLOOKUP(A16,Plan!$A$6:$V$123,9,TRUE)","v":"15h-22h30#"},{"$f":"VLOOKUP(A16,Plan!$A$6:$V$123,10,TRUE)","v":"R"},{"$f":"VLOOKUP(A16,Plan!$A$6:$V$123,11,TRUE)","v":0},{"$f":"VLOOKUP(A16,Plan!$A$6:$V$123,12,TRUE)","v":"R"},{"$f":"VLOOKUP(A16,Plan!$A$6:$V$123,13,TRUE)","v":0},{"$f":"VLOOKUP(A16,Plan!$A$6:$V$123,14,TRUE)","v":0},{"$f":"VLOOKUP(A16,Plan!$A$6:$V$123,15,TRUE)","v":"15h-22h30#"},{"$f":"VLOOKUP(A16,Plan!$A$6:$V$123,16,TRUE)","v":0},{"$f":"VLOOKUP(A16,Plan!$A$6:$V$123,17,TRUE)","v":"15h-22h30#"},{"$f":"VLOOKUP(A16,Plan!$A$6:$V$123,18,TRUE)","v":0},{"$f":"VLOOKUP(A16,Plan!$A$6:$V$123,19,TRUE)","v":"15h-22h30#"},{"$f":"VLOOKUP(A16,Plan!$A$6:$V$123,20,TRUE)","v":0},{"$f":"VLOOKUP(A16,Plan!$A$6:$V$123,21,TRUE)","v":"15h-22h30#"}]
[{"$nulls":4},{"$f":"VLOOKUP(A17,Plan!$A$6:$V$123,3,TRUE)","v":{"$error":"#N/A"}},{"$f":"VLOOKUP(A17,Plan!$A$6:$V$123,7,TRUE)","v":{"$error":"#N/A"}},{"$f":"VLOOKUP(A17,Plan!$A$6:$V$123,8,TRUE)","v":{"$error":"#N/A"}},{"$f":"VLOOKUP(A17,Plan!$A$6:$V$123,9,TRUE)","v":{"$error":"#N/A"}},{"$f":"VLOOKUP(A17,Plan!$A$6:$V$123,10,TRUE)","v":{"$error":"#N/A"}},{"$f":"VLOOKUP(A17,Plan!$A$6:$V$123,11,TRUE)","v":{"$error":"#N/A"}},{"$f":"VLOOKUP(A17,Plan!$A$6:$V$123,12,TRUE)","v":{"$error":"#N/A"}},{"$f":"VLOOKUP(A17,Plan!$A$6:$V$123,13,TRUE)","v":{"$error":"#N/A"}},{"$f":"VLOOKUP(A17,Plan!$A$6:$V$123,14,TRUE)","v":{"$error":"#N/A"}},{"$f":"VLOOKUP(A17,Plan!$A$6:$V$123,15,TRUE)","v":{"$error":"#N/A"}},{"$f":"VLOOKUP(A17,Plan!$A$6:$V$123,16,TRUE)","v":{"$error":"#N/A"}},{"$f":"VLOOKUP(A17,Plan!$A$6:$V$123,17,TRUE)","v":{"$error":"#N/A"}},{"$f":"VLOOKUP(A17,Plan!$A$6:$V$123,18,TRUE)","v":{"$error":"#N/A"}},{"$f":"VLOOKUP(A17,Plan!$A$6:$V$123,19,TRUE)","v":{"$error":"#N/A"}},{"$f":"VLOOKUP(A17,Plan!$A$6:$V$123,20,TRUE)","v":{"$error":"#N/A"}},{"$f":"VLOOKUP(A17,Plan!$A$6:$V$123,21,TRUE)","v":{"$error":"#N/A"}}]
[{"$nulls":4},{"$f":"VLOOKUP(A18,Plan!$A$6:$V$123,3,TRUE)","v":{"$error":"#N/A"}},{"$f":"VLOOKUP(A18,Plan!$A$6:$V$123,7,TRUE)","v":{"$error":"#N/A"}},{"$f":"VLOOKUP(A18,Plan!$A$6:$V$123,8,TRUE)","v":{"$error":"#N/A"}},{"$f":"VLOOKUP(A18,Plan!$A$6:$V$123,9,TRUE)","v":{"$error":"#N/A"}},{"$f":"VLOOKUP(A18,Plan!$A$6:$V$123,10,TRUE)","v":{"$error":"#N/A"}},{"$f":"VLOOKUP(A18,Plan!$A$6:$V$123,11,TRUE)","v":{"$error":"#N/A"}},{"$f":"VLOOKUP(A18,Plan!$A$6:$V$123,12,TRUE)","v":{"$error":"#N/A"}},{"$f":"VLOOKUP(A18,Plan!$A$6:$V$123,13,TRUE)","v":{"$error":"#N/A"}},{"$f":"VLOOKUP(A18,Plan!$A$6:$V$123,14,TRUE)","v":{"$error":"#N/A"}},{"$f":"VLOOKUP(A18,Plan!$A$6:$V$123,15,TRUE)","v":{"$error":"#N/A"}},{"$f":"VLOOKUP(A18,Plan!$A$6:$V$123,16,TRUE)","v":{"$error":"#N/A"}},{"$f":"VLOOKUP(A18,Plan!$A$6:$V$123,17,TRUE)","v":{"$error":"#N/A"}},{"$f":"VLOOKUP(A18,Plan!$A$6:$V$123,18,TRUE)","v":{"$error":"#N/A"}},{"$f":"VLOOKUP(A18,Plan!$A$6:$V$123,19,TRUE)","v":{"$error":"#N/A"}},{"$f":"VLOOKUP(A18,Plan!$A$6:$V$123,20,TRUE)","v":{"$error":"#N/A"}},{"$f":"VLOOKUP(A18,Plan!$A$6:$V$123,21,TRUE)","v":{"$error":"#N/A"}}]
[{"$nulls":4},{"$f":"VLOOKUP(A19,Plan!$A$6:$V$123,3,TRUE)","v":{"$error":"#N/A"}},{"$f":"VLOOKUP(A19,Plan!$A$6:$V$123,7,TRUE)","v":{"$error":"#N/A"}},{"$f":"VLOOKUP(A19,Plan!$A$6:$V$123,8,TRUE)","v":{"$error":"#N/A"}},{"$f":"VLOOKUP(A19,Plan!$A$6:$V$123,9,TRUE)","v":{"$error":"#N/A"}},{"$f":"VLOOKUP(A19,Plan!$A$6:$V$123,10,TRUE)","v":{"$error":"#N/A"}},{"$f":"VLOOKUP(A19,Plan!$A$6:$V$123,11,TRUE)","v":{"$error":"#N/A"}},{"$f":"VLOOKUP(A19,Plan!$A$6:$V$123,12,TRUE)","v":{"$error":"#N/A"}},{"$f":"VLOOKUP(A19,Plan!$A$6:$V$123,13,TRUE)","v":{"$error":"#N/A"}},{"$f":"VLOOKUP(A19,Plan!$A$6:$V$123,14,TRUE)","v":{"$error":"#N/A"}},{"$f":"VLOOKUP(A19,Plan!$A$6:$V$123,15,TRUE)","v":{"$error":"#N/A"}},{"$f":"VLOOKUP(A19,Plan!$A$6:$V$123,16,TRUE)","v":{"$error":"#N/A"}},{"$f":"VLOOKUP(A19,Plan!$A$6:$V$123,17,TRUE)","v":{"$error":"#N/A"}},{"$f":"VLOOKUP(A19,Plan!$A$6:$V$123,18,TRUE)","v":{"$error":"#N/A"}},{"$f":"VLOOKUP(A19,Plan!$A$6:$V$123,19,TRUE)","v":{"$error":"#N/A"}},{"$f":"VLOOKUP(A19,Plan!$A$6:$V$123,20,TRUE)","v":{"$error":"#N/A"}},{"$f":"VLOOKUP(A19,Plan!$A$6:$V$123,21,TRUE)","v":{"$error":"#N/A"}}]
["020729","D A ",null,null,{"$f":"VLOOKUP(A20,Plan!$A$6:$V$123,3,TRUE)","v":"39h00"},{"$f":"VLOOKUP(A20,Plan!$A$6:$V$123,7,TRUE)","v":"24h00"},{"$f":"VLOOKUP(A20,Plan!$A$6:$V$123,8,TRUE)","v":"CP"},{"$f":"VLOOKUP(A20,Plan!$A$6:$V$123,9,TRUE)","v":0},{"$f":"VLOOKUP(A20,Plan!$A$6:$V$123,10,TRUE)","v":"CP"},{"$f":"VLOOKUP(A20,Plan!$A$6:$V$123,11,TRUE)","v":0},{"$f":"VLOOKUP(A20,Plan!$A$6:$V$123,12,TRUE)","v":0},{"$f":"VLOOKUP(A20,Plan!$A$6:$V$123,13,TRUE)","v":"14h-22h#"},{"$f":"VLOOKUP(A20,Plan!$A$6:$V$123,14,TRUE)","v":0},{"$f":"VLOOKUP(A20,Plan!$A$6:$V$123,15,TRUE)","v":"14h-22h#"},{"$f":"VLOOKUP(A20,Plan!$A$6:$V$123,16,TRUE)","v":"11h-20h30#"},{"$f":"VLOOKUP(A20,Plan!$A$6:$V$123,17,TRUE)","v":0},{"$f":"VLOOKUP(A20,Plan!$A$6:$V$123,18,TRUE)","v":"R"},{"$f":"VLOOKUP(A20,Plan!$A$6:$V$123,19,TRUE)","v":0},{"$f":"VLOOKUP(A20,Plan!$A$6:$V$123,20,TRUE)","v":"R"},{"$f":"VLOOKUP(A20,Plan!$A$6:$V$123,21,TRUE)","v":0}]
["026640","D A ",null,null,{"$f":"VLOOKUP(A21,Plan!$A$6:$V$123,3,TRUE)","v":"39h00"},{"$f":"VLOOKUP(A21,Plan!$A$6:$V$123,7,TRUE)","v":"39h00"},{"$f":"VLOOKUP(A21,Plan!$A$6:$V$123,8,TRUE)","v":"R"},{"$f":"VLOOKUP(A21,Plan!$A$6:$V$123,9,TRUE)","v":0},{"$f":"VLOOKUP(A21,Plan!$A$6:$V$123,10,TRUE)","v":"R"},{"$f":"VLOOKUP(A21,Plan!$A$6:$V$123,11,TRUE)","v":0},{"$f":"VLOOKUP(A21,Plan!$A$6:$V$123,12,TRUE)","v":0},{"$f":"VLOOKUP(A21,Plan!$A$6:$V$123,13,TRUE)","v":"18h30-02h48#"},{"$f":"VLOOKUP(A21,Plan!$A$6:$V$123,14,TRUE)","v":0},{"$f":"VLOOKUP(A21,Plan!$A$6:$V$123,15,TRUE)","v":"18h30-02h48#"},{"$f":"VLOOKUP(A21,Plan!$A$6:$V$123,16,TRUE)","v":0},{"$f":"VLOOKUP(A21,Plan!$A$6:$V$123,17,TRUE)","v":"18h30-02h48#"},{"$f":"VLOOKUP(A21,Plan!$A$6:$V$123,18,TRUE)","v":0},{"$f":"VLOOKUP(A21,Plan!$A$6:$V$123,19,TRUE)","v":"16h-00h18#"},{"$f":"VLOOKUP(A21,Plan!$A$6:$V$123,20,TRUE)","v":0},{"$f":"VLOOKUP(A21,Plan!$A$6:$V$123,21,TRUE)","v":"16h-00h18#"}]
["002011","D A ",null,null,{"$f":"VLOOKUP(A22,Plan!$A$6:$V$123,3,TRUE)","v":"39h00"},{"$f":"VLOOKUP(A22,Plan!$A$6:$V$123,7,TRUE)","v":"39h00"},{"$f":"VLOOKUP(A22,Plan!$A$6:$V$123,8,TRUE)","v":0},{"$f":"VLOOKUP(A22,Plan!$A$6:$V$123,9,TRUE)","v":"18h30-02h48#"},{"$f":"VLOOKUP(A22,Plan!$A$6:$V$123,10,TRUE)","v":0},{"$f":"VLOOKUP(A22,Plan!$A$6:$V$123,11,TRUE)","v":"18h30-02h48#"},{"$f":"VLOOKUP(A22,Plan!$A$6:$V$123,12,TRUE)","v":"R"},null,{"$f":"VLOOKUP(A22,Plan!$A$6:$V$123,14,TRUE)","v":"R"},{"$f":"VLOOKUP(A22,Plan!$A$6:$V$123,15,TRUE)","v":0},{"$f":"VLOOKUP(A22,Plan!$A$6:$V$123,16,TRUE)","v":0},{"$f":"VLOOKUP(A22,Plan!$A$6:$V$123,17,TRUE)","v":"18h30-02h48#"},{"$f":"VLOOKUP(A22,Plan!$A$6:$V$123,18,TRUE)","v":0},{"$f":"VLOOKUP(A22,Plan!$A$6:$V$123,19,TRUE)","v":"18h30-02h48#"},{"$f":"VLOOKUP(A22,Plan!$A$6:$V$123,20,TRUE)","v":0},{"$f":"VLOOKUP(A22,Plan!$A$6:$V$123,21,TRUE)","v":"18h30-02h48#"}]
["004368","1ER MDH RESP",null,null,{"$f":"VLOOKUP(A23,Plan!$A$6:$V$123,3,TRUE)","v":"39h00"},{"$f":"VLOOKUP(A23,Plan!$A$6:$V$123,7,TRUE)","v":"39h00"},{"$f":"VLOOKUP(A23,Plan!$A$6:$V$123,8,TRUE)","v":"09h-17h18#"},{"$f":"VLOOKUP(A23,Plan!$A$6:$V$123,9,TRUE)","v":0},{"$f":"VLOOKUP(A23,Plan!$A$6:$V$123,10,TRUE)","v":"09h-17h18#"},{"$f":"VLOOKUP(A23,Plan!$A$6:$V$123,11,TRUE)","v":0},{"$f":"VLOOKUP(A23,Plan!$A$6:$V$123,12,TRUE)","v":"09h-17h18#"},{"$f":"VLOOKUP(A23,Plan!$A$6:$V$123,13,TRUE)","v":0},{"$f":"VLOOKUP(A23,Plan!$A$6:$V$123,14,TRUE)","v":"09h-17h18#"},{"$f":"VLOOKUP(A23,Plan!$A$6:$V$123,15,TRUE)","v":0},{"$f":"VLOOKUP(A23,Plan!$A$6:$V$123,16,TRUE)","v":"R"},{"$f":"VLOOKUP(A23,Plan!$A$6:$V$123,17,TRUE)","v":0},{"$f":"VLOOKUP(A23,Plan!$A$6:$V$123,18,TRUE)","v":"R"},{"$f":"VLOOKUP(A23,Plan!$A$6:$V$123,19,TRUE)","v":0},{"$f":"VLOOKUP(A23,Plan!$A$6:$V$123,20,TRUE)","v":"09h-17h18#"},{"$f":"VLOOKUP(A23,Plan!$A$6:$V$123,21,TRUE)","v":0}]
[{"$nulls":4},{"$f":"VLOOKUP(A24,Plan!$A$6:$V$123,3,TRUE)","v":{"$error":"#N/A"}},{"$f":"VLOOKUP(A24,Plan!$A$6:$V$123,7,TRUE)","v":{"$error":"#N/A"}},{"$f":"VLOOKUP(A24,Plan!$A$6:$V$123,8,TRUE)","v":{"$error":"#N/A"}},{"$f":"VLOOKUP(A24,Plan!$A$6:$V$123,9,TRUE)","v":{"$error":"#N/A"}},{"$f":"VLOOKUP(A24,Plan!$A$6:$V$123,10,TRUE)","v":{"$error":"#N/A"}},{"$f":"VLOOKUP(A24,Plan!$A$6:$V$123,11,TRUE)","v":{"$error":"#N/A"}},{"$f":"VLOOKUP(A24,Plan!$A$6:$V$123,12,TRUE)","v":{"$error":"#N/A"}},{"$f":"VLOOKUP(A24,Plan!$A$6:$V$123,13,TRUE)","v":{"$error":"#N/A"}},{"$f":"VLOOKUP(A24,Plan!$A$6:$V$123,14,TRUE)","v":{"$error":"#N/A"}},{"$f":"VLOOKUP(A24,Plan!$A$6:$V$123,15,TRUE)","v":{"$error":"#N/A"}},{"$f":"VLOOKUP(A24,Plan!$A$6:$V$123,16,TRUE)","v":{"$error":"#N/A"}},{"$f":"VLOOKUP(A24,Plan!$A$6:$V$123,17,TRUE)","v":{"$error":"#N/A"}},{"$f":"VLOOKUP(A24,Plan!$A$6:$V$123,18,TRUE)","v":{"$error":"#N/A"}},{"$f":"VLOOKUP(A24,Plan!$A$6:$V$123,19,TRUE)","v":{"$error":"#N/A"}},{"$f":"VLOOKUP(A24,Plan!$A$6:$V$123,20,TRUE)","v":{"$error":"#N/A"}},{"$f":"VLOOKUP(A24,Plan!$A$6:$V$123,21,TRUE)","v":{"$error":"#N/A"}}]
[{"$nulls":4},{"$f":"VLOOKUP(A25,Plan!$A$6:$V$123,3,TRUE)","v":{"$error":"#N/A"}},{"$f":"VLOOKUP(A25,Plan!$A$6:$V$123,7,TRUE)","v":{"$error":"#N/A"}},{"$f":"VLOOKUP(A25,Plan!$A$6:$V$123,8,TRUE)","v":{"$error":"#N/A"}},{"$f":"VLOOKUP(A25,Plan!$A$6:$V$123,9,TRUE)","v":{"$error":"#N/A"}},{"$f":"VLOOKUP(A25,Plan!$A$6:$V$123,10,TRUE)","v":{"$error":"#N/A"}},{"$f":"VLOOKUP(A25,Plan!$A$6:$V$123,11,TRUE)","v":{"$error":"#N/A"}},{"$f":"VLOOKUP(A25,Plan!$A$6:$V$123,12,TRUE)","v":{"$error":"#N/A"}},{"$f":"VLOOKUP(A25,Plan!$A$6:$V$123,13,TRUE)","v":{"$error":"#N/A"}},{"$f":"VLOOKUP(A25,Plan!$A$6:$V$123,14,TRUE)","v":{"$error":"#N/A"}},{"$f":"VLOOKUP(A25,Plan!$A$6:$V$123,15,TRUE)","v":{"$error":"#N/A"}},{"$f":"VLOOKUP(A25,Plan!$A$6:$V$123,16,TRUE)","v":{"$error":"#N/A"}},{"$f":"VLOOKUP(A25,Plan!$A$6:$V$123,17,TRUE)","v":{"$error":"#N/A"}},{"$f":"VLOOKUP(A25,Plan!$A$6:$V$123,18,TRUE)","v":{"$error":"#N/A"}},{"$f":"VLOOKUP(A25,Plan!$A$6:$V$123,19,TRUE)","v":{"$error":"#N/A"}},{"$f":"VLOOKUP(A25,Plan!$A$6:$V$123,20,TRUE)","v":{"$error":"#N/A"}},{"$f":"VLOOKUP(A25,Plan!$A$6:$V$123,21,TRUE)","v":{"$error":"#N/A"}}]
[{"$nulls":4},{"$f":"VLOOKUP(A26,Plan!$A$6:$V$123,3,TRUE)","v":{"$error":"#N/A"}},{"$f":"VLOOKUP(A26,Plan!$A$6:$V$123,7,TRUE)","v":{"$error":"#N/A"}},{"$f":"VLOOKUP(A26,Plan!$A$6:$V$123,8,TRUE)","v":{"$error":"#N/A"}},{"$f":"VLOOKUP(A26,Plan!$A$6:$V$123,9,TRUE)","v":{"$error":"#N/A"}},{"$f":"VLOOKUP(A26,Plan!$A$6:$V$123,10,TRUE)","v":{"$error":"#N/A"}},{"$f":"VLOOKUP(A26,Plan!$A$6:$V$123,11,TRUE)","v":{"$error":"#N/A"}},{"$f":"VLOOKUP(A26,Plan!$A$6:$V$123,12,TRUE)","v":{"$error":"#N/A"}},{"$f":"VLOOKUP(A26,Plan!$A$6:$V$123,13,TRUE)","v":{"$error":"#N/A"}},{"$f":"VLOOKUP(A26,Plan!$A$6:$V$123,14,TRUE)","v":{"$error":"#N/A"}},{"$f":"VLOOKUP(A26,Plan!$A$6:$V$123,15,TRUE)","v":{"$error":"#N/A"}},{"$f":"VLOOKUP(A26,Plan!$A$6:$V$123,16,TRUE)","v":{"$error":"#N/A"}},{"$f":"VLOOKUP(A26,Plan!$A$6:$V$123,17,TRUE)","v":{"$error":"#N/A"}},{"$f":"VLOOKUP(A26,Plan!$A$6:$V$123,18,TRUE)","v":{"$error":"#N/A"}},{"$f":"VLOOKUP(A26,Plan!$A$6:$V$123,19,TRUE)","v":{"$error":"#N/A"}},{"$f":"VLOOKUP(A26,Plan!$A$6:$V$123,20,TRUE)","v":{"$error":"#N/A"}},{"$f":"VLOOKUP(A26,Plan!$A$6:$V$123,21,TRUE)","v":{"$error":"#N/A"}}]
[{"$nulls":4},{"$f":"VLOOKUP(A27,Plan!$A$6:$V$123,3,TRUE)","v":{"$error":"#N/A"}},{"$f":"VLOOKUP(A27,Plan!$A$6:$V$123,7,TRUE)","v":{"$error":"#N/A"}},{"$f":"VLOOKUP(A27,Plan!$A$6:$V$123,8,TRUE)","v":{"$error":"#N/A"}},{"$f":"VLOOKUP(A27,Plan!$A$6:$V$123,9,TRUE)","v":{"$error":"#N/A"}},{"$f":"VLOOKUP(A27,Plan!$A$6:$V$123,10,TRUE)","v":{"$error":"#N/A"}},{"$f":"VLOOKUP(A27,Plan!$A$6:$V$123,11,TRUE)","v":{"$error":"#N/A"}},{"$f":"VLOOKUP(A27,Plan!$A$6:$V$123,12,TRUE)","v":{"$error":"#N/A"}},{"$f":"VLOOKUP(A27,Plan!$A$6:$V$123,13,TRUE)","v":{"$error":"#N/A"}},{"$f":"VLOOKUP(A27,Plan!$A$6:$V$123,14,TRUE)","v":{"$error":"#N/A"}},{"$f":"VLOOKUP(A27,Plan!$A$6:$V$123,15,TRUE)","v":{"$error":"#N/A"}},{"$f":"VLOOKUP(A27,Plan!$A$6:$V$123,16,TRUE)","v":{"$error":"#N/A"}},{"$f":"VLOOKUP(A27,Plan!$A$6:$V$123,17,TRUE)","v":{"$error":"#N/A"}},{"$f":"VLOOKUP(A27,Plan!$A$6:$V$123,18,TRUE)","v":{"$error":"#N/A"}},{"$f":"VLOOKUP(A27,Plan!$A$6:$V$123,19,TRUE)","v":{"$error":"#N/A"}},{"$f":"VLOOKUP(A27,Plan!$A$6:$V$123,20,TRUE)","v":{"$error":"#N/A"}},{"$f":"VLOOKUP(A27,Plan!$A$6:$V$123,21,TRUE)","v":{"$error":"#N/A"}}]
[{"$nulls":4},{"$f":"VLOOKUP(A28,Plan!$A$6:$V$123,3,TRUE)","v":{"$error":"#N/A"}},{"$f":"VLOOKUP(A28,Plan!$A$6:$V$123,7,TRUE)","v":{"$error":"#N/A"}},{"$f":"VLOOKUP(A28,Plan!$A$6:$V$123,8,TRUE)","v":{"$error":"#N/A"}},{"$f":"VLOOKUP(A28,Plan!$A$6:$V$123,9,TRUE)","v":{"$error":"#N/A"}},{"$f":"VLOOKUP(A28,Plan!$A$6:$V$123,10,TRUE)","v":{"$error":"#N/A"}},{"$f":"VLOOKUP(A28,Plan!$A$6:$V$123,11,TRUE)","v":{"$error":"#N/A"}},{"$f":"VLOOKUP(A28,Plan!$A$6:$V$123,12,TRUE)","v":{"$error":"#N/A"}},{"$f":"VLOOKUP(A28,Plan!$A$6:$V$123,13,TRUE)","v":{"$error":"#N/A"}},{"$f":"VLOOKUP(A28,Plan!$A$6:$V$123,14,TRUE)","v":{"$error":"#N/A"}},{"$f":"VLOOKUP(A28,Plan!$A$6:$V$123,15,TRUE)","v":{"$error":"#N/A"}},{"$f":"VLOOKUP(A28,Plan!$A$6:$V$123,16,TRUE)","v":{"$error":"#N/A"}},{"$f":"VLOOKUP(A28,Plan!$A$6:$V$123,17,TRUE)","v":{"$error":"#N/A"}},{"$f":"VLOOKUP(A28,Plan!$A$6:$V$123,18,TRUE)","v":{"$error":"#N/A"}},{"$f":"VLOOKUP(A28,Plan!$A$6:$V$123,19,TRUE)","v":{"$error":"#N/A"}},{"$f":"VLOOKUP(A28,Plan!$A$6:$V$123,20,TRUE)","v":{"$error":"#N/A"}},{"$f":"VLOOKUP(A28,Plan!$A$6:$V$123,21,TRUE)","v":{"$error":"#N/A"}}]
["111018","MDH RESP",null,null,{"$f":"VLOOKUP(A29,Plan!$A$6:$V$123,3,TRUE)","v":"35h00"},{"$f":"VLOOKUP(A29,Plan!$A$6:$V$123,7,TRUE)","v":"35h00"},{"$f":"VLOOKUP(A29,Plan!$A$6:$V$123,8,TRUE)","v":0},{"$f":"VLOOKUP(A29,Plan!$A$6:$V$123,9,TRUE)","v":"19h-01h30#"},{"$f":"VLOOKUP(A29,Plan!$A$6:$V$123,10,TRUE)","v":0},{"$f":"VLOOKUP(A29,Plan!$A$6:$V$123,11,TRUE)","v":"19h-02h#"},{"$f":"VLOOKUP(A29,Plan!$A$6:$V$123,12,TRUE)","v":0},{"$f":"VLOOKUP(A29,Plan!$A$6:$V$123,13,TRUE)","v":"14h30-23h#"},{"$f":"VLOOKUP(A29,Plan!$A$6:$V$123,14,TRUE)","v":"R"},{"$f":"VLOOKUP(A29,Plan!$A$6:$V$123,15,TRUE)","v":0},{"$f":"VLOOKUP(A29,Plan!$A$6:$V$123,16,TRUE)","v":"R"},{"$f":"VLOOKUP(A29,Plan!$A$6:$V$123,17,TRUE)","v":0},{"$f":"VLOOKUP(A29,Plan!$A$6:$V$123,18,TRUE)","v":"08h-16h#"},{"$f":"VLOOKUP(A29,Plan!$A$6:$V$123,19,TRUE)","v":0},{"$f":"VLOOKUP(A29,Plan!$A$6:$V$123,20,TRUE)","v":"08h-15h30#"},{"$f":"VLOOKUP(A29,Plan!$A$6:$V$123,21,TRUE)","v":0}]
["509123","MDH RESP",null,null,{"$f":"VLOOKUP(A30,Plan!$A$6:$V$123,3,TRUE)","v":"39h00"},{"$f":"VLOOKUP(A30,Plan!$A$6:$V$123,7,TRUE)","v":"39h00"},{"$f":"VLOOKUP(A30,Plan!$A$6:$V$123,8,TRUE)","v":"R"},{"$f":"VLOOKUP(A30,Plan!$A$6:$V$123,9,TRUE)","v":0},{"$f":"VLOOKUP(A30,Plan!$A$6:$V$123,10,TRUE)","v":"10h-18h30#"},{"$f":"VLOOKUP(A30,Plan!$A$6:$V$123,11,TRUE)","v":0},{"$f":"VLOOKUP(A30,Plan!$A$6:$V$123,12,TRUE)","v":"10h-18h30#"},{"$f":"VLOOKUP(A30,Plan!$A$6:$V$123,13,TRUE)","v":0},{"$f":"VLOOKUP(A30,Plan!$A$6:$V$123,14,TRUE)","v":"10h-18h30#"},{"$f":"VLOOKUP(A30,Plan!$A$6:$V$123,15,TRUE)","v":0},{"$f":"VLOOKUP(A30,Plan!$A$6:$V$123,16,TRUE)","v":"07h30-17h#"},{"$f":"VLOOKUP(A30,Plan!$A$6:$V$123,17,TRUE)","v":0},{"$f":"VLOOKUP(A30,Plan!$A$6:$V$123,18,TRUE)","v":0},{"$f":"VLOOKUP(A30,Plan!$A$6:$V$123,19,TRUE)","v":"17h30-24h#"},{"$f":"VLOOKUP(A30,Plan!$A$6:$V$123,20,TRUE)","v":"R"},{"$f":"VLOOKUP(A30,Plan!$A$6:$V$123,21,TRUE)","v":0}]
["109201","MDH RESP",null,null,{"$f":"VLOOKUP(A31,Plan!$A$6:$V$123,3,TRUE)","v":"35h00"},{"$f":"VLOOKUP(A31,Plan!$A$6:$V$123,7,TRUE)","v":"35h00"},{"$f":"VLOOKUP(A31,Plan!$A$6:$V$123,8,TRUE)","v":"R"},{"$f":"VLOOKUP(A31,Plan!$A$6:$V$123,9,TRUE)","v":0},{"$f":"VLOOKUP(A31,Plan!$A$6:$V$123,10,TRUE)","v":"R"},{"$f":"VLOOKUP(A31,Plan!$A$6:$V$123,11,TRUE)","v":0},{"$f":"VLOOKUP(A31,Plan!$A$6:$V$123,12,TRUE)","v":0},{"$f":"VLOOKUP(A31,Plan!$A$6:$V$123,13,TRUE)","v":"19h-02h#"},{"$f":"VLOOKUP(A31,Plan!$A$6:$V$123,14,TRUE)","v":0},{"$f":"VLOOKUP(A31,Plan!$A$6:$V$123,15,TRUE)","v":"18h-02h#"},{"$f":"VLOOKUP(A31,Plan!$A$6:$V$123,16,TRUE)","v":0},{"$f":"VLOOKUP(A31,Plan!$A$6:$V$123,17,TRUE)","v":"18h-02h#"},{"$f":"VLOOKUP(A31,Plan!$A$6:$V$123,18,TRUE)","v":0},{"$f":"VLOOKUP(A31,Plan!$A$6:$V$123,19,TRUE)","v":"18h-24h#"},{"$f":"VLOOKUP(A31,Plan!$A$6:$V$123,20,TRUE)","v":0},{"$f":"VLOOKUP(A31,Plan!$A$6:$V$123,21,TRUE)","v":"14h30-23h#"}]
["000614","MDH RESP",null,null,{"$f":"VLOOKUP(A32,Plan!$A$6:$V$123,3,TRUE)","v":"39h00"},{"$f":"VLOOKUP(A32,Plan!$A$6:$V$123,7,TRUE)","v":"39h00"},{"$f":"VLOOKUP(A32,Plan!$A$6:$V$123,8,TRUE)","v":"R"},{"$f":"VLOOKUP(A32,Plan!$A$6:$V$123,9,TRUE)","v":0},{"$f":"VLOOKUP(A32,Plan!$A$6:$V$123,10,TRUE)","v":0},{"$f":"VLOOKUP(A32,Plan!$A$6:$V$123,11,TRUE)","v":"18h-02h#"},{"$f":"VLOOKUP(A32,Plan!$A$6:$V$123,12,TRUE)","v":0},{"$f":"VLOOKUP(A32,Plan!$A$6:$V$123,13,TRUE)","v":"18h-02h#"},{"$f":"VLOOKUP(A32,Plan!$A$6:$V$123,14,TRUE)","v":0},{"$f":"VLOOKUP(A32,Plan!$A$6:$V$123,15,TRUE)","v":"18h-02h#"},{"$f":"VLOOKUP(A32,Plan!$A$6:$V$123,16,TRUE)","v":0},{"$f":"VLOOKUP(A32,Plan!$A$6:$V$123,17,TRUE)","v":"14h30-23h30#"},{"$f":"VLOOKUP(A32,Plan!$A$6:$V$123,18,TRUE)","v":0},{"$f":"VLOOKUP(A32,Plan!$A$6:$V$123,19,TRUE)","v":"14h30-23h#"},{"$f":"VLOOKUP(A32,Plan!$A$6:$V$123,20,TRUE)","v":"R"},{"$f":"VLOOKUP(A32,Plan!$A$6:$V$123,21,TRUE)","v":0}]
["131909","MDH RESP",null,null,{"$f":"VLOOKUP(A33,Plan!$A$6:$V$123,3,TRUE)","v":"35h00"},{"$f":"VLOOKUP(A33,Plan!$A$6:$V$123,7,TRUE)","v":"35h00"},{"$f":"VLOOKUP(A33,Plan!$A$6:$V$123,8,TRUE)","v":0},{"$f":"VLOOKUP(A33,Plan!$A$6:$V$123,9,TRUE)","v":"18h-01h30#"},{"$f":"VLOOKUP(A33,Plan!$A$6:$V$123,10,TRUE)","v":0},{"$f":"VLOOKUP(A33,Plan!$A$6:$V$123,11,TRUE)","v":"14h30-23h#"},{"$f":"VLOOKUP(A33,Plan!$A$6:$V$123,12,TRUE)","v":"R"},{"$f":"VLOOKUP(A33,Plan!$A$6:$V$123,13,TRUE)","v":0},{"$f":"VLOOKUP(A33,Plan!$A$6:$V$123,14,TRUE)","v":"R"},{"$f":"VLOOKUP(A33,Plan!$A$6:$V$123,15,TRUE)","v":0},{"$f":"VLOOKUP(A33,Plan!$A$6:$V$123,16,TRUE)","v":0},{"$f":"VLOOKUP(A33,Plan!$A$6:$V$123,17,TRUE)","v":"18h-24h#"},{"$f":"VLOOKUP(A33,Plan!$A$6:$V$123,18,TRUE)","v":0},{"$f":"VLOOKUP(A33,Plan!$A$6:$V$123,19,TRUE)","v":"18h-02h#"},{"$f":"VLOOKUP(A33,Plan!$A$6:$V$123,20,TRUE)","v":0},{"$f":"VLOOKUP(A33,Plan!$A$6:$V$123,21,TRUE)","v":"18h-01h30#"}]
[{"$nulls":4},{"$f":"VLOOKUP(A34,Plan!$A$6:$V$123,3,TRUE)","v":{"$error":"#N/A"}},{"$f":"VLOOKUP(A34,Plan!$A$6:$V$123,7,TRUE)","v":{"$error":"#N/A"}},{"$f":"VLOOKUP(A34,Plan!$A$6:$V$123,8,TRUE)","v":{"$error":"#N/A"}},{"$f":"VLOOKUP(A34,Plan!$A$6:$V$123,9,TRUE)","v":{"$error":"#N/A"}},{"$f":"VLOOKUP(A34,Plan!$A$6:$V$123,10,TRUE)","v":{"$error":"#N/A"}},{"$f":"VLOOKUP(A34,Plan!$A$6:$V$123,11,TRUE)","v":{"$error":"#N/A"}},{"$f":"VLOOKUP(A34,Plan!$A$6:$V$123,12,TRUE)","v":{"$error":"#N/A"}},{"$f":"VLOOKUP(A34,Plan!$A$6:$V$123,13,TRUE)","v":{"$error":"#N/A"}},{"$f":"VLOOKUP(A34,Plan!$A$6:$V$123,14,TRUE)","v":{"$error":"#N/A"}},{"$f":"VLOOKUP(A34,Plan!$A$6:$V$123,15,TRUE)","v":{"$error":"#N/A"}},{"$f":"VLOOKUP(A34,Plan!$A$6:$V$123,16,TRUE)","v":{"$error":"#N/A"}},{"$f":"VLOOKUP(A34,Plan!$A$6:$V$123,17,TRUE)","v":{"$error":"#N/A"}},{"$f":"VLOOKUP(A34,Plan!$A$6:$V$123,18,TRUE)","v":{"$error":"#N/A"}},{"$f":"VLOOKUP(A34,Plan!$A$6:$V$123,19,TRUE)","v":{"$error":"#N/A"}},{"$f":"VLOOKUP(A34,Plan!$A$6:$V$123,20,TRUE)","v":{"$error":"#N/A"}},{"$f":"VLOOKUP(A34,Plan!$A$6:$V$123,21,TRUE)","v":{"$error":"#N/A"}}]
[{"$nulls":4},{"$f":"VLOOKUP(A35,Plan!$A$6:$V$123,3,TRUE)","v":{"$error":"#N/A"}},{"$f":"VLOOKUP(A35,Plan!$A$6:$V$123,7,TRUE)","v":{"$error":"#N/A"}},{"$f":"VLOOKUP(A35,Plan!$A$6:$V$123,8,TRUE)","v":{"$error":"#N/A"}},{"$f":"VLOOKUP(A35,Plan!$A$6:$V$123,9,TRUE)","v":{"$error":"#N/A"}},{"$f":"VLOOKUP(A35,Plan!$A$6:$V$123,10,TRUE)","v":{"$error":"#N/A"}},{"$f":"VLOOKUP(A35,Plan!$A$6:$V$123,11,TRUE)","v":{"$error":"#N/A"}},{"$f":"VLOOKUP(A35,Plan!$A$6:$V$123,12,TRUE)","v":{"$error":"#N/A"}},{"$f":"VLOOKUP(A35,Plan!$A$6:$V$123,13,TRUE)","v":{"$error":"#N/A"}},{"$f":"VLOOKUP(A35,Plan!$A$6:$V$123,14,TRUE)","v":{"$error":"#N/A"}},{"$f":"VLOOKUP(A35,Plan!$A$6:$V$123,15,TRUE)","v":{"$error":"#N/A"}},{"$f":"VLOOKUP(A35,Plan!$A$6:$V$123,16,TRUE)","v":{"$error":"#N/A"}},{"$f":"VLOOKUP(A35,Plan!$A$6:$V$123,17,TRUE)","v":{"$error":"#N/A"}},{"$f":"VLOOKUP(A35,Plan!$A$6:$V$123,18,TRUE)","v":{"$error":"#N/A"}},{"$f":"VLOOKUP(A35,Plan!$A$6:$V$123,19,TRUE)","v":{"$error":"#N/A"}},{"$f":"VLOOKUP(A35,Plan!$A$6:$V$123,20,TRUE)","v":{"$error":"#N/A"}},{"$f":"VLOOKUP(A35,Plan!$A$6:$V$123,21,TRUE)","v":{"$error":"#N/A"}}]
[{"$nulls":4},{"$f":"VLOOKUP(A36,Plan!$A$6:$V$123,3,TRUE)","v":{"$error":"#N/A"}},{"$f":"VLOOKUP(A36,Plan!$A$6:$V$123,7,TRUE)","v":{"$error":"#N/A"}},{"$f":"VLOOKUP(A36,Plan!$A$6:$V$123,8,TRUE)","v":{"$error":"#N/A"}},{"$f":"VLOOKUP(A36,Plan!$A$6:$V$123,9,TRUE)","v":{"$error":"#N/A"}},{"$f":"VLOOKUP(A36,Plan!$A$6:$V$123,10,TRUE)","v":{"$error":"#N/A"}},{"$f":"VLOOKUP(A36,Plan!$A$6:$V$123,11,TRUE)","v":{"$error":"#N/A"}},{"$f":"VLOOKUP(A36,Plan!$A$6:$V$123,12,TRUE)","v":{"$error":"#N/A"}},{"$f":"VLOOKUP(A36,Plan!$A$6:$V$123,13,TRUE)","v":{"$error":"#N/A"}},{"$f":"VLOOKUP(A36,Plan!$A$6:$V$123,14,TRUE)","v":{"$error":"#N/A"}},{"$f":"VLOOKUP(A36,Plan!$A$6:$V$123,15,TRUE)","v":{"$error":"#N/A"}},{"$f":"VLOOKUP(A36,Plan!$A$6:$V$123,16,TRUE)","v":{"$error":"#N/A"}},{"$f":"VLOOKUP(A36,Plan!$A$6:$V$123,17,TRUE)","v":{"$error":"#N/A"}},{"$f":"VLOOKUP(A36,Plan!$A$6:$V$123,18,TRUE)","v":{"$error":"#N/A"}},{"$f":"VLOOKUP(A36,Plan!$A$6:$V$123,19,TRUE)","v":{"$error":"#N/A"}},{"$f":"VLOOKUP(A36,Plan!$A$6:$V$123,20,TRUE)","v":{"$error":"#N/A"}},{"$f":"VLOOKUP(A36,Plan!$A$6:$V$123,21,TRUE)","v":{"$error":"#N/A"}}]
[{"$nulls":4},{"$f":"VLOOKUP(A37,Plan!$A$6:$V$123,3,TRUE)","v":{"$error":"#N/A"}},{"$f":"VLOOKUP(A37,Plan!$A$6:$V$123,7,TRUE)","v":{"$error":"#N/A"}},{"$f":"VLOOKUP(A37,Plan!$A$6:$V$123,8,TRUE)","v":{"$error":"#N/A"}},{"$f":"VLOOKUP(A37,Plan!$A$6:$V$123,9,TRUE)","v":{"$error":"#N/A"}},{"$f":"VLOOKUP(A37,Plan!$A$6:$V$123,10,TRUE)","v":{"$error":"#N/A"}},{"$f":"VLOOKUP(A37,Plan!$A$6:$V$123,11,TRUE)","v":{"$error":"#N/A"}},{"$f":"VLOOKUP(A37,Plan!$A$6:$V$123,12,TRUE)","v":{"$error":"#N/A"}},{"$f":"VLOOKUP(A37,Plan!$A$6:$V$123,13,TRUE)","v":{"$error":"#N/A"}},{"$f":"VLOOKUP(A37,Plan!$A$6:$V$123,14,TRUE)","v":{"$error":"#N/A"}},{"$f":"VLOOKUP(A37,Plan!$A$6:$V$123,15,TRUE)","v":{"$error":"#N/A"}},{"$f":"VLOOKUP(A37,Plan!$A$6:$V$123,16,TRUE)","v":{"$error":"#N/A"}},{"$f":"VLOOKUP(A37,Plan!$A$6:$V$123,17,TRUE)","v":{"$error":"#N/A"}},{"$f":"VLOOKUP(A37,Plan!$A$6:$V$123,18,TRUE)","v":{"$error":"#N/A"}},{"$f":"VLOOKUP(A37,Plan!$A$6:$V$123,19,TRUE)","v":{"$error":"#N/A"}},{"$f":"VLOOKUP(A37,Plan!$A$6:$V$123,20,TRUE)","v":{"$error":"#N/A"}},{"$f":"VLOOKUP(A37,Plan!$A$6:$V$123,21,TRUE)","v":{"$error":"#N/A"}}]
[{"$nulls":4},{"$f":"VLOOKUP(A38,Plan!$A$6:$V$123,3,TRUE)","v":{"$error":"#N/A"}},{"$f":"VLOOKUP(A38,Plan!$A$6:$V$123,7,TRUE)","v":{"$error":"#N/A"}},{"$f":"VLOOKUP(A38,Plan!$A$6:$V$123,8,TRUE)","v":{"$error":"#N/A"}},{"$f":"VLOOKUP(A38,Plan!$A$6:$V$123,9,TRUE)","v":{"$error":"#N/A"}},{"$f":"VLOOKUP(A38,Plan!$A$6:$V$123,10,TRUE)","v":{"$error":"#N/A"}},{"$f":"VLOOKUP(A38,Plan!$A$6:$V$123,11,TRUE)","v":{"$error":"#N/A"}},{"$f":"VLOOKUP(A38,Plan!$A$6:$V$123,12,TRUE)","v":{"$error":"#N/A"}},{"$f":"VLOOKUP(A38,Plan!$A$6:$V$123,13,TRUE)","v":{"$error":"#N/A"}},{"$f":"VLOOKUP(A38,Plan!$A$6:$V$123,14,TRUE)","v":{"$error":"#N/A"}},{"$f":"VLOOKUP(A38,Plan!$A$6:$V$123,15,TRUE)","v":{"$error":"#N/A"}},{"$f":"VLOOKUP(A38,Plan!$A$6:$V$123,16,TRUE)","v":{"$error":"#N/A"}},{"$f":"VLOOKUP(A38,Plan!$A$6:$V$123,17,TRUE)","v":{"$error":"#N/A"}},{"$f":"VLOOKUP(A38,Plan!$A$6:$V$123,18,TRUE)","v":{"$error":"#N/A"}},{"$f":"VLOOKUP(A38,Plan!$A$6:$V$123,19,TRUE)","v":{"$error":"#N/A"}},{"$f":"VLOOKUP(A38,Plan!$A$6:$V$123,20,TRUE)","v":{"$error":"#N/A"}},{"$f":"VLOOKUP(A38,Plan!$A$6:$V$123,21,TRUE)","v":{"$error":"#N/A"}}]
[{"$nulls":4},{"$f":"VLOOKUP(A39,Plan!$A$6:$V$123,3,TRUE)","v":{"$error":"#N/A"}},{"$f":"VLOOKUP(A39,Plan!$A$6:$V$123,7,TRUE)","v":{"$error":"#N/A"}},{"$f":"VLOOKUP(A39,Plan!$A$6:$V$123,8,TRUE)","v":{"$error":"#N/A"}},{"$f":"VLOOKUP(A39,Plan!$A$6:$V$123,9,TRUE)","v":{"$error":"#N/A"}},{"$f":"VLOOKUP(A39,Plan!$A$6:$V$123,10,TRUE)","v":{"$error":"#N/A"}},{"$f":"VLOOKUP(A39,Plan!$A$6:$V$123,11,TRUE)","v":{"$error":"#N/A"}},{"$f":"VLOOKUP(A39,Plan!$A$6:$V$123,12,TRUE)","v":{"$error":"#N/A"}},{"$f":"VLOOKUP(A39,Plan!$A$6:$V$123,13,TRUE)","v":{"$error":"#N/A"}},{"$f":"VLOOKUP(A39,Plan!$A$6:$V$123,14,TRUE)","v":{"$error":"#N/A"}},{"$f":"VLOOKUP(A39,Plan!$A$6:$V$123,15,TRUE)","v":{"$error":"#N/A"}},{"$f":"VLOOKUP(A39,Plan!$A$6:$V$123,16,TRUE)","v":{"$error":"#N/A"}},{"$f":"VLOOKUP(A39,Plan!$A$6:$V$123,17,TRUE)","v":{"$error":"#N/A"}},{"$f":"VLOOKUP(A39,Plan!$A$6:$V$123,18,TRUE)","v":{"$error":"#N/A"}},{"$f":"VLOOKUP(A39,Plan!$A$6:$V$123,19,TRUE)","v":{"$error":"#N/A"}},{"$f":"VLOOKUP(A39,Plan!$A$6:$V$123,20,TRUE)","v":{"$error":"#N/A"}},{"$f":"VLOOKUP(A39,Plan!$A$6:$V$123,21,TRUE)","v":{"$error":"#N/A"}}]
[{"$nulls":4},{"$f":"VLOOKUP(A40,Plan!$A$6:$V$123,3,TRUE)","v":{"$error":"#N/A"}},{"$f":"VLOOKUP(A40,Plan!$A$6:$V$123,7,TRUE)","v":{"$error":"#N/A"}},{"$f":"VLOOKUP(A40,Plan!$A$6:$V$123,8,TRUE)","v":{"$error":"#N/A"}},{"$f":"VLOOKUP(A40,Plan!$A$6:$V$123,9,TRUE)","v":{"$error":"#N/A"}},{"$f":"VLOOKUP(A40,Plan!$A$6:$V$123,10,TRUE)","v":{"$error":"#N/A"}},{"$f":"VLOOKUP(A40,Plan!$A$6:$V$123,11,TRUE)","v":{"$error":"#N/A"}},{"$f":"VLOOKUP(A40,Plan!$A$6:$V$123,12,TRUE)","v":{"$error":"#N/A"}},{"$f":"VLOOKUP(A40,Plan!$A$6:$V$123,13,TRUE)","v":{"$error":"#N/A"}},{"$f":"VLOOKUP(A40,Plan!$A$6:$V$123,14,TRUE)","v":{"$error":"#N/A"}},{"$f":"VLOOKUP(A40,Plan!$A$6:$V$123,15,TRUE)","v":{"$error":"#N/A"}},{"$f":"VLOOKUP(A40,Plan!$A$6:$V$123,16,TRUE)","v":{"$error":"#N/A"}},{"$f":"VLOOKUP(A40,Plan!$A$6:$V$123,17,TRUE)","v":{"$error":"#N/A"}},{"$f":"VLOOKUP(A40,Plan!$A$6:$V$123,18,TRUE)","v":{"$error":"#N/A"}},{"$f":"VLOOKUP(A40,Plan!$A$6:$V$123,19,TRUE)","v":{"$error":"#N/A"}},{"$f":"VLOOKUP(A40,Plan!$A$6:$V$123,20,TRUE)","v":{"$error":"#N/A"}},{"$f":"VLOOKUP(A40,Plan!$A$6:$V$123,21,TRUE)","v":{"$error":"#N/A"}}]
[{"$nulls":4},{"$f":"VLOOKUP(A41,Plan!$A$6:$V$123,3,TRUE)","v":{"$error":"#N/A"}},{"$f":"VLOOKUP(A41,Plan!$A$6:$V$123,7,TRUE)","v":{"$error":"#N/A"}},{"$f":"VLOOKUP(A41,Plan!$A$6:$V$123,8,TRUE)","v":{"$error":"#N/A"}},{"$f":"VLOOKUP(A41,Plan!$A$6:$V$123,9,TRUE)","v":{"$error":"#N/A"}},{"$f":"VLOOKUP(A41,Plan!$A$6:$V$123,10,TRUE)","v":{"$error":"#N/A"}},{"$f":"VLOOKUP(A41,Plan!$A$6:$V$123,11,TRUE)","v":{"$error":"#N/A"}},{"$f":"VLOOKUP(A41,Plan!$A$6:$V$123,12,TRUE)","v":{"$error":"#N/A"}},{"$f":"VLOOKUP(A41,Plan!$A$6:$V$123,13,TRUE)","v":{"$error":"#N/A"}},{"$f":"VLOOKUP(A41,Plan!$A$6:$V$123,14,TRUE)","v":{"$error":"#N/A"}},{"$f":"VLOOKUP(A41,Plan!$A$6:$V$123,15,TRUE)","v":{"$error":"#N/A"}},{"$f":"VLOOKUP(A41,Plan!$A$6:$V$123,16,TRUE)","v":{"$error":"#N/A"}},{"$f":"VLOOKUP(A41,Plan!$A$6:$V$123,17,TRUE)","v":{"$error":"#N/A"}},{"$f":"VLOOKUP(A41,Plan!$A$6:$V$123,18,TRUE)","v":{"$error":"#N/A"}},{"$f":"VLOOKUP(A41,Plan!$A$6:$V$123,19,TRUE)","v":{"$error":"#N/A"}},{"$f":"VLOOKUP(A41,Plan!$A$6:$V$123,20,TRUE)","v":{"$error":"#N/A"}},{"$f":"VLOOKUP(A41,Plan!$A$6:$V$123,21,TRUE)","v":{"$error":"#N/A"}}]
[{"$nulls":4},{"$f":"VLOOKUP(A42,Plan!$A$6:$V$123,3,TRUE)","v":{"$error":"#N/A"}},{"$f":"VLOOKUP(A42,Plan!$A$6:$V$123,7,TRUE)","v":{"$error":"#N/A"}},{"$f":"VLOOKUP(A42,Plan!$A$6:$V$123,8,TRUE)","v":{"$error":"#N/A"}},{"$f":"VLOOKUP(A42,Plan!$A$6:$V$123,9,TRUE)","v":{"$error":"#N/A"}},{"$f":"VLOOKUP(A42,Plan!$A$6:$V$123,10,TRUE)","v":{"$error":"#N/A"}},{"$f":"VLOOKUP(A42,Plan!$A$6:$V$123,11,TRUE)","v":{"$error":"#N/A"}},{"$f":"VLOOKUP(A42,Plan!$A$6:$V$123,12,TRUE)","v":{"$error":"#N/A"}},{"$f":"VLOOKUP(A42,Plan!$A$6:$V$123,13,TRUE)","v":{"$error":"#N/A"}},{"$f":"VLOOKUP(A42,Plan!$A$6:$V$123,14,TRUE)","v":{"$error":"#N/A"}},{"$f":"VLOOKUP(A42,Plan!$A$6:$V$123,15,TRUE)","v":{"$error":"#N/A"}},{"$f":"VLOOKUP(A42,Plan!$A$6:$V$123,16,TRUE)","v":{"$error":"#N/A"}},{"$f":"VLOOKUP(A42,Plan!$A$6:$V$123,17,TRUE)","v":{"$error":"#N/A"}},{"$f":"VLOOKUP(A42,Plan!$A$6:$V$123,18,TRUE)","v":{"$error":"#N/A"}},{"$f":"VLOOKUP(A42,Plan!$A$6:$V$123,19,TRUE)","v":{"$error":"#N/A"}},{"$f":"VLOOKUP(A42,Plan!$A$6:$V$123,20,TRUE)","v":{"$error":"#N/A"}},{"$f":"VLOOKUP(A42,Plan!$A$6:$V$123,21,TRUE)","v":{"$error":"#N/A"}}]
[{"$nulls":4},{"$f":"VLOOKUP(A43,Plan!$A$6:$V$123,3,TRUE)","v":{"$error":"#N/A"}},{"$f":"VLOOKUP(A43,Plan!$A$6:$V$123,7,TRUE)","v":{"$error":"#N/A"}},{"$f":"VLOOKUP(A43,Plan!$A$6:$V$123,8,TRUE)","v":{"$error":"#N/A"}},{"$f":"VLOOKUP(A43,Plan!$A$6:$V$123,9,TRUE)","v":{"$error":"#N/A"}},{"$f":"VLOOKUP(A43,Plan!$A$6:$V$123,10,TRUE)","v":{"$error":"#N/A"}},{"$f":"VLOOKUP(A43,Plan!$A$6:$V$123,11,TRUE)","v":{"$error":"#N/A"}},{"$f":"VLOOKUP(A43,Plan!$A$6:$V$123,12,TRUE)","v":{"$error":"#N/A"}},{"$f":"VLOOKUP(A43,Plan!$A$6:$V$123,13,TRUE)","v":{"$error":"#N/A"}},{"$f":"VLOOKUP(A43,Plan!$A$6:$V$123,14,TRUE)","v":{"$error":"#N/A"}},{"$f":"VLOOKUP(A43,Plan!$A$6:$V$123,15,TRUE)","v":{"$error":"#N/A"}},{"$f":"VLOOKUP(A43,Plan!$A$6:$V$123,16,TRUE)","v":{"$error":"#N/A"}},{"$f":"VLOOKUP(A43,Plan!$A$6:$V$123,17,TRUE)","v":{"$error":"#N/A"}},{"$f":"VLOOKUP(A43,Plan!$A$6:$V$123,18,TRUE)","v":{"$error":"#N/A"}},{"$f":"VLOOKUP(A43,Plan!$A$6:$V$123,19,TRUE)","v":{"$error":"#N/A"}},{"$f":"VLOOKUP(A43,Plan!$A$6:$V$123,20,TRUE)","v":{"$error":"#N/A"}},{"$f":"VLOOKUP(A43,Plan!$A$6:$V$123,21,TRUE)","v":{"$error":"#N/A"}}]
[{"$nulls":4},{"$f":"VLOOKUP(A44,Plan!$A$6:$V$123,3,TRUE)","v":{"$error":"#N/A"}},{"$f":"VLOOKUP(A44,Plan!$A$6:$V$123,7,TRUE)","v":{"$error":"#N/A"}},{"$f":"VLOOKUP(A44,Plan!$A$6:$V$123,8,TRUE)","v":{"$error":"#N/A"}},{"$f":"VLOOKUP(A44,Plan!$A$6:$V$123,9,TRUE)","v":{"$error":"#N/A"}},{"$f":"VLOOKUP(A44,Plan!$A$6:$V$123,10,TRUE)","v":{"$error":"#N/A"}},{"$f":"VLOOKUP(A44,Plan!$A$6:$V$123,11,TRUE)","v":{"$error":"#N/A"}},{"$f":"VLOOKUP(A44,Plan!$A$6:$V$123,12,TRUE)","v":{"$error":"#N/A"}},{"$f":"VLOOKUP(A44,Plan!$A$6:$V$123,13,TRUE)","v":{"$error":"#N/A"}},{"$f":"VLOOKUP(A44,Plan!$A$6:$V$123,14,TRUE)","v":{"$error":"#N/A"}},{"$f":"VLOOKUP(A44,Plan!$A$6:$V$123,15,TRUE)","v":{"$error":"#N/A"}},{"$f":"VLOOKUP(A44,Plan!$A$6:$V$123,16,TRUE)","v":{"$error":"#N/A"}},{"$f":"VLOOKUP(A44,Plan!$A$6:$V$123,17,TRUE)","v":{"$error":"#N/A"}},{"$f":"VLOOKUP(A44,Plan!$A$6:$V$123,18,TRUE)","v":{"$error":"#N/A"}},{"$f":"VLOOKUP(A44,Plan!$A$6:$V$123,19,TRUE)","v":{"$error":"#N/A"}},{"$f":"VLOOKUP(A44,Plan!$A$6:$V$123,20,TRUE)","v":{"$error":"#N/A"}},{"$f":"VLOOKUP(A44,Plan!$A$6:$V$123,21,TRUE)","v":{"$error":"#N/A"}}]
["024313","MDH",null,null,{"$f":"VLOOKUP(A45,Plan!$A$6:$V$123,3,TRUE)","v":"39h00"},{"$f":"VLOOKUP(A45,Plan!$A$6:$V$123,7,TRUE)","v":"39h00"},{"$f":"VLOOKUP(A45,Plan!$A$6:$V$123,8,TRUE)","v":"09h-17h18#"},{"$f":"VLOOKUP(A45,Plan!$A$6:$V$123,9,TRUE)","v":0},{"$f":"VLOOKUP(A45,Plan!$A$6:$V$123,10,TRUE)","v":"09h-17h18#"},{"$f":"VLOOKUP(A45,Plan!$A$6:$V$123,11,TRUE)","v":0},{"$f":"VLOOKUP(A45,Plan!$A$6:$V$123,12,TRUE)","v":"R"},{"$f":"VLOOKUP(A45,Plan!$A$6:$V$123,13,TRUE)","v":0},{"$f":"VLOOKUP(A45,Plan!$A$6:$V$123,14,TRUE)","v":"R"},{"$f":"VLOOKUP(A45,Plan!$A$6:$V$123,15,TRUE)","v":0},{"$f":"VLOOKUP(A45,Plan!$A$6:$V$123,16,TRUE)","v":"09h-17h18#"},{"$f":"VLOOKUP(A45,Plan!$A$6:$V$123,17,TRUE)","v":0},{"$f":"VLOOKUP(A45,Plan!$A$6:$V$123,18,TRUE)","v":"08h-16h18#"},{"$f":"VLOOKUP(A45,Plan!$A$6:$V$123,19,TRUE)","v":0},{"$f":"VLOOKUP(A45,Plan!$A$6:$V$123,20,TRUE)","v":"08h-16h18#"},{"$f":"VLOOKUP(A45,Plan!$A$6:$V$123,21,TRUE)","v":0}]
["807012","MDH",null,null,{"$f":"VLOOKUP(A46,Plan!$A$6:$V$123,3,TRUE)","v":"39h00"},{"$f":"VLOOKUP(A46,Plan!$A$6:$V$123,7,TRUE)","v":"39h00"},{"$f":"VLOOKUP(A46,Plan!$A$6:$V$123,8,TRUE)","v":0},{"$f":"VLOOKUP(A46,Plan!$A$6:$V$123,9,TRUE)","v":"18h-02h#"},{"$f":"VLOOKUP(A46,Plan!$A$6:$V$123,10,TRUE)","v":"R"},{"$f":"VLOOKUP(A46,Plan!$A$6:$V$123,11,TRUE)","v":0},{"$f":"VLOOKUP(A46,Plan!$A$6:$V$123,12,TRUE)","v":"R"},{"$f":"VLOOKUP(A46,Plan!$A$6:$V$123,13,TRUE)","v":0},{"$f":"VLOOKUP(A46,Plan!$A$6:$V$123,14,TRUE)","v":0},{"$f":"VLOOKUP(A46,Plan!$A$6:$V$123,15,TRUE)","v":"18h-02h#"},{"$f":"VLOOKUP(A46,Plan!$A$6:$V$123,16,TRUE)","v":0},{"$f":"VLOOKUP(A46,Plan!$A$6:$V$123,17,TRUE)","v":"18h-02h#"},{"$f":"VLOOKUP(A46,Plan!$A$6:$V$123,18,TRUE)","v":0},{"$f":"VLOOKUP(A46,Plan!$A$6:$V$123,19,TRUE)","v":"17h30-02h#"},{"$f":"VLOOKUP(A46,Plan!$A$6:$V$123,20,TRUE)","v":0},{"$f":"VLOOKUP(A46,Plan!$A$6:$V$123,21,TRUE)","v":"17h-02h#"}]
["000443","MDH",null,null,{"$f":"VLOOKUP(A47,Plan!$A$6:$V$123,3,TRUE)","v":"39h00"},{"$f":"VLOOKUP(A47,Plan!$A$6:$V$123,7,TRUE)","v":"00h00"},{"$f":"VLOOKUP(A47,Plan!$A$6:$V$123,8,TRUE)","v":"ATJ"},{"$f":"VLOOKUP(A47,Plan!$A$6:$V$123,9,TRUE)","v":0},{"$f":"VLOOKUP(A47,Plan!$A$6:$V$123,10,TRUE)","v":"ATJ"},{"$f":"VLOOKUP(A47,Plan!$A$6:$V$123,11,TRUE)","v":0},{"$f":"VLOOKUP(A47,Plan!$A$6:$V$123,12,TRUE)","v":"ATJ"},{"$f":"VLOOKUP(A47,Plan!$A$6:$V$123,13,TRUE)","v":0},{"$f":"VLOOKUP(A47,Plan!$A$6:$V$123,14,TRUE)","v":"ATJ"},{"$f":"VLOOKUP(A47,Plan!$A$6:$V$123,15,TRUE)","v":0},{"$f":"VLOOKUP(A47,Plan!$A$6:$V$123,16,TRUE)","v":"ATJ"},{"$f":"VLOOKUP(A47,Plan!$A$6:$V$123,17,TRUE)","v":0},{"$f":"VLOOKUP(A47,Plan!$A$6:$V$123,18,TRUE)","v":"R"},{"$f":"VLOOKUP(A47,Plan!$A$6:$V$123,19,TRUE)","v":0},{"$f":"VLOOKUP(A47,Plan!$A$6:$V$123,20,TRUE)","v":"R"},{"$f":"VLOOKUP(A47,Plan!$A$6:$V$123,21,TRUE)","v":0}]
["002404","MDH",null,null,{"$f":"VLOOKUP(A48,Plan!$A$6:$V$123,3,TRUE)","v":"39h00"},{"$f":"VLOOKUP(A48,Plan!$A$6:$V$123,7,TRUE)","v":"39h00"},{"$f":"VLOOKUP(A48,Plan!$A$6:$V$123,8,TRUE)","v":"R"},{"$f":"VLOOKUP(A48,Plan!$A$6:$V$123,9,TRUE)","v":0},{"$f":"VLOOKUP(A48,Plan!$A$6:$V$123,10,TRUE)","v":"11h45-15h#"},{"$f":"VLOOKUP(A48,Plan!$A$6:$V$123,11,TRUE)","v":"18h30-24h#"},{"$f":"VLOOKUP(A48,Plan!$A$6:$V$123,12,TRUE)","v":"11h45-15h#"},{"$f":"VLOOKUP(A48,Plan!$A$6:$V$123,13,TRUE)","v":"18h30-24h#"},{"$f":"VLOOKUP(A48,Plan!$A$6:$V$123,14,TRUE)","v":"11h45-15h#"},{"$f":"VLOOKUP(A48,Plan!$A$6:$V$123,15,TRUE)","v":"18h30-24h#"},{"$f":"VLOOKUP(A48,Plan!$A$6:$V$123,16,TRUE)","v":"11h45-15h#"},{"$f":"VLOOKUP(A48,Plan!$A$6:$V$123,17,TRUE)","v":"18h30-24h#"},{"$f":"VLOOKUP(A48,Plan!$A$6:$V$123,18,TRUE)","v":"11h45-15h#"},{"$f":"VLOOKUP(A48,Plan!$A$6:$V$123,19,TRUE)","v":"18h30-00h15#"},{"$f":"VLOOKUP(A48,Plan!$A$6:$V$123,20,TRUE)","v":"R"},{"$f":"VLOOKUP(A48,Plan!$A$6:$V$123,21,TRUE)","v":0}]
["030456","MDH",null,null,{"$f":"VLOOKUP(A49,Plan!$A$6:$V$123,3,TRUE)","v":"39h00"},{"$f":"VLOOKUP(A49,Plan!$A$6:$V$123,7,TRUE)","v":"39h00"},{"$f":"VLOOKUP(A49,Plan!$A$6:$V$123,8,TRUE)","v":"R"},{"$f":"VLOOKUP(A49,Plan!$A$6:$V$123,9,TRUE)","v":0},{"$f":"VLOOKUP(A49,Plan!$A$6:$V$123,10,TRUE)","v":0},{"$f":"VLOOKUP(A49,Plan!$A$6:$V$123,11,TRUE)","v":"18h-02h#"},{"$f":"VLOOKUP(A49,Plan!$A$6:$V$123,12,TRUE)","v":0},{"$f":"VLOOKUP(A49,Plan!$A$6:$V$123,13,TRUE)","v":"18h-02h#"},{"$f":"VLOOKUP(A49,Plan!$A$6:$V$123,14,TRUE)","v":0},{"$f":"VLOOKUP(A49,Plan!$A$6:$V$123,15,TRUE)","v":"18h-02h#"},{"$f":"VLOOKUP(A49,Plan!$A$6:$V$123,16,TRUE)","v":0},{"$f":"VLOOKUP(A49,Plan!$A$6:$V$123,17,TRUE)","v":"18h-02h30#"},{"$f":"VLOOKUP(A49,Plan!$A$6:$V$123,18,TRUE)","v":0},{"$f":"VLOOKUP(A49,Plan!$A$6:$V$123,19,TRUE)","v":"17h30-02h30#"},{"$f":"VLOOKUP(A49,Plan!$A$6:$V$123,20,TRUE)","v":"R"},{"$f":"VLOOKUP(A49,Plan!$A$6:$V$123,21,TRUE)","v":0}]
["050993","MDH",null,null,{"$f":"VLOOKUP(A50,Plan!$A$6:$V$123,3,TRUE)","v":"35h00"},{"$f":"VLOOKUP(A50,Plan!$A$6:$V$123,7,TRUE)","v":"35h00"},{"$f":"VLOOKUP(A50,Plan!$A$6:$V$123,8,TRUE)","v":"R"},{"$f":"VLOOKUP(A50,Plan!$A$6:$V$123,9,TRUE)","v":0},{"$f":"VLOOKUP(A50,Plan!$A$6:$V$123,10,TRUE)","v":"R"},{"$f":"VLOOKUP(A50,Plan!$A$6:$V$123,11,TRUE)","v":0},{"$f":"VLOOKUP(A50,Plan!$A$6:$V$123,12,TRUE)","v":0},{"$f":"VLOOKUP(A50,Plan!$A$6:$V$123,13,TRUE)","v":"18h-02h#"},{"$f":"VLOOKUP(A50,Plan!$A$6:$V$123,14,TRUE)","v":0},{"$f":"VLOOKUP(A50,Plan!$A$6:$V$123,15,TRUE)","v":"18h-02h#"},{"$f":"VLOOKUP(A50,Plan!$A$6:$V$123,16,TRUE)","v":0},{"$f":"VLOOKUP(A50,Plan!$A$6:$V$123,17,TRUE)","v":"18h-02h#"},{"$f":"VLOOKUP(A50,Plan!$A$6:$V$123,18,TRUE)","v":0},{"$f":"VLOOKUP(A50,Plan!$A$6:$V$123,19,TRUE)","v":"18h-02h#"},{"$f":"VLOOKUP(A50,Plan!$A$6:$V$123,20,TRUE)","v":0},{"$f":"VLOOKUP(A50,Plan!$A$6:$V$123,21,TRUE)","v":"18h-23h30#"}]
["003394","MDH",null,null,{"$f":"VLOOKUP(A51,Plan!$A$6:$V$123,3,TRUE)","v":"39h00"},{"$f":"VLOOKUP(A51,Plan!$A$6:$V$123,7,TRUE)","v":"00h00"},{"$f":"VLOOKUP(A51,Plan!$A$6:$V$123,8,TRUE)","v":"MAL"},{"$f":"VLOOKUP(A51,Plan!$A$6:$V$123,9,TRUE)","v":0},{"$f":"VLOOKUP(A51,Plan!$A$6:$V$123,10,TRUE)","v":"MAL"},{"$f":"VLOOKUP(A51,Plan!$A$6:$V$123,11,TRUE)","v":0},{"$f":"VLOOKUP(A51,Plan!$A$6:$V$123,12,TRUE)","v":"MAL"},{"$f":"VLOOKUP(A51,Plan!$A$6:$V$123,13,TRUE)","v":0},{"$f":"VLOOKUP(A51,Plan!$A$6:$V$123,14,TRUE)","v":"MAL"},{"$f":"VLOOKUP(A51,Plan!$A$6:$V$123,15,TRUE)","v":0},{"$f":"VLOOKUP(A51,Plan!$A$6:$V$123,16,TRUE)","v":"MAL"},{"$f":"VLOOKUP(A51,Plan!$A$6:$V$123,17,TRUE)","v":0},{"$f":"VLOOKUP(A51,Plan!$A$6:$V$123,18,TRUE)","v":"R"},{"$f":"VLOOKUP(A51,Plan!$A$6:$V$123,19,TRUE)","v":0},{"$f":"VLOOKUP(A51,Plan!$A$6:$V$123,20,TRUE)","v":"R"},{"$f":"VLOOKUP(A51,Plan!$A$6:$V$123,21,TRUE)","v":0}]
["028742","MDH",null,null,{"$f":"VLOOKUP(A52,Plan!$A$6:$V$123,3,TRUE)","v":"39h00"},{"$f":"VLOOKUP(A52,Plan!$A$6:$V$123,7,TRUE)","v":"39h00"},{"$f":"VLOOKUP(A52,Plan!$A$6:$V$123,8,TRUE)","v":"R"},{"$f":"VLOOKUP(A52,Plan!$A$6:$V$123,9,TRUE)","v":0},{"$f":"VLOOKUP(A52,Plan!$A$6:$V$123,10,TRUE)","v":"09h30-17h30#"},{"$f":"VLOOKUP(A52,Plan!$A$6:$V$123,11,TRUE)","v":0},{"$f":"VLOOKUP(A52,Plan!$A$6:$V$123,12,TRUE)","v":"09h30-17h30#"},{"$f":"VLOOKUP(A52,Plan!$A$6:$V$123,13,TRUE)","v":0},{"$f":"VLOOKUP(A52,Plan!$A$6:$V$123,14,TRUE)","v":"09h30-17h30#"},{"$f":"VLOOKUP(A52,Plan!$A$6:$V$123,15,TRUE)","v":0},{"$f":"VLOOKUP(A52,Plan!$A$6:$V$123,16,TRUE)","v":"09h30-17h30#"},{"$f":"VLOOKUP(A52,Plan!$A$6:$V$123,17,TRUE)","v":0},{"$f":"VLOOKUP(A52,Plan!$A$6:$V$123,18,TRUE)","v":"08h30-18h#"},{"$f":"VLOOKUP(A52,Plan!$A$6:$V$123,19,TRUE)","v":0},{"$f":"VLOOKUP(A52,Plan!$A$6:$V$123,20,TRUE)","v":"R"},{"$f":"VLOOKUP(A52,Plan!$A$6:$V$123,21,TRUE)","v":0}]
["409016","MDH",null,null,{"$f":"VLOOKUP(A53,Plan!$A$6:$V$123,3,TRUE)","v":"39h00"},{"$f":"VLOOKUP(A53,Plan!$A$6:$V$123,7,TRUE)","v":"00h00"},{"$f":"VLOOKUP(A53,Plan!$A$6:$V$123,8,TRUE)","v":"CIF"},{"$f":"VLOOKUP(A53,Plan!$A$6:$V$123,9,TRUE)","v":0},{"$f":"VLOOKUP(A53,Plan!$A$6:$V$123,10,TRUE)","v":"CIF"},{"$f":"VLOOKUP(A53,Plan!$A$6:$V$123,11,TRUE)","v":0},{"$f":"VLOOKUP(A53,Plan!$A$6:$V$123,12,TRUE)","v":"CIF"},{"$f":"VLOOKUP(A53,Plan!$A$6:$V$123,13,TRUE)","v":0},{"$f":"VLOOKUP(A53,Plan!$A$6:$V$123,14,TRUE)","v":"CIF"},{"$f":"VLOOKUP(A53,Plan!$A$6:$V$123,15,TRUE)","v":0},{"$f":"VLOOKUP(A53,Plan!$A$6:$V$123,16,TRUE)","v":"CIF"},{"$f":"VLOOKUP(A53,Plan!$A$6:$V$123,17,TRUE)","v":0},{"$f":"VLOOKUP(A53,Plan!$A$6:$V$123,18,TRUE)","v":"R"},{"$f":"VLOOKUP(A53,Plan!$A$6:$V$123,19,TRUE)","v":0},{"$f":"VLOOKUP(A53,Plan!$A$6:$V$123,20,TRUE)","v":"R"},{"$f":"VLOOKUP(A53,Plan!$A$6:$V$123,21,TRUE)","v":0}]
["066666","MDH",null,null,{"$f":"VLOOKUP(A54,Plan!$A$6:$V$123,3,TRUE)","v":"39h00"},{"$f":"VLOOKUP(A54,Plan!$A$6:$V$123,7,TRUE)","v":"39h00"},{"$f":"VLOOKUP(A54,Plan!$A$6:$V$123,8,TRUE)","v":"R"},{"$f":"VLOOKUP(A54,Plan!$A$6:$V$123,9,TRUE)","v":0},{"$f":"VLOOKUP(A54,Plan!$A$6:$V$123,10,TRUE)","v":0},{"$f":"VLOOKUP(A54,Plan!$A$6:$V$123,11,TRUE)","v":"16h-00h18#"},{"$f":"VLOOKUP(A54,Plan!$A$6:$V$123,12,TRUE)","v":0},{"$f":"VLOOKUP(A54,Plan!$A$6:$V$123,13,TRUE)","v":"16h-00h18#"},{"$f":"VLOOKUP(A54,Plan!$A$6:$V$123,14,TRUE)","v":0},{"$f":"VLOOKUP(A54,Plan!$A$6:$V$123,15,TRUE)","v":"16h-00h18#"},{"$f":"VLOOKUP(A54,Plan!$A$6:$V$123,16,TRUE)","v":0},{"$f":"VLOOKUP(A54,Plan!$A$6:$V$123,17,TRUE)","v":"16h-00h18#"},{"$f":"VLOOKUP(A54,Plan!$A$6:$V$123,18,TRUE)","v":0},{"$f":"VLOOKUP(A54,Plan!$A$6:$V$123,19,TRUE)","v":"16h-00h18#"},{"$f":"VLOOKUP(A54,Plan!$A$6:$V$123,20,TRUE)","v":"R"},{"$f":"VLOOKUP(A54,Plan!$A$6:$V$123,21,TRUE)","v":0}]
["000401","MDH",null,null,{"$f":"VLOOKUP(A55,Plan!$A$6:$V$123,3,TRUE)","v":"39h00"},{"$f":"VLOOKUP(A55,Plan!$A$6:$V$123,7,TRUE)","v":"00h00"},{"$f":"VLOOKUP(A55,Plan!$A$6:$V$123,8,TRUE)","v":"MAL"},{"$f":"VLOOKUP(A55,Plan!$A$6:$V$123,9,TRUE)","v":0},{"$f":"VLOOKUP(A55,Plan!$A$6:$V$123,10,TRUE)","v":"MAL"},{"$f":"VLOOKUP(A55,Plan!$A$6:$V$123,11,TRUE)","v":0},{"$f":"VLOOKUP(A55,Plan!$A$6:$V$123,12,TRUE)","v":"MAL"},{"$f":"VLOOKUP(A55,Plan!$A$6:$V$123,13,TRUE)","v":0},{"$f":"VLOOKUP(A55,Plan!$A$6:$V$123,14,TRUE)","v":"MAL"},{"$f":"VLOOKUP(A55,Plan!$A$6:$V$123,15,TRUE)","v":0},{"$f":"VLOOKUP(A55,Plan!$A$6:$V$123,16,TRUE)","v":"MAL"},{"$f":"VLOOKUP(A55,Plan!$A$6:$V$123,17,TRUE)","v":0},{"$f":"VLOOKUP(A55,Plan!$A$6:$V$123,18,TRUE)","v":"R"},{"$f":"VLOOKUP(A55,Plan!$A$6:$V$123,19,TRUE)","v":0},{"$f":"VLOOKUP(A55,Plan!$A$6:$V$123,20,TRUE)","v":"R"},{"$f":"VLOOKUP(A55,Plan!$A$6:$V$123,21,TRUE)","v":0}]
["015223","MDH",null,null,{"$f":"VLOOKUP(A56,Plan!$A$6:$V$123,3,TRUE)","v":"39h00"},{"$f":"VLOOKUP(A56,Plan!$A$6:$V$123,7,TRUE)","v":"39h00"},{"$f":"VLOOKUP(A56,Plan!$A$6:$V$123,8,TRUE)","v":"R"},{"$f":"VLOOKUP(A56,Plan!$A$6:$V$123,9,TRUE)","v":0},{"$f":"VLOOKUP(A56,Plan!$A$6:$V$123,10,TRUE)","v":"R"},{"$f":"VLOOKUP(A56,Plan!$A$6:$V$123,11,TRUE)","v":0},{"$f":"VLOOKUP(A56,Plan!$A$6:$V$123,12,TRUE)","v":"11h45-15h#"},{"$f":"VLOOKUP(A56,Plan!$A$6:$V$123,13,TRUE)","v":"18h30-24h#"},{"$f":"VLOOKUP(A56,Plan!$A$6:$V$123,14,TRUE)","v":"11h45-15h#"},{"$f":"VLOOKUP(A56,Plan!$A$6:$V$123,15,TRUE)","v":"18h30-24h15#"},{"$f":"VLOOKUP(A56,Plan!$A$6:$V$123,16,TRUE)","v":"11h45-15h#"},{"$f":"VLOOKUP(A56,Plan!$A$6:$V$123,17,TRUE)","v":"18h30-24h15#"},{"$f":"VLOOKUP(A56,Plan!$A$6:$V$123,18,TRUE)","v":"11h45-15h#"},{"$f":"VLOOKUP(A56,Plan!$A$6:$V$123,19,TRUE)","v":"18h30-24h15#"},{"$f":"VLOOKUP(A56,Plan!$A$6:$V$123,20,TRUE)","v":"11h45-15h30#"},{"$f":"VLOOKUP(A56,Plan!$A$6:$V$123,21,TRUE)","v":"18h30-23h#"}]
["004070","MDH",null,null,{"$f":"VLOOKUP(A57,Plan!$A$6:$V$123,3,TRUE)","v":"39h00"},{"$f":"VLOOKUP(A57,Plan!$A$6:$V$123,7,TRUE)","v":"39h00"},{"$f":"VLOOKUP(A57,Plan!$A$6:$V$123,8,TRUE)","v":"07h-15h18#"},{"$f":"VLOOKUP(A57,Plan!$A$6:$V$123,9,TRUE)","v":0},{"$f":"VLOOKUP(A57,Plan!$A$6:$V$123,10,TRUE)","v":"07h-15h18#"},{"$f":"VLOOKUP(A57,Plan!$A$6:$V$123,11,TRUE)","v":0},{"$f":"VLOOKUP(A57,Plan!$A$6:$V$123,12,TRUE)","v":"07h-15h18#"},{"$f":"VLOOKUP(A57,Plan!$A$6:$V$123,13,TRUE)","v":0},{"$f":"VLOOKUP(A57,Plan!$A$6:$V$123,14,TRUE)","v":"07h-15h18#"},{"$f":"VLOOKUP(A57,Plan!$A$6:$V$123,15,TRUE)","v":0},{"$f":"VLOOKUP(A57,Plan!$A$6:$V$123,16,TRUE)","v":"07h-15h18#"},{"$f":"VLOOKUP(A57,Plan!$A$6:$V$123,17,TRUE)","v":0},{"$f":"VLOOKUP(A57,Plan!$A$6:$V$123,18,TRUE)","v":"R"},{"$f":"VLOOKUP(A57,Plan!$A$6:$V$123,19,TRUE)","v":0},{"$f":"VLOOKUP(A57,Plan!$A$6:$V$123,20,TRUE)","v":"R"},{"$f":"VLOOKUP(A57,Plan!$A$6:$V$123,21,TRUE)","v":0}]
["702131","MDH",null,null,{"$f":"VLOOKUP(A58,Plan!$A$6:$V$123,3,TRUE)","v":"39h00"},{"$f":"VLOOKUP(A58,Plan!$A$6:$V$123,7,TRUE)","v":"07h00"},{"$f":"VLOOKUP(A58,Plan!$A$6:$V$123,8,TRUE)","v":0},{"$f":"VLOOKUP(A58,Plan!$A$6:$V$123,9,TRUE)","v":"18h-01h30#"},{"$f":"VLOOKUP(A58,Plan!$A$6:$V$123,10,TRUE)","v":"R"},{"$f":"VLOOKUP(A58,Plan!$A$6:$V$123,11,TRUE)","v":0},{"$f":"VLOOKUP(A58,Plan!$A$6:$V$123,12,TRUE)","v":"R"},{"$f":"VLOOKUP(A58,Plan!$A$6:$V$123,13,TRUE)","v":0},{"$f":"VLOOKUP(A58,Plan!$A$6:$V$123,14,TRUE)","v":"CP"},{"$f":"VLOOKUP(A58,Plan!$A$6:$V$123,15,TRUE)","v":0},{"$f":"VLOOKUP(A58,Plan!$A$6:$V$123,16,TRUE)","v":"CP"},{"$f":"VLOOKUP(A58,Plan!$A$6:$V$123,17,TRUE)","v":0},{"$f":"VLOOKUP(A58,Plan!$A$6:$V$123,18,TRUE)","v":"CP"},{"$f":"VLOOKUP(A58,Plan!$A$6:$V$123,19,TRUE)","v":0},{"$f":"VLOOKUP(A58,Plan!$A$6:$V$123,20,TRUE)","v":"CP"},{"$f":"VLOOKUP(A58,Plan!$A$6:$V$123,21,TRUE)","v":0}]
["004523","MDH",null,null,{"$f":"VLOOKUP(A59,Plan!$A$6:$V$123,3,TRUE)","v":"39h00"},{"$f":"VLOOKUP(A59,Plan!$A$6:$V$123,7,TRUE)","v":"39h00"},{"$f":"VLOOKUP(A59,Plan!$A$6:$V$123,8,TRUE)","v":"09h-17h18#"},{"$f":"VLOOKUP(A59,Plan!$A$6:$V$123,9,TRUE)","v":0},{"$f":"VLOOKUP(A59,Plan!$A$6:$V$123,10,TRUE)","v":"R"},{"$f":"VLOOKUP(A59,Plan!$A$6:$V$123,11,TRUE)","v":0},{"$f":"VLOOKUP(A59,Plan!$A$6:$V$123,12,TRUE)","v":"R"},{"$f":"VLOOKUP(A59,Plan!$A$6:$V$123,13,TRUE)","v":0},{"$f":"VLOOKUP(A59,Plan!$A$6:$V$123,14,TRUE)","v":"09h-17h18#"},{"$f":"VLOOKUP(A59,Plan!$A$6:$V$123,15,TRUE)","v":0},{"$f":"VLOOKUP(A59,Plan!$A$6:$V$123,16,TRUE)","v":"09h-17h18#"},{"$f":"VLOOKUP(A59,Plan!$A$6:$V$123,17,TRUE)","v":0},{"$f":"VLOOKUP(A59,Plan!$A$6:$V$123,18,TRUE)","v":"09h-17h18#"},{"$f":"VLOOKUP(A59,Plan!$A$6:$V$123,19,TRUE)","v":0},{"$f":"VLOOKUP(A59,Plan!$A$6:$V$123,20,TRUE)","v":"09h-17h18#"},{"$f":"VLOOKUP(A59,Plan!$A$6:$V$123,21,TRUE)","v":0}]
["004569","MDH",null,null,{"$f":"VLOOKUP(A60,Plan!$A$6:$V$123,3,TRUE)","v":"39h00"},{"$f":"VLOOKUP(A60,Plan!$A$6:$V$123,7,TRUE)","v":"39h00"},{"$f":"VLOOKUP(A60,Plan!$A$6:$V$123,8,TRUE)","v":"11h45-15h#"},{"$f":"VLOOKUP(A60,Plan!$A$6:$V$123,9,TRUE)","v":"18h30-23h15#"},{"$f":"VLOOKUP(A60,Plan!$A$6:$V$123,10,TRUE)","v":"11h45-15h#"},{"$f":"VLOOKUP(A60,Plan!$A$6:$V$123,11,TRUE)","v":"18h30-24h15#"},{"$f":"VLOOKUP(A60,Plan!$A$6:$V$123,12,TRUE)","v":"11h45-15h#"},{"$f":"VLOOKUP(A60,Plan!$A$6:$V$123,13,TRUE)","v":"18h30-24h15#"},{"$f":"VLOOKUP(A60,Plan!$A$6:$V$123,14,TRUE)","v":"R"},{"$f":"VLOOKUP(A60,Plan!$A$6:$V$123,15,TRUE)","v":0},{"$f":"VLOOKUP(A60,Plan!$A$6:$V$123,16,TRUE)","v":"R"},{"$f":"VLOOKUP(A60,Plan!$A$6:$V$123,17,TRUE)","v":0},{"$f":"VLOOKUP(A60,Plan!$A$6:$V$123,18,TRUE)","v":"11h45-15h30#"},{"$f":"VLOOKUP(A60,Plan!$A$6:$V$123,19,TRUE)","v":"18h30-24h15#"},{"$f":"VLOOKUP(A60,Plan!$A$6:$V$123,20,TRUE)","v":"11h45-15h30#"},{"$f":"VLOOKUP(A60,Plan!$A$6:$V$123,21,TRUE)","v":"18h30-23h15#"}]
["001921","MDH",null,null,{"$f":"VLOOKUP(A61,Plan!$A$6:$V$123,3,TRUE)","v":"39h00"},{"$f":"VLOOKUP(A61,Plan!$A$6:$V$123,7,TRUE)","v":"39h00"},{"$f":"VLOOKUP(A61,Plan!$A$6:$V$123,8,TRUE)","v":"11h45-15h#"},{"$f":"VLOOKUP(A61,Plan!$A$6:$V$123,9,TRUE)","v":"18h30-23h15#"},{"$f":"VLOOKUP(A61,Plan!$A$6:$V$123,10,TRUE)","v":"11h45-15h#"},{"$f":"VLOOKUP(A61,Plan!$A$6:$V$123,11,TRUE)","v":"18h30-24h15#"},{"$f":"VLOOKUP(A61,Plan!$A$6:$V$123,12,TRUE)","v":"11h45-15h#"},{"$f":"VLOOKUP(A61,Plan!$A$6:$V$123,13,TRUE)","v":"18h30-24h15#"},{"$f":"VLOOKUP(A61,Plan!$A$6:$V$123,14,TRUE)","v":"11h45-15h#"},{"$f":"VLOOKUP(A61,Plan!$A$6:$V$123,15,TRUE)","v":"18h30-24h15#"},{"$f":"VLOOKUP(A61,Plan!$A$6:$V$123,16,TRUE)","v":"R"},{"$f":"VLOOKUP(A61,Plan!$A$6:$V$123,17,TRUE)","v":0},{"$f":"VLOOKUP(A61,Plan!$A$6:$V$123,18,TRUE)","v":"R"},{"$f":"VLOOKUP(A61,Plan!$A$6:$V$123,19,TRUE)","v":0},{"$f":"VLOOKUP(A61,Plan!$A$6:$V$123,20,TRUE)","v":"11h45-16h#"},{"$f":"VLOOKUP(A61,Plan!$A$6:$V$123,21,TRUE)","v":"18h30-23h15#"}]
["032560","MDH",null,null,{"$f":"VLOOKUP(A62,Plan!$A$6:$V$123,3,TRUE)","v":"39h00"},{"$f":"VLOOKUP(A62,Plan!$A$6:$V$123,7,TRUE)","v":"29h45"},{"$f":"VLOOKUP(A62,Plan!$A$6:$V$123,8,TRUE)","v":0},{"$f":"VLOOKUP(A62,Plan!$A$6:$V$123,9,TRUE)","v":"18h-01h45#"},{"$f":"VLOOKUP(A62,Plan!$A$6:$V$123,10,TRUE)","v":0},{"$f":"VLOOKUP(A62,Plan!$A$6:$V$123,11,TRUE)","v":"18h-02h#"},{"$f":"VLOOKUP(A62,Plan!$A$6:$V$123,12,TRUE)","v":0},{"$f":"VLOOKUP(A62,Plan!$A$6:$V$123,13,TRUE)","v":"18h-02h#"},{"$f":"VLOOKUP(A62,Plan!$A$6:$V$123,14,TRUE)","v":0},{"$f":"VLOOKUP(A62,Plan!$A$6:$V$123,15,TRUE)","v":"18h-02h#"},{"$f":"VLOOKUP(A62,Plan!$A$6:$V$123,16,TRUE)","v":"R"},{"$f":"VLOOKUP(A62,Plan!$A$6:$V$123,17,TRUE)","v":0},{"$f":"VLOOKUP(A62,Plan!$A$6:$V$123,18,TRUE)","v":"R"},{"$f":"VLOOKUP(A62,Plan!$A$6:$V$123,19,TRUE)","v":0},{"$f":"VLOOKUP(A62,Plan!$A$6:$V$123,20,TRUE)","v":"CP"},{"$f":"VLOOKUP(A62,Plan!$A$6:$V$123,21,TRUE)","v":0}]
["024679","MDH",null,null,{"$f":"VLOOKUP(A63,Plan!$A$6:$V$123,3,TRUE)","v":"39h00"},{"$f":"VLOOKUP(A63,Plan!$A$6:$V$123,7,TRUE)","v":"39h00"},{"$f":"VLOOKUP(A63,Plan!$A$6:$V$123,8,TRUE)","v":0},{"$f":"VLOOKUP(A63,Plan!$A$6:$V$123,9,TRUE)","v":"15h-23h#"},{"$f":"VLOOKUP(A63,Plan!$A$6:$V$123,10,TRUE)","v":"R"},{"$f":"VLOOKUP(A63,Plan!$A$6:$V$123,11,TRUE)","v":0},{"$f":"VLOOKUP(A63,Plan!$A$6:$V$123,12,TRUE)","v":"R"},{"$f":"VLOOKUP(A63,Plan!$A$6:$V$123,13,TRUE)","v":0},{"$f":"VLOOKUP(A63,Plan!$A$6:$V$123,14,TRUE)","v":0},{"$f":"VLOOKUP(A63,Plan!$A$6:$V$123,15,TRUE)","v":"15h-00h15#"},{"$f":"VLOOKUP(A63,Plan!$A$6:$V$123,16,TRUE)","v":0},{"$f":"VLOOKUP(A63,Plan!$A$6:$V$123,17,TRUE)","v":"15h-00h15#"},{"$f":"VLOOKUP(A63,Plan!$A$6:$V$123,18,TRUE)","v":0},{"$f":"VLOOKUP(A63,Plan!$A$6:$V$123,19,TRUE)","v":"15h-00h30#"},{"$f":"VLOOKUP(A63,Plan!$A$6:$V$123,20,TRUE)","v":"11h30-17h#"},{"$f":"VLOOKUP(A63,Plan!$A$6:$V$123,21,TRUE)","v":0}]
["009999","MDH",null,null,{"$f":"VLOOKUP(A64,Plan!$A$6:$V$123,3,TRUE)","v":"39h00"},{"$f":"VLOOKUP(A64,Plan!$A$6:$V$123,7,TRUE)","v":"23h15"},{"$f":"VLOOKUP(A64,Plan!$A$6:$V$123,8,TRUE)","v":"R"},{"$f":"VLOOKUP(A64,Plan!$A$6:$V$123,9,TRUE)","v":0},{"$f":"VLOOKUP(A64,Plan!$A$6:$V$123,10,TRUE)","v":"CP"},{"$f":"VLOOKUP(A64,Plan!$A$6:$V$123,11,TRUE)","v":0},{"$f":"VLOOKUP(A64,Plan!$A$6:$V$123,12,TRUE)","v":"CP"},{"$f":"VLOOKUP(A64,Plan!$A$6:$V$123,13,TRUE)","v":0},{"$f":"VLOOKUP(A64,Plan!$A$6:$V$123,14,TRUE)","v":"11h45-15h#"},{"$f":"VLOOKUP(A64,Plan!$A$6:$V$123,15,TRUE)","v":"18h30-24h#"},{"$f":"VLOOKUP(A64,Plan!$A$6:$V$123,16,TRUE)","v":"11h45-15h#"},{"$f":"VLOOKUP(A64,Plan!$A$6:$V$123,17,TRUE)","v":"18h30-24h#"},{"$f":"VLOOKUP(A64,Plan!$A$6:$V$123,18,TRUE)","v":"11h45-15h#"},{"$f":"VLOOKUP(A64,Plan!$A$6:$V$123,19,TRUE)","v":"18h30-24h#"},{"$f":"VLOOKUP(A64,Plan!$A$6:$V$123,20,TRUE)","v":"R"},{"$f":"VLOOKUP(A64,Plan!$A$6:$V$123,21,TRUE)","v":0}]
["510101","MDH",null,null,{"$f":"VLOOKUP(A65,Plan!$A$6:$V$123,3,TRUE)","v":"39h00"},{"$f":"VLOOKUP(A65,Plan!$A$6:$V$123,7,TRUE)","v":"39h00"},{"$f":"VLOOKUP(A65,Plan!$A$6:$V$123,8,TRUE)","v":"R"},{"$f":"VLOOKUP(A65,Plan!$A$6:$V$123,9,TRUE)","v":0},{"$f":"VLOOKUP(A65,Plan!$A$6:$V$123,10,TRUE)","v":0},{"$f":"VLOOKUP(A65,Plan!$A$6:$V$123,11,TRUE)","v":"18h-02h#"},{"$f":"VLOOKUP(A65,Plan!$A$6:$V$123,12,TRUE)","v":0},{"$f":"VLOOKUP(A65,Plan!$A$6:$V$123,13,TRUE)","v":"18h-02h#"},{"$f":"VLOOKUP(A65,Plan!$A$6:$V$123,14,TRUE)","v":0},{"$f":"VLOOKUP(A65,Plan!$A$6:$V$123,15,TRUE)","v":"18h-02h#"},{"$f":"VLOOKUP(A65,Plan!$A$6:$V$123,16,TRUE)","v":0},{"$f":"VLOOKUP(A65,Plan!$A$6:$V$123,17,TRUE)","v":"18h-02h30#"},{"$f":"VLOOKUP(A65,Plan!$A$6:$V$123,18,TRUE)","v":0},{"$f":"VLOOKUP(A65,Plan!$A$6:$V$123,19,TRUE)","v":"17h30-02h30#"},{"$f":"VLOOKUP(A65,Plan!$A$6:$V$123,20,TRUE)","v":"R"},{"$f":"VLOOKUP(A65,Plan!$A$6:$V$123,21,TRUE)","v":0}]
["004050","MDH",null,null,{"$f":"VLOOKUP(A66,Plan!$A$6:$V$123,3,TRUE)","v":"39h00"},{"$f":"VLOOKUP(A66,Plan!$A$6:$V$123,7,TRUE)","v":"39h00"},{"$f":"VLOOKUP(A66,Plan!$A$6:$V$123,8,TRUE)","v":"R"},{"$f":"VLOOKUP(A66,Plan!$A$6:$V$123,9,TRUE)","v":0},{"$f":"VLOOKUP(A66,Plan!$A$6:$V$123,10,TRUE)","v":"10h-18h18#"},{"$f":"VLOOKUP(A66,Plan!$A$6:$V$123,11,TRUE)","v":0},{"$f":"VLOOKUP(A66,Plan!$A$6:$V$123,12,TRUE)","v":"10h-18h18#"},{"$f":"VLOOKUP(A66,Plan!$A$6:$V$123,13,TRUE)","v":0},{"$f":"VLOOKUP(A66,Plan!$A$6:$V$123,14,TRUE)","v":"06h-14h18#"},{"$f":"VLOOKUP(A66,Plan!$A$6:$V$123,15,TRUE)","v":0},{"$f":"VLOOKUP(A66,Plan!$A$6:$V$123,16,TRUE)","v":"10h-18h18#"},{"$f":"VLOOKUP(A66,Plan!$A$6:$V$123,17,TRUE)","v":0},{"$f":"VLOOKUP(A66,Plan!$A$6:$V$123,18,TRUE)","v":"10h-18h18#"},{"$f":"VLOOKUP(A66,Plan!$A$6:$V$123,19,TRUE)","v":0},{"$f":"VLOOKUP(A66,Plan!$A$6:$V$123,20,TRUE)","v":"R"},{"$f":"VLOOKUP(A66,Plan!$A$6:$V$123,21,TRUE)","v":0}]
["022349","MDH",null,null,{"$f":"VLOOKUP(A67,Plan!$A$6:$V$123,3,TRUE)","v":"39h00"},{"$f":"VLOOKUP(A67,Plan!$A$6:$V$123,7,TRUE)","v":"39h00"},{"$f":"VLOOKUP(A67,Plan!$A$6:$V$123,8,TRUE)","v":"R"},{"$f":"VLOOKUP(A67,Plan!$A$6:$V$123,9,TRUE)","v":0},{"$f":"VLOOKUP(A67,Plan!$A$6:$V$123,10,TRUE)","v":"R"},{"$f":"VLOOKUP(A67,Plan!$A$6:$V$123,11,TRUE)","v":0},{"$f":"VLOOKUP(A67,Plan!$A$6:$V$123,12,TRUE)","v":"08h-16h18#"},{"$f":"VLOOKUP(A67,Plan!$A$6:$V$123,13,TRUE)","v":0},{"$f":"VLOOKUP(A67,Plan!$A$6:$V$123,14,TRUE)","v":"08h-16h18#"},{"$f":"VLOOKUP(A67,Plan!$A$6:$V$123,15,TRUE)","v":0},{"$f":"VLOOKUP(A67,Plan!$A$6:$V$123,16,TRUE)","v":"08h-16h18#"},{"$f":"VLOOKUP(A67,Plan!$A$6:$V$123,17,TRUE)","v":0},{"$f":"VLOOKUP(A67,Plan!$A$6:$V$123,18,TRUE)","v":"08h-16h18#"},{"$f":"VLOOKUP(A67,Plan!$A$6:$V$123,19,TRUE)","v":0},{"$f":"VLOOKUP(A67,Plan!$A$6:$V$123,20,TRUE)","v":"08h-16h18#"},{"$f":"VLOOKUP(A67,Plan!$A$6:$V$123,21,TRUE)","v":0}]
[{"$nulls":4},{"$f":"VLOOKUP(A68,Plan!$A$6:$V$123,3,TRUE)","v":{"$error":"#N/A"}},{"$f":"VLOOKUP(A68,Plan!$A$6:$V$123,7,TRUE)","v":{"$error":"#N/A"}},{"$f":"VLOOKUP(A68,Plan!$A$6:$V$123,8,TRUE)","v":{"$error":"#N/A"}},{"$f":"VLOOKUP(A68,Plan!$A$6:$V$123,9,TRUE)","v":{"$error":"#N/A"}},{"$f":"VLOOKUP(A68,Plan!$A$6:$V$123,10,TRUE)","v":{"$error":"#N/A"}},{"$f":"VLOOKUP(A68,Plan!$A$6:$V$123,11,TRUE)","v":{"$error":"#N/A"}},{"$f":"VLOOKUP(A68,Plan!$A$6:$V$123,12,TRUE)","v":{"$error":"#N/A"}},{"$f":"VLOOKUP(A68,Plan!$A$6:$V$123,13,TRUE)","v":{"$error":"#N/A"}},{"$f":"VLOOKUP(A68,Plan!$A$6:$V$123,14,TRUE)","v":{"$error":"#N/A"}},{"$f":"VLOOKUP(A68,Plan!$A$6:$V$123,15,TRUE)","v":{"$error":"#N/A"}},{"$f":"VLOOKUP(A68,Plan!$A$6:$V$123,16,TRUE)","v":{"$error":"#N/A"}},{"$f":"VLOOKUP(A68,Plan!$A$6:$V$123,17,TRUE)","v":{"$error":"#N/A"}},{"$f":"VLOOKUP(A68,Plan!$A$6:$V$123,18,TRUE)","v":{"$error":"#N/A"}},{"$f":"VLOOKUP(A68,Plan!$A$6:$V$123,19,TRUE)","v":{"$error":"#N/A"}},{"$f":"VLOOKUP(A68,Plan!$A$6:$V$123,20,TRUE)","v":{"$error":"#N/A"}},{"$f":"VLOOKUP(A68,Plan!$A$6:$V$123,21,TRUE)","v":{"$error":"#N/A"}}]
[{"$nulls":4},{"$f":"VLOOKUP(A69,Plan!$A$6:$V$123,3,TRUE)","v":{"$error":"#N/A"}},{"$f":"VLOOKUP(A69,Plan!$A$6:$V$123,7,TRUE)","v":{"$error":"#N/A"}},{"$f":"VLOOKUP(A69,Plan!$A$6:$V$123,8,TRUE)","v":{"$error":"#N/A"}},{"$f":"VLOOKUP(A69,Plan!$A$6:$V$123,9,TRUE)","v":{"$error":"#N/A"}},{"$f":"VLOOKUP(A69,Plan!$A$6:$V$123,10,TRUE)","v":{"$error":"#N/A"}},{"$f":"VLOOKUP(A69,Plan!$A$6:$V$123,11,TRUE)","v":{"$error":"#N/A"}},{"$f":"VLOOKUP(A69,Plan!$A$6:$V$123,12,TRUE)","v":{"$error":"#N/A"}},{"$f":"VLOOKUP(A69,Plan!$A$6:$V$123,13,TRUE)","v":{"$error":"#N/A"}},{"$f":"VLOOKUP(A69,Plan!$A$6:$V$123,14,TRUE)","v":{"$error":"#N/A"}},{"$f":"VLOOKUP(A69,Plan!$A$6:$V$123,15,TRUE)","v":{"$error":"#N/A"}},{"$f":"VLOOKUP(A69,Plan!$A$6:$V$123,16,TRUE)","v":{"$error":"#N/A"}},{"$f":"VLOOKUP(A69,Plan!$A$6:$V$123,17,TRUE)","v":{"$error":"#N/A"}},{"$f":"VLOOKUP(A69,Plan!$A$6:$V$123,18,TRUE)","v":{"$error":"#N/A"}},{"$f":"VLOOKUP(A69,Plan!$A$6:$V$123,19,TRUE)","v":{"$error":"#N/A"}},{"$f":"VLOOKUP(A69,Plan!$A$6:$V$123,20,TRUE)","v":{"$error":"#N/A"}},{"$f":"VLOOKUP(A69,Plan!$A$6:$V$123,21,TRUE)","v":{"$error":"#N/A"}}]
[{"$nulls":4},{"$f":"VLOOKUP(A70,Plan!$A$6:$V$123,3,TRUE)","v":{"$error":"#N/A"}},{"$f":"VLOOKUP(A70,Plan!$A$6:$V$123,7,TRUE)","v":{"$error":"#N/A"}},{"$f":"VLOOKUP(A70,Plan!$A$6:$V$123,8,TRUE)","v":{"$error":"#N/A"}},{"$f":"VLOOKUP(A70,Plan!$A$6:$V$123,9,TRUE)","v":{"$error":"#N/A"}},{"$f":"VLOOKUP(A70,Plan!$A$6:$V$123,10,TRUE)","v":{"$error":"#N/A"}},{"$f":"VLOOKUP(A70,Plan!$A$6:$V$123,11,TRUE)","v":{"$error":"#N/A"}},{"$f":"VLOOKUP(A70,Plan!$A$6:$V$123,12,TRUE)","v":{"$error":"#N/A"}},{"$f":"VLOOKUP(A70,Plan!$A$6:$V$123,13,TRUE)","v":{"$error":"#N/A"}},{"$f":"VLOOKUP(A70,Plan!$A$6:$V$123,14,TRUE)","v":{"$error":"#N/A"}},{"$f":"VLOOKUP(A70,Plan!$A$6:$V$123,15,TRUE)","v":{"$error":"#N/A"}},{"$f":"VLOOKUP(A70,Plan!$A$6:$V$123,16,TRUE)","v":{"$error":"#N/A"}},{"$f":"VLOOKUP(A70,Plan!$A$6:$V$123,17,TRUE)","v":{"$error":"#N/A"}},{"$f":"VLOOKUP(A70,Plan!$A$6:$V$123,18,TRUE)","v":{"$error":"#N/A"}},{"$f":"VLOOKUP(A70,Plan!$A$6:$V$123,19,TRUE)","v":{"$error":"#N/A"}},{"$f":"VLOOKUP(A70,Plan!$A$6:$V$123,20,TRUE)","v":{"$error":"#N/A"}},{"$f":"VLOOKUP(A70,Plan!$A$6:$V$123,21,TRUE)","v":{"$error":"#N/A"}}]
[{"$nulls":4},{"$f":"VLOOKUP(A71,Plan!$A$6:$V$123,3,TRUE)","v":{"$error":"#N/A"}},{"$f":"VLOOKUP(A71,Plan!$A$6:$V$123,7,TRUE)","v":{"$error":"#N/A"}},{"$f":"VLOOKUP(A71,Plan!$A$6:$V$123,8,TRUE)","v":{"$error":"#N/A"}},{"$f":"VLOOKUP(A71,Plan!$A$6:$V$123,9,TRUE)","v":{"$error":"#N/A"}},{"$f":"VLOOKUP(A71,Plan!$A$6:$V$123,10,TRUE)","v":{"$error":"#N/A"}},{"$f":"VLOOKUP(A71,Plan!$A$6:$V$123,11,TRUE)","v":{"$error":"#N/A"}},{"$f":"VLOOKUP(A71,Plan!$A$6:$V$123,12,TRUE)","v":{"$error":"#N/A"}},{"$f":"VLOOKUP(A71,Plan!$A$6:$V$123,13,TRUE)","v":{"$error":"#N/A"}},{"$f":"VLOOKUP(A71,Plan!$A$6:$V$123,14,TRUE)","v":{"$error":"#N/A"}},{"$f":"VLOOKUP(A71,Plan!$A$6:$V$123,15,TRUE)","v":{"$error":"#N/A"}},{"$f":"VLOOKUP(A71,Plan!$A$6:$V$123,16,TRUE)","v":{"$error":"#N/A"}},{"$f":"VLOOKUP(A71,Plan!$A$6:$V$123,17,TRUE)","v":{"$error":"#N/A"}},{"$f":"VLOOKUP(A71,Plan!$A$6:$V$123,18,TRUE)","v":{"$error":"#N/A"}},{"$f":"VLOOKUP(A71,Plan!$A$6:$V$123,19,TRUE)","v":{"$error":"#N/A"}},{"$f":"VLOOKUP(A71,Plan!$A$6:$V$123,20,TRUE)","v":{"$error":"#N/A"}},{"$f":"VLOOKUP(A71,Plan!$A$6:$V$123,21,TRUE)","v":{"$error":"#N/A"}}]
[{"$nulls":4},{"$f":"VLOOKUP(A72,Plan!$A$6:$V$123,3,TRUE)","v":{"$error":"#N/A"}},{"$f":"VLOOKUP(A72,Plan!$A$6:$V$123,7,TRUE)","v":{"$error":"#N/A"}},{"$f":"VLOOKUP(A72,Plan!$A$6:$V$123,8,TRUE)","v":{"$error":"#N/A"}},{"$f":"VLOOKUP(A72,Plan!$A$6:$V$123,9,TRUE)","v":{"$error":"#N/A"}},{"$f":"VLOOKUP(A72,Plan!$A$6:$V$123,10,TRUE)","v":{"$error":"#N/A"}},{"$f":"VLOOKUP(A72,Plan!$A$6:$V$123,11,TRUE)","v":{"$error":"#N/A"}},{"$f":"VLOOKUP(A72,Plan!$A$6:$V$123,12,TRUE)","v":{"$error":"#N/A"}},{"$f":"VLOOKUP(A72,Plan!$A$6:$V$123,13,TRUE)","v":{"$error":"#N/A"}},{"$f":"VLOOKUP(A72,Plan!$A$6:$V$123,14,TRUE)","v":{"$error":"#N/A"}},{"$f":"VLOOKUP(A72,Plan!$A$6:$V$123,15,TRUE)","v":{"$error":"#N/A"}},{"$f":"VLOOKUP(A72,Plan!$A$6:$V$123,16,TRUE)","v":{"$error":"#N/A"}},{"$f":"VLOOKUP(A72,Plan!$A$6:$V$123,17,TRUE)","v":{"$error":"#N/A"}},{"$f":"VLOOKUP(A72,Plan!$A$6:$V$123,18,TRUE)","v":{"$error":"#N/A"}},{"$f":"VLOOKUP(A72,Plan!$A$6:$V$123,19,TRUE)","v":{"$error":"#N/A"}},{"$f":"VLOOKUP(A72,Plan!$A$6:$V$123,20,TRUE)","v":{"$error":"#N/A"}},{"$f":"VLOOKUP(A72,Plan!$A$6:$V$123,21,TRUE)","v":{"$error":"#N/A"}}]
[{"$nulls":4},{"$f":"VLOOKUP(A73,Plan!$A$6:$V$123,3,TRUE)","v":{"$error":"#N/A"}},{"$f":"VLOOKUP(A73,Plan!$A$6:$V$123,7,TRUE)","v":{"$error":"#N/A"}},{"$f":"VLOOKUP(A73,Plan!$A$6:$V$123,8,TRUE)","v":{"$error":"#N/A"}},{"$f":"VLOOKUP(A73,Plan!$A$6:$V$123,9,TRUE)","v":{"$error":"#N/A"}},{"$f":"VLOOKUP(A73,Plan!$A$6:$V$123,10,TRUE)","v":{"$error":"#N/A"}},{"$f":"VLOOKUP(A73,Plan!$A$6:$V$123,11,TRUE)","v":{"$error":"#N/A"}},{"$f":"VLOOKUP(A73,Plan!$A$6:$V$123,12,TRUE)","v":{"$error":"#N/A"}},{"$f":"VLOOKUP(A73,Plan!$A$6:$V$123,13,TRUE)","v":{"$error":"#N/A"}},{"$f":"VLOOKUP(A73,Plan!$A$6:$V$123,14,TRUE)","v":{"$error":"#N/A"}},{"$f":"VLOOKUP(A73,Plan!$A$6:$V$123,15,TRUE)","v":{"$error":"#N/A"}},{"$f":"VLOOKUP(A73,Plan!$A$6:$V$123,16,TRUE)","v":{"$error":"#N/A"}},{"$f":"VLOOKUP(A73,Plan!$A$6:$V$123,17,TRUE)","v":{"$error":"#N/A"}},{"$f":"VLOOKUP(A73,Plan!$A$6:$V$123,18,TRUE)","v":{"$error":"#N/A"}},{"$f":"VLOOKUP(A73,Plan!$A$6:$V$123,19,TRUE)","v":{"$error":"#N/A"}},{"$f":"VLOOKUP(A73,Plan!$A$6:$V$123,20,TRUE)","v":{"$error":"#N/A"}},{"$f":"VLOOKUP(A73,Plan!$A$6:$V$123,21,TRUE)","v":{"$error":"#N/A"}}]
[{"$nulls":4},{"$f":"VLOOKUP(A74,Plan!$A$6:$V$123,3,TRUE)","v":{"$error":"#N/A"}},{"$f":"VLOOKUP(A74,Plan!$A$6:$V$123,7,TRUE)","v":{"$error":"#N/A"}},{"$f":"VLOOKUP(A74,Plan!$A$6:$V$123,8,TRUE)","v":{"$error":"#N/A"}},{"$f":"VLOOKUP(A74,Plan!$A$6:$V$123,9,TRUE)","v":{"$error":"#N/A"}},{"$f":"VLOOKUP(A74,Plan!$A$6:$V$123,10,TRUE)","v":{"$error":"#N/A"}},{"$f":"VLOOKUP(A74,Plan!$A$6:$V$123,11,TRUE)","v":{"$error":"#N/A"}},{"$f":"VLOOKUP(A74,Plan!$A$6:$V$123,12,TRUE)","v":{"$error":"#N/A"}},{"$f":"VLOOKUP(A74,Plan!$A$6:$V$123,13,TRUE)","v":{"$error":"#N/A"}},{"$f":"VLOOKUP(A74,Plan!$A$6:$V$123,14,TRUE)","v":{"$error":"#N/A"}},{"$f":"VLOOKUP(A74,Plan!$A$6:$V$123,15,TRUE)","v":{"$error":"#N/A"}},{"$f":"VLOOKUP(A74,Plan!$A$6:$V$123,16,TRUE)","v":{"$error":"#N/A"}},{"$f":"VLOOKUP(A74,Plan!$A$6:$V$123,17,TRUE)","v":{"$error":"#N/A"}},{"$f":"VLOOKUP(A74,Plan!$A$6:$V$123,18,TRUE)","v":{"$error":"#N/A"}},{"$f":"VLOOKUP(A74,Plan!$A$6:$V$123,19,TRUE)","v":{"$error":"#N/A"}},{"$f":"VLOOKUP(A74,Plan!$A$6:$V$123,20,TRUE)","v":{"$error":"#N/A"}},{"$f":"VLOOKUP(A74,Plan!$A$6:$V$123,21,TRUE)","v":{"$error":"#N/A"}}]
[{"$nulls":4},{"$f":"VLOOKUP(A75,Plan!$A$6:$V$123,3,TRUE)","v":{"$error":"#N/A"}},{"$f":"VLOOKUP(A75,Plan!$A$6:$V$123,7,TRUE)","v":{"$error":"#N/A"}},{"$f":"VLOOKUP(A75,Plan!$A$6:$V$123,8,TRUE)","v":{"$error":"#N/A"}},{"$f":"VLOOKUP(A75,Plan!$A$6:$V$123,9,TRUE)","v":{"$error":"#N/A"}},{"$f":"VLOOKUP(A75,Plan!$A$6:$V$123,10,TRUE)","v":{"$error":"#N/A"}},{"$f":"VLOOKUP(A75,Plan!$A$6:$V$123,11,TRUE)","v":{"$error":"#N/A"}},{"$f":"VLOOKUP(A75,Plan!$A$6:$V$123,12,TRUE)","v":{"$error":"#N/A"}},{"$f":"VLOOKUP(A75,Plan!$A$6:$V$123,13,TRUE)","v":{"$error":"#N/A"}},{"$f":"VLOOKUP(A75,Plan!$A$6:$V$123,14,TRUE)","v":{"$error":"#N/A"}},{"$f":"VLOOKUP(A75,Plan!$A$6:$V$123,15,TRUE)","v":{"$error":"#N/A"}},{"$f":"VLOOKUP(A75,Plan!$A$6:$V$123,16,TRUE)","v":{"$error":"#N/A"}},{"$f":"VLOOKUP(A75,Plan!$A$6:$V$123,17,TRUE)","v":{"$error":"#N/A"}},{"$f":"VLOOKUP(A75,Plan!$A$6:$V$123,18,TRUE)","v":{"$error":"#N/A"}},{"$f":"VLOOKUP(A75,Plan!$A$6:$V$123,19,TRUE)","v":{"$error":"#N/A"}},{"$f":"VLOOKUP(A75,Plan!$A$6:$V$123,20,TRUE)","v":{"$error":"#N/A"}},{"$f":"VLOOKUP(A75,Plan!$A$6:$V$123,21,TRUE)","v":{"$error":"#N/A"}}]
[{"$nulls":4},{"$f":"VLOOKUP(A76,Plan!$A$6:$V$123,3,TRUE)","v":{"$error":"#N/A"}},{"$f":"VLOOKUP(A76,Plan!$A$6:$V$123,7,TRUE)","v":{"$error":"#N/A"}},{"$f":"VLOOKUP(A76,Plan!$A$6:$V$123,8,TRUE)","v":{"$error":"#N/A"}},{"$f":"VLOOKUP(A76,Plan!$A$6:$V$123,9,TRUE)","v":{"$error":"#N/A"}},{"$f":"VLOOKUP(A76,Plan!$A$6:$V$123,10,TRUE)","v":{"$error":"#N/A"}},{"$f":"VLOOKUP(A76,Plan!$A$6:$V$123,11,TRUE)","v":{"$error":"#N/A"}},{"$f":"VLOOKUP(A76,Plan!$A$6:$V$123,12,TRUE)","v":{"$error":"#N/A"}},{"$f":"VLOOKUP(A76,Plan!$A$6:$V$123,13,TRUE)","v":{"$error":"#N/A"}},{"$f":"VLOOKUP(A76,Plan!$A$6:$V$123,14,TRUE)","v":{"$error":"#N/A"}},{"$f":"VLOOKUP(A76,Plan!$A$6:$V$123,15,TRUE)","v":{"$error":"#N/A"}},{"$f":"VLOOKUP(A76,Plan!$A$6:$V$123,16,TRUE)","v":{"$error":"#N/A"}},{"$f":"VLOOKUP(A76,Plan!$A$6:$V$123,17,TRUE)","v":{"$error":"#N/A"}},{"$f":"VLOOKUP(A76,Plan!$A$6:$V$123,18,TRUE)","v":{"$error":"#N/A"}},{"$f":"VLOOKUP(A76,Plan!$A$6:$V$123,19,TRUE)","v":{"$error":"#N/A"}},{"$f":"VLOOKUP(A76,Plan!$A$6:$V$123,20,TRUE)","v":{"$error":"#N/A"}},{"$f":"VLOOKUP(A76,Plan!$A$6:$V$123,21,TRUE)","v":{"$error":"#N/A"}}]
[{"$nulls":4},{"$f":"VLOOKUP(A77,Plan!$A$6:$V$123,3,TRUE)","v":{"$error":"#N/A"}},{"$f":"VLOOKUP(A77,Plan!$A$6:$V$123,7,TRUE)","v":{"$error":"#N/A"}},{"$f":"VLOOKUP(A77,Plan!$A$6:$V$123,8,TRUE)","v":{"$error":"#N/A"}},{"$f":"VLOOKUP(A77,Plan!$A$6:$V$123,9,TRUE)","v":{"$error":"#N/A"}},{"$f":"VLOOKUP(A77,Plan!$A$6:$V$123,10,TRUE)","v":{"$error":"#N/A"}},{"$f":"VLOOKUP(A77,Plan!$A$6:$V$123,11,TRUE)","v":{"$error":"#N/A"}},{"$f":"VLOOKUP(A77,Plan!$A$6:$V$123,12,TRUE)","v":{"$error":"#N/A"}},{"$f":"VLOOKUP(A77,Plan!$A$6:$V$123,13,TRUE)","v":{"$error":"#N/A"}},{"$f":"VLOOKUP(A77,Plan!$A$6:$V$123,14,TRUE)","v":{"$error":"#N/A"}},{"$f":"VLOOKUP(A77,Plan!$A$6:$V$123,15,TRUE)","v":{"$error":"#N/A"}},{"$f":"VLOOKUP(A77,Plan!$A$6:$V$123,16,TRUE)","v":{"$error":"#N/A"}},{"$f":"VLOOKUP(A77,Plan!$A$6:$V$123,17,TRUE)","v":{"$error":"#N/A"}},{"$f":"VLOOKUP(A77,Plan!$A$6:$V$123,18,TRUE)","v":{"$error":"#N/A"}},{"$f":"VLOOKUP(A77,Plan!$A$6:$V$123,19,TRUE)","v":{"$error":"#N/A"}},{"$f":"VLOOKUP(A77,Plan!$A$6:$V$123,20,TRUE)","v":{"$error":"#N/A"}},{"$f":"VLOOKUP(A77,Plan!$A$6:$V$123,21,TRUE)","v":{"$error":"#N/A"}}]
[{"$nulls":4},{"$f":"VLOOKUP(A78,Plan!$A$6:$V$123,3,TRUE)","v":{"$error":"#N/A"}},{"$f":"VLOOKUP(A78,Plan!$A$6:$V$123,7,TRUE)","v":{"$error":"#N/A"}},{"$f":"VLOOKUP(A78,Plan!$A$6:$V$123,8,TRUE)","v":{"$error":"#N/A"}},{"$f":"VLOOKUP(A78,Plan!$A$6:$V$123,9,TRUE)","v":{"$error":"#N/A"}},{"$f":"VLOOKUP(A78,Plan!$A$6:$V$123,10,TRUE)","v":{"$error":"#N/A"}},{"$f":"VLOOKUP(A78,Plan!$A$6:$V$123,11,TRUE)","v":{"$error":"#N/A"}},{"$f":"VLOOKUP(A78,Plan!$A$6:$V$123,12,TRUE)","v":{"$error":"#N/A"}},{"$f":"VLOOKUP(A78,Plan!$A$6:$V$123,13,TRUE)","v":{"$error":"#N/A"}},{"$f":"VLOOKUP(A78,Plan!$A$6:$V$123,14,TRUE)","v":{"$error":"#N/A"}},{"$f":"VLOOKUP(A78,Plan!$A$6:$V$123,15,TRUE)","v":{"$error":"#N/A"}},{"$f":"VLOOKUP(A78,Plan!$A$6:$V$123,16,TRUE)","v":{"$error":"#N/A"}},{"$f":"VLOOKUP(A78,Plan!$A$6:$V$123,17,TRUE)","v":{"$error":"#N/A"}},{"$f":"VLOOKUP(A78,Plan!$A$6:$V$123,18,TRUE)","v":{"$error":"#N/A"}},{"$f":"VLOOKUP(A78,Plan!$A$6:$V$123,19,TRUE)","v":{"$error":"#N/A"}},{"$f":"VLOOKUP(A78,Plan!$A$6:$V$123,20,TRUE)","v":{"$error":"#N/A"}},{"$f":"VLOOKUP(A78,Plan!$A$6:$V$123,21,TRUE)","v":{"$error":"#N/A"}}]
["038701"," C D R ",null,null,{"$f":"VLOOKUP(A79,Plan!$A$6:$V$123,3,TRUE)","v":"39h00"},{"$f":"VLOOKUP(A79,Plan!$A$6:$V$123,7,TRUE)","v":"39h00"},{"$f":"VLOOKUP(A79,Plan!$A$6:$V$123,8,TRUE)","v":"11h45-15h#"},{"$f":"VLOOKUP(A79,Plan!$A$6:$V$123,9,TRUE)","v":"18h30-23h15#"},{"$f":"VLOOKUP(A79,Plan!$A$6:$V$123,10,TRUE)","v":"R"},{"$f":"VLOOKUP(A79,Plan!$A$6:$V$123,11,TRUE)","v":0},{"$f":"VLOOKUP(A79,Plan!$A$6:$V$123,12,TRUE)","v":"R"},{"$f":"VLOOKUP(A79,Plan!$A$6:$V$123,13,TRUE)","v":0},{"$f":"VLOOKUP(A79,Plan!$A$6:$V$123,14,TRUE)","v":"11h45-15h#"},{"$f":"VLOOKUP(A79,Plan!$A$6:$V$123,15,TRUE)","v":"18h30-24h15#"},{"$f":"VLOOKUP(A79,Plan!$A$6:$V$123,16,TRUE)","v":"11h45-15h#"},{"$f":"VLOOKUP(A79,Plan!$A$6:$V$123,17,TRUE)","v":"18h30-24h15#"},{"$f":"VLOOKUP(A79,Plan!$A$6:$V$123,18,TRUE)","v":"11h45-15h30#"},{"$f":"VLOOKUP(A79,Plan!$A$6:$V$123,19,TRUE)","v":"18h30-24h15#"},{"$f":"VLOOKUP(A79,Plan!$A$6:$V$123,20,TRUE)","v":"11h45-15h30#"},{"$f":"VLOOKUP(A79,Plan!$A$6:$V$123,21,TRUE)","v":"18h30-23h15#"}]
["006346"," C D R ",null,null,{"$f":"VLOOKUP(A80,Plan!$A$6:$V$123,3,TRUE)","v":"39h00"},{"$f":"VLOOKUP(A80,Plan!$A$6:$V$123,7,TRUE)","v":"23h24"},{"$f":"VLOOKUP(A80,Plan!$A$6:$V$123,8,TRUE)","v":"09h-17h18#"},{"$f":"VLOOKUP(A80,Plan!$A$6:$V$123,9,TRUE)","v":0},{"$f":"VLOOKUP(A80,Plan!$A$6:$V$123,10,TRUE)","v":"09h-17h18#"},{"$f":"VLOOKUP(A80,Plan!$A$6:$V$123,11,TRUE)","v":0},{"$f":"VLOOKUP(A80,Plan!$A$6:$V$123,12,TRUE)","v":"CP"},{"$f":"VLOOKUP(A80,Plan!$A$6:$V$123,13,TRUE)","v":0},{"$f":"VLOOKUP(A80,Plan!$A$6:$V$123,14,TRUE)","v":"CP"},{"$f":"VLOOKUP(A80,Plan!$A$6:$V$123,15,TRUE)","v":0},{"$f":"VLOOKUP(A80,Plan!$A$6:$V$123,16,TRUE)","v":"R"},{"$f":"VLOOKUP(A80,Plan!$A$6:$V$123,17,TRUE)","v":0},{"$f":"VLOOKUP(A80,Plan!$A$6:$V$123,18,TRUE)","v":"R"},{"$f":"VLOOKUP(A80,Plan!$A$6:$V$123,19,TRUE)","v":0},{"$f":"VLOOKUP(A80,Plan!$A$6:$V$123,20,TRUE)","v":"09h-17h18#"},{"$f":"VLOOKUP(A80,Plan!$A$6:$V$123,21,TRUE)","v":0}]
["009624"," C D R ",null,null,{"$f":"VLOOKUP(A81,Plan!$A$6:$V$123,3,TRUE)","v":"39h00"},{"$f":"VLOOKUP(A81,Plan!$A$6:$V$123,7,TRUE)","v":"39h00"},{"$f":"VLOOKUP(A81,Plan!$A$6:$V$123,8,TRUE)","v":0},{"$f":"VLOOKUP(A81,Plan!$A$6:$V$123,9,TRUE)","v":"15h-23h#"},{"$f":"VLOOKUP(A81,Plan!$A$6:$V$123,10,TRUE)","v":0},{"$f":"VLOOKUP(A81,Plan!$A$6:$V$123,11,TRUE)","v":"15h-24h#"},{"$f":"VLOOKUP(A81,Plan!$A$6:$V$123,12,TRUE)","v":"R"},{"$f":"VLOOKUP(A81,Plan!$A$6:$V$123,13,TRUE)","v":0},{"$f":"VLOOKUP(A81,Plan!$A$6:$V$123,14,TRUE)","v":"R"},{"$f":"VLOOKUP(A81,Plan!$A$6:$V$123,15,TRUE)","v":0},{"$f":"VLOOKUP(A81,Plan!$A$6:$V$123,16,TRUE)","v":0},{"$f":"VLOOKUP(A81,Plan!$A$6:$V$123,17,TRUE)","v":"15h-00h30#"},{"$f":"VLOOKUP(A81,Plan!$A$6:$V$123,18,TRUE)","v":"11h30-18h45#"},{"$f":"VLOOKUP(A81,Plan!$A$6:$V$123,19,TRUE)","v":0},{"$f":"VLOOKUP(A81,Plan!$A$6:$V$123,20,TRUE)","v":"11h-18h45#"},{"$f":"VLOOKUP(A81,Plan!$A$6:$V$123,21,TRUE)","v":0}]
["319081"," C D R ",null,null,{"$f":"VLOOKUP(A82,Plan!$A$6:$V$123,3,TRUE)","v":"35h00"},{"$f":"VLOOKUP(A82,Plan!$A$6:$V$123,7,TRUE)","v":"35h00"},{"$f":"VLOOKUP(A82,Plan!$A$6:$V$123,8,TRUE)","v":"R"},{"$f":"VLOOKUP(A82,Plan!$A$6:$V$123,9,TRUE)","v":0},{"$f":"VLOOKUP(A82,Plan!$A$6:$V$123,10,TRUE)","v":"R"},{"$f":"VLOOKUP(A82,Plan!$A$6:$V$123,11,TRUE)","v":0},{"$f":"VLOOKUP(A82,Plan!$A$6:$V$123,12,TRUE)","v":0},{"$f":"VLOOKUP(A82,Plan!$A$6:$V$123,13,TRUE)","v":"18h-02h#"},{"$f":"VLOOKUP(A82,Plan!$A$6:$V$123,14,TRUE)","v":0},{"$f":"VLOOKUP(A82,Plan!$A$6:$V$123,15,TRUE)","v":"18h-02h#"},{"$f":"VLOOKUP(A82,Plan!$A$6:$V$123,16,TRUE)","v":0},{"$f":"VLOOKUP(A82,Plan!$A$6:$V$123,17,TRUE)","v":"18h-02h#"},{"$f":"VLOOKUP(A82,Plan!$A$6:$V$123,18,TRUE)","v":0},{"$f":"VLOOKUP(A82,Plan!$A$6:$V$123,19,TRUE)","v":"18h-02h#"},{"$f":"VLOOKUP(A82,Plan!$A$6:$V$123,20,TRUE)","v":0},{"$f":"VLOOKUP(A82,Plan!$A$6:$V$123,21,TRUE)","v":"18h-23h30#"}]
["130118"," C D R ",null,null,{"$f":"VLOOKUP(A83,Plan!$A$6:$V$123,3,TRUE)","v":"35h00"},{"$f":"VLOOKUP(A83,Plan!$A$6:$V$123,7,TRUE)","v":"35h00"},{"$f":"VLOOKUP(A83,Plan!$A$6:$V$123,8,TRUE)","v":"11h45-15h#"},{"$f":"VLOOKUP(A83,Plan!$A$6:$V$123,9,TRUE)","v":"18h30-23h30#"},{"$f":"VLOOKUP(A83,Plan!$A$6:$V$123,10,TRUE)","v":"11h45-15h#"},{"$f":"VLOOKUP(A83,Plan!$A$6:$V$123,11,TRUE)","v":"18h30-24h#"},{"$f":"VLOOKUP(A83,Plan!$A$6:$V$123,12,TRUE)","v":"R"},{"$f":"VLOOKUP(A83,Plan!$A$6:$V$123,13,TRUE)","v":0},{"$f":"VLOOKUP(A83,Plan!$A$6:$V$123,14,TRUE)","v":"R"},{"$f":"VLOOKUP(A83,Plan!$A$6:$V$123,15,TRUE)","v":0},{"$f":"VLOOKUP(A83,Plan!$A$6:$V$123,16,TRUE)","v":"11h45-15h#"},{"$f":"VLOOKUP(A83,Plan!$A$6:$V$123,17,TRUE)","v":"18h30-24h#"},{"$f":"VLOOKUP(A83,Plan!$A$6:$V$123,18,TRUE)","v":0},{"$f":"VLOOKUP(A83,Plan!$A$6:$V$123,19,TRUE)","v":"18h30-24h#"},{"$f":"VLOOKUP(A83,Plan!$A$6:$V$123,20,TRUE)","v":"11h45-15h#"},{"$f":"VLOOKUP(A83,Plan!$A$6:$V$123,21,TRUE)","v":"18h30-23h30#"}]
["235648"," C D R ",null,null,{"$f":"VLOOKUP(A84,Plan!$A$6:$V$123,3,TRUE)","v":"35h00"},{"$f":"VLOOKUP(A84,Plan!$A$6:$V$123,7,TRUE)","v":"35h00"},{"$f":"VLOOKUP(A84,Plan!$A$6:$V$123,8,TRUE)","v":"R"},{"$f":"VLOOKUP(A84,Plan!$A$6:$V$123,9,TRUE)","v":0},{"$f":"VLOOKUP(A84,Plan!$A$6:$V$123,10,TRUE)","v":0},{"$f":"VLOOKUP(A84,Plan!$A$6:$V$123,11,TRUE)","v":"18h-02h#"},{"$f":"VLOOKUP(A84,Plan!$A$6:$V$123,12,TRUE)","v":0},{"$f":"VLOOKUP(A84,Plan!$A$6:$V$123,13,TRUE)","v":"18h-23h30#"},{"$f":"VLOOKUP(A84,Plan!$A$6:$V$123,14,TRUE)","v":0},{"$f":"VLOOKUP(A84,Plan!$A$6:$V$123,15,TRUE)","v":"18h-02h#"},{"$f":"VLOOKUP(A84,Plan!$A$6:$V$123,16,TRUE)","v":0},{"$f":"VLOOKUP(A84,Plan!$A$6:$V$123,17,TRUE)","v":"18h-02h#"},{"$f":"VLOOKUP(A84,Plan!$A$6:$V$123,18,TRUE)","v":0},{"$f":"VLOOKUP(A84,Plan!$A$6:$V$123,19,TRUE)","v":"18h-02h#"},{"$f":"VLOOKUP(A84,Plan!$A$6:$V$123,20,TRUE)","v":"R"},{"$f":"VLOOKUP(A84,Plan!$A$6:$V$123,21,TRUE)","v":0}]
["309011"," C D R ",null,null,{"$f":"VLOOKUP(A85,Plan!$A$6:$V$123,3,TRUE)","v":"35h00"},{"$f":"VLOOKUP(A85,Plan!$A$6:$V$123,7,TRUE)","v":"00h00"},{"$f":"VLOOKUP(A85,Plan!$A$6:$V$123,8,TRUE)","v":"CP"},{"$f":"VLOOKUP(A85,Plan!$A$6:$V$123,9,TRUE)","v":0},{"$f":"VLOOKUP(A85,Plan!$A$6:$V$123,10,TRUE)","v":"CP"},{"$f":"VLOOKUP(A85,Plan!$A$6:$V$123,11,TRUE)","v":0},{"$f":"VLOOKUP(A85,Plan!$A$6:$V$123,12,TRUE)","v":"R"},{"$f":"VLOOKUP(A85,Plan!$A$6:$V$123,13,TRUE)","v":0},{"$f":"VLOOKUP(A85,Plan!$A$6:$V$123,14,TRUE)","v":"R"},{"$f":"VLOOKUP(A85,Plan!$A$6:$V$123,15,TRUE)","v":0},{"$f":"VLOOKUP(A85,Plan!$A$6:$V$123,16,TRUE)","v":"CP"},{"$f":"VLOOKUP(A85,Plan!$A$6:$V$123,17,TRUE)","v":0},{"$f":"VLOOKUP(A85,Plan!$A$6:$V$123,18,TRUE)","v":"CP"},{"$f":"VLOOKUP(A85,Plan!$A$6:$V$123,19,TRUE)","v":0},{"$f":"VLOOKUP(A85,Plan!$A$6:$V$123,20,TRUE)","v":"CP"},{"$f":"VLOOKUP(A85,Plan!$A$6:$V$123,21,TRUE)","v":0}]
["706191"," C D R ",null,null,{"$f":"VLOOKUP(A86,Plan!$A$6:$V$123,3,TRUE)","v":"39h00"},{"$f":"VLOOKUP(A86,Plan!$A$6:$V$123,7,TRUE)","v":"39h00"},{"$f":"VLOOKUP(A86,Plan!$A$6:$V$123,8,TRUE)","v":0},{"$f":"VLOOKUP(A86,Plan!$A$6:$V$123,9,TRUE)","v":"18h-01h45#"},{"$f":"VLOOKUP(A86,Plan!$A$6:$V$123,10,TRUE)","v":0},{"$f":"VLOOKUP(A86,Plan!$A$6:$V$123,11,TRUE)","v":"18h-02h#"},{"$f":"VLOOKUP(A86,Plan!$A$6:$V$123,12,TRUE)","v":0},{"$f":"VLOOKUP(A86,Plan!$A$6:$V$123,13,TRUE)","v":"18h-02h#"},{"$f":"VLOOKUP(A86,Plan!$A$6:$V$123,14,TRUE)","v":0},{"$f":"VLOOKUP(A86,Plan!$A$6:$V$123,15,TRUE)","v":"18h-02h#"},{"$f":"VLOOKUP(A86,Plan!$A$6:$V$123,16,TRUE)","v":"R"},{"$f":"VLOOKUP(A86,Plan!$A$6:$V$123,17,TRUE)","v":0},{"$f":"VLOOKUP(A86,Plan!$A$6:$V$123,18,TRUE)","v":"R"},{"$f":"VLOOKUP(A86,Plan!$A$6:$V$123,19,TRUE)","v":0},{"$f":"VLOOKUP(A86,Plan!$A$6:$V$123,20,TRUE)","v":0},{"$f":"VLOOKUP(A86,Plan!$A$6:$V$123,21,TRUE)","v":"16h-01h45#"}]
["130103"," C D R ",null,null,{"$f":"VLOOKUP(A87,Plan!$A$6:$V$123,3,TRUE)","v":"35h00"},{"$f":"VLOOKUP(A87,Plan!$A$6:$V$123,7,TRUE)","v":"35h00"},{"$f":"VLOOKUP(A87,Plan!$A$6:$V$123,8,TRUE)","v":"09h30-17h#"},{"$f":"VLOOKUP(A87,Plan!$A$6:$V$123,9,TRUE)","v":0},{"$f":"VLOOKUP(A87,Plan!$A$6:$V$123,10,TRUE)","v":"09h30-17h#"},{"$f":"VLOOKUP(A87,Plan!$A$6:$V$123,11,TRUE)","v":0},{"$f":"VLOOKUP(A87,Plan!$A$6:$V$123,12,TRUE)","v":"R"},{"$f":"VLOOKUP(A87,Plan!$A$6:$V$123,13,TRUE)","v":0},{"$f":"VLOOKUP(A87,Plan!$A$6:$V$123,14,TRUE)","v":"R"},{"$f":"VLOOKUP(A87,Plan!$A$6:$V$123,15,TRUE)","v":0},{"$f":"VLOOKUP(A87,Plan!$A$6:$V$123,16,TRUE)","v":"09h30-17h#"},{"$f":"VLOOKUP(A87,Plan!$A$6:$V$123,17,TRUE)","v":0},{"$f":"VLOOKUP(A87,Plan!$A$6:$V$123,18,TRUE)","v":"09h30-17h#"},{"$f":"VLOOKUP(A87,Plan!$A$6:$V$123,19,TRUE)","v":0},{"$f":"VLOOKUP(A87,Plan!$A$6:$V$123,20,TRUE)","v":"09h30-17h#"},{"$f":"VLOOKUP(A87,Plan!$A$6:$V$123,21,TRUE)","v":0}]
["101065"," C D R ",null,null,{"$f":"VLOOKUP(A88,Plan!$A$6:$V$123,3,TRUE)","v":"39h00"},{"$f":"VLOOKUP(A88,Plan!$A$6:$V$123,7,TRUE)","v":"39h00"},{"$f":"VLOOKUP(A88,Plan!$A$6:$V$123,8,TRUE)","v":0},{"$f":"VLOOKUP(A88,Plan!$A$6:$V$123,9,TRUE)","v":"15h-23h30#"},{"$f":"VLOOKUP(A88,Plan!$A$6:$V$123,10,TRUE)","v":0},{"$f":"VLOOKUP(A88,Plan!$A$6:$V$123,11,TRUE)","v":"15h-24h#"},{"$f":"VLOOKUP(A88,Plan!$A$6:$V$123,12,TRUE)","v":0},{"$f":"VLOOKUP(A88,Plan!$A$6:$V$123,13,TRUE)","v":"15h-24h#"},{"$f":"VLOOKUP(A88,Plan!$A$6:$V$123,14,TRUE)","v":"R"},{"$f":"VLOOKUP(A88,Plan!$A$6:$V$123,15,TRUE)","v":0},{"$f":"VLOOKUP(A88,Plan!$A$6:$V$123,16,TRUE)","v":"R"},{"$f":"VLOOKUP(A88,Plan!$A$6:$V$123,17,TRUE)","v":0},{"$f":"VLOOKUP(A88,Plan!$A$6:$V$123,18,TRUE)","v":0},{"$f":"VLOOKUP(A88,Plan!$A$6:$V$123,19,TRUE)","v":"15h-24h30#"},{"$f":"VLOOKUP(A88,Plan!$A$6:$V$123,20,TRUE)","v":"11h30-17h#"},{"$f":"VLOOKUP(A88,Plan!$A$6:$V$123,21,TRUE)","v":0}]
["102021"," C D R ",null,null,{"$f":"VLOOKUP(A89,Plan!$A$6:$V$123,3,TRUE)","v":"39h00"},{"$f":"VLOOKUP(A89,Plan!$A$6:$V$123,7,TRUE)","v":"39h00"},{"$f":"VLOOKUP(A89,Plan!$A$6:$V$123,8,TRUE)","v":0},{"$f":"VLOOKUP(A89,Plan!$A$6:$V$123,9,TRUE)","v":"15h-23h30#"},{"$f":"VLOOKUP(A89,Plan!$A$6:$V$123,10,TRUE)","v":0},{"$f":"VLOOKUP(A89,Plan!$A$6:$V$123,11,TRUE)","v":"15h-24h#"},{"$f":"VLOOKUP(A89,Plan!$A$6:$V$123,12,TRUE)","v":0},{"$f":"VLOOKUP(A89,Plan!$A$6:$V$123,13,TRUE)","v":"15h-24h#"},{"$f":"VLOOKUP(A89,Plan!$A$6:$V$123,14,TRUE)","v":"R"},{"$f":"VLOOKUP(A89,Plan!$A$6:$V$123,15,TRUE)","v":0},{"$f":"VLOOKUP(A89,Plan!$A$6:$V$123,16,TRUE)","v":"R"},{"$f":"VLOOKUP(A89,Plan!$A$6:$V$123,17,TRUE)","v":0},{"$f":"VLOOKUP(A89,Plan!$A$6:$V$123,18,TRUE)","v":0},{"$f":"VLOOKUP(A89,Plan!$A$6:$V$123,19,TRUE)","v":"15h-24h30#"},{"$f":"VLOOKUP(A89,Plan!$A$6:$V$123,20,TRUE)","v":"11h30-17h#"},{"$f":"VLOOKUP(A89,Plan!$A$6:$V$123,21,TRUE)","v":0}]
["710061"," C D R ",null,null,{"$f":"VLOOKUP(A90,Plan!$A$6:$V$123,3,TRUE)","v":"39h00"},{"$f":"VLOOKUP(A90,Plan!$A$6:$V$123,7,TRUE)","v":"39h00"},{"$f":"VLOOKUP(A90,Plan!$A$6:$V$123,8,TRUE)","v":0},{"$f":"VLOOKUP(A90,Plan!$A$6:$V$123,9,TRUE)","v":"18h-01h45#"},{"$f":"VLOOKUP(A90,Plan!$A$6:$V$123,10,TRUE)","v":0},{"$f":"VLOOKUP(A90,Plan!$A$6:$V$123,11,TRUE)","v":"18h-02h#"},{"$f":"VLOOKUP(A90,Plan!$A$6:$V$123,12,TRUE)","v":0},{"$f":"VLOOKUP(A90,Plan!$A$6:$V$123,13,TRUE)","v":"18h-02h#"},{"$f":"VLOOKUP(A90,Plan!$A$6:$V$123,14,TRUE)","v":0},{"$f":"VLOOKUP(A90,Plan!$A$6:$V$123,15,TRUE)","v":"18h-02h#"},{"$f":"VLOOKUP(A90,Plan!$A$6:$V$123,16,TRUE)","v":"R"},{"$f":"VLOOKUP(A90,Plan!$A$6:$V$123,17,TRUE)","v":0},{"$f":"VLOOKUP(A90,Plan!$A$6:$V$123,18,TRUE)","v":"R"},{"$f":"VLOOKUP(A90,Plan!$A$6:$V$123,19,TRUE)","v":0},{"$f":"VLOOKUP(A90,Plan!$A$6:$V$123,20,TRUE)","v":0},{"$f":"VLOOKUP(A90,Plan!$A$6:$V$123,21,TRUE)","v":"16h-01h45#"}]
["801153"," C D R ",null,null,{"$f":"VLOOKUP(A91,Plan!$A$6:$V$123,3,TRUE)","v":"39h00"},{"$f":"VLOOKUP(A91,Plan!$A$6:$V$123,7,TRUE)","v":"39h00"},{"$f":"VLOOKUP(A91,Plan!$A$6:$V$123,8,TRUE)","v":"R"},{"$f":"VLOOKUP(A91,Plan!$A$6:$V$123,9,TRUE)","v":0},{"$f":"VLOOKUP(A91,Plan!$A$6:$V$123,10,TRUE)","v":"R"},{"$f":"VLOOKUP(A91,Plan!$A$6:$V$123,11,TRUE)","v":0},{"$f":"VLOOKUP(A91,Plan!$A$6:$V$123,12,TRUE)","v":"11h45-15h#"},{"$f":"VLOOKUP(A91,Plan!$A$6:$V$123,13,TRUE)","v":"18h30-24h15#"},{"$f":"VLOOKUP(A91,Plan!$A$6:$V$123,14,TRUE)","v":"11h45-15h#"},{"$f":"VLOOKUP(A91,Plan!$A$6:$V$123,15,TRUE)","v":"18h30-24h15#"},{"$f":"VLOOKUP(A91,Plan!$A$6:$V$123,16,TRUE)","v":0},{"$f":"VLOOKUP(A91,Plan!$A$6:$V$123,17,TRUE)","v":"16h-00h30#"},{"$f":"VLOOKUP(A91,Plan!$A$6:$V$123,18,TRUE)","v":"11h30-19h30#"},{"$f":"VLOOKUP(A91,Plan!$A$6:$V$123,19,TRUE)","v":0},{"$f":"VLOOKUP(A91,Plan!$A$6:$V$123,20,TRUE)","v":"11h30-19h30#"},{"$f":"VLOOKUP(A91,Plan!$A$6:$V$123,21,TRUE)","v":0}]
["403111"," C D R ",null,null,{"$f":"VLOOKUP(A92,Plan!$A$6:$V$123,3,TRUE)","v":"35h00"},{"$f":"VLOOKUP(A92,Plan!$A$6:$V$123,7,TRUE)","v":"35h00"},{"$f":"VLOOKUP(A92,Plan!$A$6:$V$123,8,TRUE)","v":"R"},{"$f":"VLOOKUP(A92,Plan!$A$6:$V$123,9,TRUE)","v":0},{"$f":"VLOOKUP(A92,Plan!$A$6:$V$123,10,TRUE)","v":"R"},{"$f":"VLOOKUP(A92,Plan!$A$6:$V$123,11,TRUE)","v":0},{"$f":"VLOOKUP(A92,Plan!$A$6:$V$123,12,TRUE)","v":0},{"$f":"VLOOKUP(A92,Plan!$A$6:$V$123,13,TRUE)","v":"18h-02h#"},{"$f":"VLOOKUP(A92,Plan!$A$6:$V$123,14,TRUE)","v":0},{"$f":"VLOOKUP(A92,Plan!$A$6:$V$123,15,TRUE)","v":"18h-02h#"},{"$f":"VLOOKUP(A92,Plan!$A$6:$V$123,16,TRUE)","v":0},{"$f":"VLOOKUP(A92,Plan!$A$6:$V$123,17,TRUE)","v":"18h-02h#"},{"$f":"VLOOKUP(A92,Plan!$A$6:$V$123,18,TRUE)","v":0},{"$f":"VLOOKUP(A92,Plan!$A$6:$V$123,19,TRUE)","v":"18h-02h#"},{"$f":"VLOOKUP(A92,Plan!$A$6:$V$123,20,TRUE)","v":0},{"$f":"VLOOKUP(A92,Plan!$A$6:$V$123,21,TRUE)","v":"18h-23h30#"}]
["006245"," C D R ",null,null,{"$f":"VLOOKUP(A93,Plan!$A$6:$V$123,3,TRUE)","v":"39h00"},{"$f":"VLOOKUP(A93,Plan!$A$6:$V$123,7,TRUE)","v":"39h00"},{"$f":"VLOOKUP(A93,Plan!$A$6:$V$123,8,TRUE)","v":"11h45-15h#"},{"$f":"VLOOKUP(A93,Plan!$A$6:$V$123,9,TRUE)","v":"18h30-23h15#"},{"$f":"VLOOKUP(A93,Plan!$A$6:$V$123,10,TRUE)","v":"11h45-15h#"},{"$f":"VLOOKUP(A93,Plan!$A$6:$V$123,11,TRUE)","v":"18h30-24h15#"},{"$f":"VLOOKUP(A93,Plan!$A$6:$V$123,12,TRUE)","v":"11h45-15h#"},{"$f":"VLOOKUP(A93,Plan!$A$6:$V$123,13,TRUE)","v":"18h30-24h15#"},{"$f":"VLOOKUP(A93,Plan!$A$6:$V$123,14,TRUE)","v":"11h45-15h#"},{"$f":"VLOOKUP(A93,Plan!$A$6:$V$123,15,TRUE)","v":"18h30-24h15#"},{"$f":"VLOOKUP(A93,Plan!$A$6:$V$123,16,TRUE)","v":"R"},{"$f":"VLOOKUP(A93,Plan!$A$6:$V$123,17,TRUE)","v":0},{"$f":"VLOOKUP(A93,Plan!$A$6:$V$123,18,TRUE)","v":"R"},{"$f":"VLOOKUP(A93,Plan!$A$6:$V$123,19,TRUE)","v":0},{"$f":"VLOOKUP(A93,Plan!$A$6:$V$123,20,TRUE)","v":"11h45-16h#"},{"$f":"VLOOKUP(A93,Plan!$A$6:$V$123,21,TRUE)","v":"18h30-23h15#"}]
["112511"," C D R ",null,null,{"$f":"VLOOKUP(A94,Plan!$A$6:$V$123,3,TRUE)","v":"35h00"},{"$f":"VLOOKUP(A94,Plan!$A$6:$V$123,7,TRUE)","v":"35h00"},{"$f":"VLOOKUP(A94,Plan!$A$6:$V$123,8,TRUE)","v":0},{"$f":"VLOOKUP(A94,Plan!$A$6:$V$123,9,TRUE)","v":"18h-02h#"},{"$f":"VLOOKUP(A94,Plan!$A$6:$V$123,10,TRUE)","v":0},{"$f":"VLOOKUP(A94,Plan!$A$6:$V$123,11,TRUE)","v":"18h-23h30#"},{"$f":"VLOOKUP(A94,Plan!$A$6:$V$123,12,TRUE)","v":"R"},{"$f":"VLOOKUP(A94,Plan!$A$6:$V$123,13,TRUE)","v":0},{"$f":"VLOOKUP(A94,Plan!$A$6:$V$123,14,TRUE)","v":"R"},{"$f":"VLOOKUP(A94,Plan!$A$6:$V$123,15,TRUE)","v":0},{"$f":"VLOOKUP(A94,Plan!$A$6:$V$123,16,TRUE)","v":0},{"$f":"VLOOKUP(A94,Plan!$A$6:$V$123,17,TRUE)","v":"18h-02h#"},{"$f":"VLOOKUP(A94,Plan!$A$6:$V$123,18,TRUE)","v":0},{"$f":"VLOOKUP(A94,Plan!$A$6:$V$123,19,TRUE)","v":"18h-02h#"},{"$f":"VLOOKUP(A94,Plan!$A$6:$V$123,20,TRUE)","v":0},{"$f":"VLOOKUP(A94,Plan!$A$6:$V$123,21,TRUE)","v":"18h-02h#"}]
[{"$nulls":4},{"$f":"VLOOKUP(A95,Plan!$A$6:$V$123,3,TRUE)","v":{"$error":"#N/A"}},{"$f":"VLOOKUP(A95,Plan!$A$6:$V$123,7,TRUE)","v":{"$error":"#N/A"}},{"$f":"VLOOKUP(A95,Plan!$A$6:$V$123,8,TRUE)","v":{"$error":"#N/A"}},{"$f":"VLOOKUP(A95,Plan!$A$6:$V$123,9,TRUE)","v":{"$error":"#N/A"}},{"$f":"VLOOKUP(A95,Plan!$A$6:$V$123,10,TRUE)","v":{"$error":"#N/A"}},{"$f":"VLOOKUP(A95,Plan!$A$6:$V$123,11,TRUE)","v":{"$error":"#N/A"}},{"$f":"VLOOKUP(A95,Plan!$A$6:$V$123,12,TRUE)","v":{"$error":"#N/A"}},{"$f":"VLOOKUP(A95,Plan!$A$6:$V$123,13,TRUE)","v":{"$error":"#N/A"}},{"$f":"VLOOKUP(A95,Plan!$A$6:$V$123,14,TRUE)","v":{"$error":"#N/A"}},{"$f":"VLOOKUP(A95,Plan!$A$6:$V$123,15,TRUE)","v":{"$error":"#N/A"}},{"$f":"VLOOKUP(A95,Plan!$A$6:$V$123,16,TRUE)","v":{"$error":"#N/A"}},{"$f":"VLOOKUP(A95,Plan!$A$6:$V$123,17,TRUE)","v":{"$error":"#N/A"}},{"$f":"VLOOKUP(A95,Plan!$A$6:$V$123,18,TRUE)","v":{"$error":"#N/A"}},{"$f":"VLOOKUP(A95,Plan!$A$6:$V$123,19,TRUE)","v":{"$error":"#N/A"}},{"$f":"VLOOKUP(A95,Plan!$A$6:$V$123,20,TRUE)","v":{"$error":"#N/A"}},{"$f":"VLOOKUP(A95,Plan!$A$6:$V$123,21,TRUE)","v":{"$error":"#N/A"}}]
[{"$nulls":4},{"$f":"VLOOKUP(A96,Plan!$A$6:$V$123,3,TRUE)","v":{"$error":"#N/A"}},{"$f":"VLOOKUP(A96,Plan!$A$6:$V$123,7,TRUE)","v":{"$error":"#N/A"}},{"$f":"VLOOKUP(A96,Plan!$A$6:$V$123,8,TRUE)","v":{"$error":"#N/A"}},{"$f":"VLOOKUP(A96,Plan!$A$6:$V$123,9,TRUE)","v":{"$error":"#N/A"}},{"$f":"VLOOKUP(A96,Plan!$A$6:$V$123,10,TRUE)","v":{"$error":"#N/A"}},{"$f":"VLOOKUP(A96,Plan!$A$6:$V$123,11,TRUE)","v":{"$error":"#N/A"}},{"$f":"VLOOKUP(A96,Plan!$A$6:$V$123,12,TRUE)","v":{"$error":"#N/A"}},{"$f":"VLOOKUP(A96,Plan!$A$6:$V$123,13,TRUE)","v":{"$error":"#N/A"}},{"$f":"VLOOKUP(A96,Plan!$A$6:$V$123,14,TRUE)","v":{"$error":"#N/A"}},{"$f":"VLOOKUP(A96,Plan!$A$6:$V$123,15,TRUE)","v":{"$error":"#N/A"}},{"$f":"VLOOKUP(A96,Plan!$A$6:$V$123,16,TRUE)","v":{"$error":"#N/A"}},{"$f":"VLOOKUP(A96,Plan!$A$6:$V$123,17,TRUE)","v":{"$error":"#N/A"}},{"$f":"VLOOKUP(A96,Plan!$A$6:$V$123,18,TRUE)","v":{"$error":"#N/A"}},{"$f":"VLOOKUP(A96,Plan!$A$6:$V$123,19,TRUE)","v":{"$error":"#N/A"}},{"$f":"VLOOKUP(A96,Plan!$A$6:$V$123,20,TRUE)","v":{"$error":"#N/A"}},{"$f":"VLOOKUP(A96,Plan!$A$6:$V$123,21,TRUE)","v":{"$error":"#N/A"}}]
[{"$nulls":4},{"$f":"VLOOKUP(A97,Plan!$A$6:$V$123,3,TRUE)","v":{"$error":"#N/A"}},{"$f":"VLOOKUP(A97,Plan!$A$6:$V$123,7,TRUE)","v":{"$error":"#N/A"}},{"$f":"VLOOKUP(A97,Plan!$A$6:$V$123,8,TRUE)","v":{"$error":"#N/A"}},{"$f":"VLOOKUP(A97,Plan!$A$6:$V$123,9,TRUE)","v":{"$error":"#N/A"}},{"$f":"VLOOKUP(A97,Plan!$A$6:$V$123,10,TRUE)","v":{"$error":"#N/A"}},{"$f":"VLOOKUP(A97,Plan!$A$6:$V$123,11,TRUE)","v":{"$error":"#N/A"}},{"$f":"VLOOKUP(A97,Plan!$A$6:$V$123,12,TRUE)","v":{"$error":"#N/A"}},{"$f":"VLOOKUP(A97,Plan!$A$6:$V$123,13,TRUE)","v":{"$error":"#N/A"}},{"$f":"VLOOKUP(A97,Plan!$A$6:$V$123,14,TRUE)","v":{"$error":"#N/A"}},{"$f":"VLOOKUP(A97,Plan!$A$6:$V$123,15,TRUE)","v":{"$error":"#N/A"}},{"$f":"VLOOKUP(A97,Plan!$A$6:$V$123,16,TRUE)","v":{"$error":"#N/A"}},{"$f":"VLOOKUP(A97,Plan!$A$6:$V$123,17,TRUE)","v":{"$error":"#N/A"}},{"$f":"VLOOKUP(A97,Plan!$A$6:$V$123,18,TRUE)","v":{"$error":"#N/A"}},{"$f":"VLOOKUP(A97,Plan!$A$6:$V$123,19,TRUE)","v":{"$error":"#N/A"}},{"$f":"VLOOKUP(A97,Plan!$A$6:$V$123,20,TRUE)","v":{"$error":"#N/A"}},{"$f":"VLOOKUP(A97,Plan!$A$6:$V$123,21,TRUE)","v":{"$error":"#N/A"}}]
[{"$nulls":4},{"$f":"VLOOKUP(A98,Plan!$A$6:$V$123,3,TRUE)","v":{"$error":"#N/A"}},{"$f":"VLOOKUP(A98,Plan!$A$6:$V$123,7,TRUE)","v":{"$error":"#N/A"}},{"$f":"VLOOKUP(A98,Plan!$A$6:$V$123,8,TRUE)","v":{"$error":"#N/A"}},{"$f":"VLOOKUP(A98,Plan!$A$6:$V$123,9,TRUE)","v":{"$error":"#N/A"}},{"$f":"VLOOKUP(A98,Plan!$A$6:$V$123,10,TRUE)","v":{"$error":"#N/A"}},{"$f":"VLOOKUP(A98,Plan!$A$6:$V$123,11,TRUE)","v":{"$error":"#N/A"}},{"$f":"VLOOKUP(A98,Plan!$A$6:$V$123,12,TRUE)","v":{"$error":"#N/A"}},{"$f":"VLOOKUP(A98,Plan!$A$6:$V$123,13,TRUE)","v":{"$error":"#N/A"}},{"$f":"VLOOKUP(A98,Plan!$A$6:$V$123,14,TRUE)","v":{"$error":"#N/A"}},{"$f":"VLOOKUP(A98,Plan!$A$6:$V$123,15,TRUE)","v":{"$error":"#N/A"}},{"$f":"VLOOKUP(A98,Plan!$A$6:$V$123,16,TRUE)","v":{"$error":"#N/A"}},{"$f":"VLOOKUP(A98,Plan!$A$6:$V$123,17,TRUE)","v":{"$error":"#N/A"}},{"$f":"VLOOKUP(A98,Plan!$A$6:$V$123,18,TRUE)","v":{"$error":"#N/A"}},{"$f":"VLOOKUP(A98,Plan!$A$6:$V$123,19,TRUE)","v":{"$error":"#N/A"}},{"$f":"VLOOKUP(A98,Plan!$A$6:$V$123,20,TRUE)","v":{"$error":"#N/A"}},{"$f":"VLOOKUP(A98,Plan!$A$6:$V$123,21,TRUE)","v":{"$error":"#N/A"}}]
[{"$nulls":4},{"$f":"VLOOKUP(A99,Plan!$A$6:$V$123,3,TRUE)","v":{"$error":"#N/A"}},{"$f":"VLOOKUP(A99,Plan!$A$6:$V$123,7,TRUE)","v":{"$error":"#N/A"}},{"$f":"VLOOKUP(A99,Plan!$A$6:$V$123,8,TRUE)","v":{"$error":"#N/A"}},{"$f":"VLOOKUP(A99,Plan!$A$6:$V$123,9,TRUE)","v":{"$error":"#N/A"}},{"$f":"VLOOKUP(A99,Plan!$A$6:$V$123,10,TRUE)","v":{"$error":"#N/A"}},{"$f":"VLOOKUP(A99,Plan!$A$6:$V$123,11,TRUE)","v":{"$error":"#N/A"}},{"$f":"VLOOKUP(A99,Plan!$A$6:$V$123,12,TRUE)","v":{"$error":"#N/A"}},{"$f":"VLOOKUP(A99,Plan!$A$6:$V$123,13,TRUE)","v":{"$error":"#N/A"}},{"$f":"VLOOKUP(A99,Plan!$A$6:$V$123,14,TRUE)","v":{"$error":"#N/A"}},{"$f":"VLOOKUP(A99,Plan!$A$6:$V$123,15,TRUE)","v":{"$error":"#N/A"}},{"$f":"VLOOKUP(A99,Plan!$A$6:$V$123,16,TRUE)","v":{"$error":"#N/A"}},{"$f":"VLOOKUP(A99,Plan!$A$6:$V$123,17,TRUE)","v":{"$error":"#N/A"}},{"$f":"VLOOKUP(A99,Plan!$A$6:$V$123,18,TRUE)","v":{"$error":"#N/A"}},{"$f":"VLOOKUP(A99,Plan!$A$6:$V$123,19,TRUE)","v":{"$error":"#N/A"}},{"$f":"VLOOKUP(A99,Plan!$A$6:$V$123,20,TRUE)","v":{"$error":"#N/A"}},{"$f":"VLOOKUP(A99,Plan!$A$6:$V$123,21,TRUE)","v":{"$error":"#N/A"}}]
[{"$nulls":4},{"$f":"VLOOKUP(A100,Plan!$A$6:$V$123,3,TRUE)","v":{"$error":"#N/A"}},{"$f":"VLOOKUP(A100,Plan!$A$6:$V$123,7,TRUE)","v":{"$error":"#N/A"}},{"$f":"VLOOKUP(A100,Plan!$A$6:$V$123,8,TRUE)","v":{"$error":"#N/A"}},{"$f":"VLOOKUP(A100,Plan!$A$6:$V$123,9,TRUE)","v":{"$error":"#N/A"}},{"$f":"VLOOKUP(A100,Plan!$A$6:$V$123,10,TRUE)","v":{"$error":"#N/A"}},{"$f":"VLOOKUP(A100,Plan!$A$6:$V$123,11,TRUE)","v":{"$error":"#N/A"}},{"$f":"VLOOKUP(A100,Plan!$A$6:$V$123,12,TRUE)","v":{"$error":"#N/A"}},{"$f":"VLOOKUP(A100,Plan!$A$6:$V$123,13,TRUE)","v":{"$error":"#N/A"}},{"$f":"VLOOKUP(A100,Plan!$A$6:$V$123,14,TRUE)","v":{"$error":"#N/A"}},{"$f":"VLOOKUP(A100,Plan!$A$6:$V$123,15,TRUE)","v":{"$error":"#N/A"}},{"$f":"VLOOKUP(A100,Plan!$A$6:$V$123,16,TRUE)","v":{"$error":"#N/A"}},{"$f":"VLOOKUP(A100,Plan!$A$6:$V$123,17,TRUE)","v":{"$error":"#N/A"}},{"$f":"VLOOKUP(A100,Plan!$A$6:$V$123,18,TRUE)","v":{"$error":"#N/A"}},{"$f":"VLOOKUP(A100,Plan!$A$6:$V$123,19,TRUE)","v":{"$error":"#N/A"}},{"$f":"VLOOKUP(A100,Plan!$A$6:$V$123,20,TRUE)","v":{"$error":"#N/A"}},{"$f":"VLOOKUP(A100,Plan!$A$6:$V$123,21,TRUE)","v":{"$error":"#N/A"}}]
[{"$nulls":4},{"$f":"VLOOKUP(A101,Plan!$A$6:$V$123,3,TRUE)","v":{"$error":"#N/A"}},{"$f":"VLOOKUP(A101,Plan!$A$6:$V$123,7,TRUE)","v":{"$error":"#N/A"}},{"$f":"VLOOKUP(A101,Plan!$A$6:$V$123,8,TRUE)","v":{"$error":"#N/A"}},{"$f":"VLOOKUP(A101,Plan!$A$6:$V$123,9,TRUE)","v":{"$error":"#N/A"}},{"$f":"VLOOKUP(A101,Plan!$A$6:$V$123,10,TRUE)","v":{"$error":"#N/A"}},{"$f":"VLOOKUP(A101,Plan!$A$6:$V$123,11,TRUE)","v":{"$error":"#N/A"}},{"$f":"VLOOKUP(A101,Plan!$A$6:$V$123,12,TRUE)","v":{"$error":"#N/A"}},{"$f":"VLOOKUP(A101,Plan!$A$6:$V$123,13,TRUE)","v":{"$error":"#N/A"}},{"$f":"VLOOKUP(A101,Plan!$A$6:$V$123,14,TRUE)","v":{"$error":"#N/A"}},{"$f":"VLOOKUP(A101,Plan!$A$6:$V$123,15,TRUE)","v":{"$error":"#N/A"}},{"$f":"VLOOKUP(A101,Plan!$A$6:$V$123,16,TRUE)","v":{"$error":"#N/A"}},{"$f":"VLOOKUP(A101,Plan!$A$6:$V$123,17,TRUE)","v":{"$error":"#N/A"}},{"$f":"VLOOKUP(A101,Plan!$A$6:$V$123,18,TRUE)","v":{"$error":"#N/A"}},{"$f":"VLOOKUP(A101,Plan!$A$6:$V$123,19,TRUE)","v":{"$error":"#N/A"}},{"$f":"VLOOKUP(A101,Plan!$A$6:$V$123,20,TRUE)","v":{"$error":"#N/A"}},{"$f":"VLOOKUP(A101,Plan!$A$6:$V$123,21,TRUE)","v":{"$error":"#N/A"}}]
[{"$nulls":4},{"$f":"VLOOKUP(A102,Plan!$A$6:$V$123,3,TRUE)","v":{"$error":"#N/A"}},{"$f":"VLOOKUP(A102,Plan!$A$6:$V$123,7,TRUE)","v":{"$error":"#N/A"}},{"$f":"VLOOKUP(A102,Plan!$A$6:$V$123,8,TRUE)","v":{"$error":"#N/A"}},{"$f":"VLOOKUP(A102,Plan!$A$6:$V$123,9,TRUE)","v":{"$error":"#N/A"}},{"$f":"VLOOKUP(A102,Plan!$A$6:$V$123,10,TRUE)","v":{"$error":"#N/A"}},{"$f":"VLOOKUP(A102,Plan!$A$6:$V$123,11,TRUE)","v":{"$error":"#N/A"}},{"$f":"VLOOKUP(A102,Plan!$A$6:$V$123,12,TRUE)","v":{"$error":"#N/A"}},{"$f":"VLOOKUP(A102,Plan!$A$6:$V$123,13,TRUE)","v":{"$error":"#N/A"}},{"$f":"VLOOKUP(A102,Plan!$A$6:$V$123,14,TRUE)","v":{"$error":"#N/A"}},{"$f":"VLOOKUP(A102,Plan!$A$6:$V$123,15,TRUE)","v":{"$error":"#N/A"}},{"$f":"VLOOKUP(A102,Plan!$A$6:$V$123,16,TRUE)","v":{"$error":"#N/A"}},{"$f":"VLOOKUP(A102,Plan!$A$6:$V$123,17,TRUE)","v":{"$error":"#N/A"}},{"$f":"VLOOKUP(A102,Plan!$A$6:$V$123,18,TRUE)","v":{"$error":"#N/A"}},{"$f":"VLOOKUP(A102,Plan!$A$6:$V$123,19,TRUE)","v":{"$error":"#N/A"}},{"$f":"VLOOKUP(A102,Plan!$A$6:$V$123,20,TRUE)","v":{"$error":"#N/A"}},{"$f":"VLOOKUP(A102,Plan!$A$6:$V$123,21,TRUE)","v":{"$error":"#N/A"}}]
[{"$nulls":4},{"$f":"VLOOKUP(A103,Plan!$A$6:$V$123,3,TRUE)","v":{"$error":"#N/A"}},{"$f":"VLOOKUP(A103,Plan!$A$6:$V$123,7,TRUE)","v":{"$error":"#N/A"}},{"$f":"VLOOKUP(A103,Plan!$A$6:$V$123,8,TRUE)","v":{"$error":"#N/A"}},{"$f":"VLOOKUP(A103,Plan!$A$6:$V$123,9,TRUE)","v":{"$error":"#N/A"}},{"$f":"VLOOKUP(A103,Plan!$A$6:$V$123,10,TRUE)","v":{"$error":"#N/A"}},{"$f":"VLOOKUP(A103,Plan!$A$6:$V$123,11,TRUE)","v":{"$error":"#N/A"}},{"$f":"VLOOKUP(A103,Plan!$A$6:$V$123,12,TRUE)","v":{"$error":"#N/A"}},{"$f":"VLOOKUP(A103,Plan!$A$6:$V$123,13,TRUE)","v":{"$error":"#N/A"}},{"$f":"VLOOKUP(A103,Plan!$A$6:$V$123,14,TRUE)","v":{"$error":"#N/A"}},{"$f":"VLOOKUP(A103,Plan!$A$6:$V$123,15,TRUE)","v":{"$error":"#N/A"}},{"$f":"VLOOKUP(A103,Plan!$A$6:$V$123,16,TRUE)","v":{"$error":"#N/A"}},{"$f":"VLOOKUP(A103,Plan!$A$6:$V$123,17,TRUE)","v":{"$error":"#N/A"}},{"$f":"VLOOKUP(A103,Plan!$A$6:$V$123,18,TRUE)","v":{"$error":"#N/A"}},{"$f":"VLOOKUP(A103,Plan!$A$6:$V$123,19,TRUE)","v":{"$error":"#N/A"}},{"$f":"VLOOKUP(A103,Plan!$A$6:$V$123,20,TRUE)","v":{"$error":"#N/A"}},{"$f":"VLOOKUP(A103,Plan!$A$6:$V$123,21,TRUE)","v":{"$error":"#N/A"}}]
[{"$nulls":4},{"$f":"VLOOKUP(A104,Plan!$A$6:$V$123,3,TRUE)","v":{"$error":"#N/A"}},{"$f":"VLOOKUP(A104,Plan!$A$6:$V$123,7,TRUE)","v":{"$error":"#N/A"}},{"$f":"VLOOKUP(A104,Plan!$A$6:$V$123,8,TRUE)","v":{"$error":"#N/A"}},{"$f":"VLOOKUP(A104,Plan!$A$6:$V$123,9,TRUE)","v":{"$error":"#N/A"}},{"$f":"VLOOKUP(A104,Plan!$A$6:$V$123,10,TRUE)","v":{"$error":"#N/A"}},{"$f":"VLOOKUP(A104,Plan!$A$6:$V$123,11,TRUE)","v":{"$error":"#N/A"}},{"$f":"VLOOKUP(A104,Plan!$A$6:$V$123,12,TRUE)","v":{"$error":"#N/A"}},{"$f":"VLOOKUP(A104,Plan!$A$6:$V$123,13,TRUE)","v":{"$error":"#N/A"}},{"$f":"VLOOKUP(A104,Plan!$A$6:$V$123,14,TRUE)","v":{"$error":"#N/A"}},{"$f":"VLOOKUP(A104,Plan!$A$6:$V$123,15,TRUE)","v":{"$error":"#N/A"}},{"$f":"VLOOKUP(A104,Plan!$A$6:$V$123,16,TRUE)","v":{"$error":"#N/A"}},{"$f":"VLOOKUP(A104,Plan!$A$6:$V$123,17,TRUE)","v":{"$error":"#N/A"}},{"$f":"VLOOKUP(A104,Plan!$A$6:$V$123,18,TRUE)","v":{"$error":"#N/A"}},{"$f":"VLOOKUP(A104,Plan!$A$6:$V$123,19,TRUE)","v":{"$error":"#N/A"}},{"$f":"VLOOKUP(A104,Plan!$A$6:$V$123,20,TRUE)","v":{"$error":"#N/A"}},{"$f":"VLOOKUP(A104,Plan!$A$6:$V$123,21,TRUE)","v":{"$error":"#N/A"}}]
["280814","APPRENTI",null,null,{"$f":"VLOOKUP(A105,Plan!$A$6:$V$123,3,TRUE)","v":"35h00"},{"$f":"VLOOKUP(A105,Plan!$A$6:$V$123,7,TRUE)","v":"34h30"},{"$f":"VLOOKUP(A105,Plan!$A$6:$V$123,8,TRUE)","v":"FAL"},{"$f":"VLOOKUP(A105,Plan!$A$6:$V$123,9,TRUE)","v":0},{"$f":"VLOOKUP(A105,Plan!$A$6:$V$123,10,TRUE)","v":"FAL"},{"$f":"VLOOKUP(A105,Plan!$A$6:$V$123,11,TRUE)","v":0},{"$f":"VLOOKUP(A105,Plan!$A$6:$V$123,12,TRUE)","v":"FAL"},{"$f":"VLOOKUP(A105,Plan!$A$6:$V$123,13,TRUE)","v":0},{"$f":"VLOOKUP(A105,Plan!$A$6:$V$123,14,TRUE)","v":"FAL"},{"$f":"VLOOKUP(A105,Plan!$A$6:$V$123,15,TRUE)","v":0},{"$f":"VLOOKUP(A105,Plan!$A$6:$V$123,16,TRUE)","v":"FAL"},{"$f":"VLOOKUP(A105,Plan!$A$6:$V$123,17,TRUE)","v":0},{"$f":"VLOOKUP(A105,Plan!$A$6:$V$123,18,TRUE)","v":"R"},{"$f":"VLOOKUP(A105,Plan!$A$6:$V$123,19,TRUE)","v":0},{"$f":"VLOOKUP(A105,Plan!$A$6:$V$123,20,TRUE)","v":"R"},{"$f":"VLOOKUP(A105,Plan!$A$6:$V$123,21,TRUE)","v":0}]
["140109","APPRENTI",null,null,{"$f":"VLOOKUP(A106,Plan!$A$6:$V$123,3,TRUE)","v":"35h00"},{"$f":"VLOOKUP(A106,Plan!$A$6:$V$123,7,TRUE)","v":"35h00"},{"$f":"VLOOKUP(A106,Plan!$A$6:$V$123,8,TRUE)","v":"09h30-17h#"},{"$f":"VLOOKUP(A106,Plan!$A$6:$V$123,9,TRUE)","v":0},{"$f":"VLOOKUP(A106,Plan!$A$6:$V$123,10,TRUE)","v":"09h30-17h#"},{"$f":"VLOOKUP(A106,Plan!$A$6:$V$123,11,TRUE)","v":0},{"$f":"VLOOKUP(A106,Plan!$A$6:$V$123,12,TRUE)","v":"09h30-17h#"},{"$f":"VLOOKUP(A106,Plan!$A$6:$V$123,13,TRUE)","v":0},{"$f":"VLOOKUP(A106,Plan!$A$6:$V$123,14,TRUE)","v":"09h30-17h#"},{"$f":"VLOOKUP(A106,Plan!$A$6:$V$123,15,TRUE)","v":0},{"$f":"VLOOKUP(A106,Plan!$A$6:$V$123,16,TRUE)","v":"09h30-17h#"},{"$f":"VLOOKUP(A106,Plan!$A$6:$V$123,17,TRUE)","v":0},{"$f":"VLOOKUP(A106,Plan!$A$6:$V$123,18,TRUE)","v":"R"},{"$f":"VLOOKUP(A106,Plan!$A$6:$V$123,19,TRUE)","v":0},{"$f":"VLOOKUP(A106,Plan!$A$6:$V$123,20,TRUE)","v":"R"},{"$f":"VLOOKUP(A106,Plan!$A$6:$V$123,21,TRUE)","v":0}]
["260813","APPRENTI",null,null,{"$f":"VLOOKUP(A107,Plan!$A$6:$V$123,3,TRUE)","v":"35h00"},{"$f":"VLOOKUP(A107,Plan!$A$6:$V$123,7,TRUE)","v":"28h00"},{"$f":"VLOOKUP(A107,Plan!$A$6:$V$123,8,TRUE)","v":"R"},{"$f":"VLOOKUP(A107,Plan!$A$6:$V$123,9,TRUE)","v":0},{"$f":"VLOOKUP(A107,Plan!$A$6:$V$123,10,TRUE)","v":"NAJ"},{"$f":"VLOOKUP(A107,Plan!$A$6:$V$123,11,TRUE)","v":0},{"$f":"VLOOKUP(A107,Plan!$A$6:$V$123,12,TRUE)","v":0},{"$f":"VLOOKUP(A107,Plan!$A$6:$V$123,13,TRUE)","v":"18h30-02h#"},{"$f":"VLOOKUP(A107,Plan!$A$6:$V$123,14,TRUE)","v":0},{"$f":"VLOOKUP(A107,Plan!$A$6:$V$123,15,TRUE)","v":"18h30-02h#"},{"$f":"VLOOKUP(A107,Plan!$A$6:$V$123,16,TRUE)","v":0},{"$f":"VLOOKUP(A107,Plan!$A$6:$V$123,17,TRUE)","v":"18h30-02h#"},{"$f":"VLOOKUP(A107,Plan!$A$6:$V$123,18,TRUE)","v":0},{"$f":"VLOOKUP(A107,Plan!$A$6:$V$123,19,TRUE)","v":"18h30-02h#"},{"$f":"VLOOKUP(A107,Plan!$A$6:$V$123,20,TRUE)","v":"R"},{"$f":"VLOOKUP(A107,Plan!$A$6:$V$123,21,TRUE)","v":0}]
["143108","APPRENTI",null,null,{"$f":"VLOOKUP(A108,Plan!$A$6:$V$123,3,TRUE)","v":"35h00"},{"$f":"VLOOKUP(A108,Plan!$A$6:$V$123,7,TRUE)","v":"35h00"},{"$f":"VLOOKUP(A108,Plan!$A$6:$V$123,8,TRUE)","v":"R"},{"$f":"VLOOKUP(A108,Plan!$A$6:$V$123,9,TRUE)","v":0},{"$f":"VLOOKUP(A108,Plan!$A$6:$V$123,10,TRUE)","v":"09h30-17h#"},{"$f":"VLOOKUP(A108,Plan!$A$6:$V$123,11,TRUE)","v":0},{"$f":"VLOOKUP(A108,Plan!$A$6:$V$123,12,TRUE)","v":"09h30-17h#"},{"$f":"VLOOKUP(A108,Plan!$A$6:$V$123,13,TRUE)","v":0},{"$f":"VLOOKUP(A108,Plan!$A$6:$V$123,14,TRUE)","v":"09h30-17h#"},{"$f":"VLOOKUP(A108,Plan!$A$6:$V$123,15,TRUE)","v":0},{"$f":"VLOOKUP(A108,Plan!$A$6:$V$123,16,TRUE)","v":"09h30-17h#"},{"$f":"VLOOKUP(A108,Plan!$A$6:$V$123,17,TRUE)","v":0},{"$f":"VLOOKUP(A108,Plan!$A$6:$V$123,18,TRUE)","v":"09h30-17h#"},{"$f":"VLOOKUP(A108,Plan!$A$6:$V$123,19,TRUE)","v":0},{"$f":"VLOOKUP(A108,Plan!$A$6:$V$123,20,TRUE)","v":"R"},{"$f":"VLOOKUP(A108,Plan!$A$6:$V$123,21,TRUE)","v":0}]
["140409","APPRENTI",null,null,{"$f":"VLOOKUP(A109,Plan!$A$6:$V$123,3,TRUE)","v":"35h00"},{"$f":"VLOOKUP(A109,Plan!$A$6:$V$123,7,TRUE)","v":"35h00"},{"$f":"VLOOKUP(A109,Plan!$A$6:$V$123,8,TRUE)","v":"R"},{"$f":"VLOOKUP(A109,Plan!$A$6:$V$123,9,TRUE)","v":0},{"$f":"VLOOKUP(A109,Plan!$A$6:$V$123,10,TRUE)","v":0},{"$f":"VLOOKUP(A109,Plan!$A$6:$V$123,11,TRUE)","v":"18h30-02h#"},{"$f":"VLOOKUP(A109,Plan!$A$6:$V$123,12,TRUE)","v":0},{"$f":"VLOOKUP(A109,Plan!$A$6:$V$123,13,TRUE)","v":"18h30-02h#"},{"$f":"VLOOKUP(A109,Plan!$A$6:$V$123,14,TRUE)","v":0},{"$f":"VLOOKUP(A109,Plan!$A$6:$V$123,15,TRUE)","v":"18h30-02h#"},{"$f":"VLOOKUP(A109,Plan!$A$6:$V$123,16,TRUE)","v":0},{"$f":"VLOOKUP(A109,Plan!$A$6:$V$123,17,TRUE)","v":"18h30-02h#"},{"$f":"VLOOKUP(A109,Plan!$A$6:$V$123,18,TRUE)","v":0},{"$f":"VLOOKUP(A109,Plan!$A$6:$V$123,19,TRUE)","v":"18h30-02h#"},{"$f":"VLOOKUP(A109,Plan!$A$6:$V$123,20,TRUE)","v":"R"},{"$f":"VLOOKUP(A109,Plan!$A$6:$V$123,21,TRUE)","v":0}]
["141409","APPRENTI",null,null,{"$f":"VLOOKUP(A110,Plan!$A$6:$V$123,3,TRUE)","v":"35h00"},{"$f":"VLOOKUP(A110,Plan!$A$6:$V$123,7,TRUE)","v":"35h00"},{"$f":"VLOOKUP(A110,Plan!$A$6:$V$123,8,TRUE)","v":"R"},{"$f":"VLOOKUP(A110,Plan!$A$6:$V$123,9,TRUE)","v":0},{"$f":"VLOOKUP(A110,Plan!$A$6:$V$123,10,TRUE)","v":"08h30-16h#"},{"$f":"VLOOKUP(A110,Plan!$A$6:$V$123,11,TRUE)","v":0},{"$f":"VLOOKUP(A110,Plan!$A$6:$V$123,12,TRUE)","v":"08h30-16h#"},{"$f":"VLOOKUP(A110,Plan!$A$6:$V$123,13,TRUE)","v":0},{"$f":"VLOOKUP(A110,Plan!$A$6:$V$123,14,TRUE)","v":"08h30-16h#"},{"$f":"VLOOKUP(A110,Plan!$A$6:$V$123,15,TRUE)","v":0},{"$f":"VLOOKUP(A110,Plan!$A$6:$V$123,16,TRUE)","v":"08h30-16h#"},{"$f":"VLOOKUP(A110,Plan!$A$6:$V$123,17,TRUE)","v":0},{"$f":"VLOOKUP(A110,Plan!$A$6:$V$123,18,TRUE)","v":"08h30-16h#"},{"$f":"VLOOKUP(A110,Plan!$A$6:$V$123,19,TRUE)","v":0},{"$f":"VLOOKUP(A110,Plan!$A$6:$V$123,20,TRUE)","v":"R"},{"$f":"VLOOKUP(A110,Plan!$A$6:$V$123,21,TRUE)","v":0}]
["150789","APPRENTI",null,null,{"$f":"VLOOKUP(A111,Plan!$A$6:$V$123,3,TRUE)","v":"35h00"},{"$f":"VLOOKUP(A111,Plan!$A$6:$V$123,7,TRUE)","v":"35h00"},{"$f":"VLOOKUP(A111,Plan!$A$6:$V$123,8,TRUE)","v":"R"},{"$f":"VLOOKUP(A111,Plan!$A$6:$V$123,9,TRUE)","v":0},{"$f":"VLOOKUP(A111,Plan!$A$6:$V$123,10,TRUE)","v":0},{"$f":"VLOOKUP(A111,Plan!$A$6:$V$123,11,TRUE)","v":"16h30-24h#"},{"$f":"VLOOKUP(A111,Plan!$A$6:$V$123,12,TRUE)","v":0},{"$f":"VLOOKUP(A111,Plan!$A$6:$V$123,13,TRUE)","v":"16h30-24h#"},{"$f":"VLOOKUP(A111,Plan!$A$6:$V$123,14,TRUE)","v":0},{"$f":"VLOOKUP(A111,Plan!$A$6:$V$123,15,TRUE)","v":"16h30-24h#"},{"$f":"VLOOKUP(A111,Plan!$A$6:$V$123,16,TRUE)","v":0},{"$f":"VLOOKUP(A111,Plan!$A$6:$V$123,17,TRUE)","v":"16h30-24h#"},{"$f":"VLOOKUP(A111,Plan!$A$6:$V$123,18,TRUE)","v":0},{"$f":"VLOOKUP(A111,Plan!$A$6:$V$123,19,TRUE)","v":"16h30-24h#"},{"$f":"VLOOKUP(A111,Plan!$A$6:$V$123,20,TRUE)","v":"R"},{"$f":"VLOOKUP(A111,Plan!$A$6:$V$123,21,TRUE)","v":0}]
["211194","APPRENTI",null,null,{"$f":"VLOOKUP(A112,Plan!$A$6:$V$123,3,TRUE)","v":"35h00"},{"$f":"VLOOKUP(A112,Plan!$A$6:$V$123,7,TRUE)","v":"35h00"},{"$f":"VLOOKUP(A112,Plan!$A$6:$V$123,8,TRUE)","v":"06h30-14h#"},{"$f":"VLOOKUP(A112,Plan!$A$6:$V$123,9,TRUE)","v":0},{"$f":"VLOOKUP(A112,Plan!$A$6:$V$123,10,TRUE)","v":"06h30-14h#"},{"$f":"VLOOKUP(A112,Plan!$A$6:$V$123,11,TRUE)","v":0},{"$f":"VLOOKUP(A112,Plan!$A$6:$V$123,12,TRUE)","v":"06h30-14h#"},{"$f":"VLOOKUP(A112,Plan!$A$6:$V$123,13,TRUE)","v":0},{"$f":"VLOOKUP(A112,Plan!$A$6:$V$123,14,TRUE)","v":"06h30-14h#"},{"$f":"VLOOKUP(A112,Plan!$A$6:$V$123,15,TRUE)","v":0},{"$f":"VLOOKUP(A112,Plan!$A$6:$V$123,16,TRUE)","v":"06h30-14h#"},{"$f":"VLOOKUP(A112,Plan!$A$6:$V$123,17,TRUE)","v":0},{"$f":"VLOOKUP(A112,Plan!$A$6:$V$123,18,TRUE)","v":"R"},{"$f":"VLOOKUP(A112,Plan!$A$6:$V$123,19,TRUE)","v":0},{"$f":"VLOOKUP(A112,Plan!$A$6:$V$123,20,TRUE)","v":"R"},{"$f":"VLOOKUP(A112,Plan!$A$6:$V$123,21,TRUE)","v":0}]
["140831","APPRENTI",null,null,{"$f":"VLOOKUP(A113,Plan!$A$6:$V$123,3,TRUE)","v":"35h00"},{"$f":"VLOOKUP(A113,Plan!$A$6:$V$123,7,TRUE)","v":"35h00"},{"$f":"VLOOKUP(A113,Plan!$A$6:$V$123,8,TRUE)","v":"R"},{"$f":"VLOOKUP(A113,Plan!$A$6:$V$123,9,TRUE)","v":0},{"$f":"VLOOKUP(A113,Plan!$A$6:$V$123,10,TRUE)","v":"09h30-17h#"},{"$f":"VLOOKUP(A113,Plan!$A$6:$V$123,11,TRUE)","v":0},{"$f":"VLOOKUP(A113,Plan!$A$6:$V$123,12,TRUE)","v":"09h30-17h#"},{"$f":"VLOOKUP(A113,Plan!$A$6:$V$123,13,TRUE)","v":0},{"$f":"VLOOKUP(A113,Plan!$A$6:$V$123,14,TRUE)","v":"09h30-17h#"},{"$f":"VLOOKUP(A113,Plan!$A$6:$V$123,15,TRUE)","v":0},{"$f":"VLOOKUP(A113,Plan!$A$6:$V$123,16,TRUE)","v":"09h30-17h#"},{"$f":"VLOOKUP(A113,Plan!$A$6:$V$123,17,TRUE)","v":0},{"$f":"VLOOKUP(A113,Plan!$A$6:$V$123,18,TRUE)","v":"09h30-17h#"},{"$f":"VLOOKUP(A113,Plan!$A$6:$V$123,19,TRUE)","v":0},{"$f":"VLOOKUP(A113,Plan!$A$6:$V$123,20,TRUE)","v":"R"},{"$f":"VLOOKUP(A113,Plan!$A$6:$V$123,21,TRUE)","v":0}]
["260814","APPRENTI",null,null,{"$f":"VLOOKUP(A114,Plan!$A$6:$V$123,3,TRUE)","v":"35h00"},{"$f":"VLOOKUP(A114,Plan!$A$6:$V$123,7,TRUE)","v":"28h00"},{"$f":"VLOOKUP(A114,Plan!$A$6:$V$123,8,TRUE)","v":"R"},{"$f":"VLOOKUP(A114,Plan!$A$6:$V$123,9,TRUE)","v":0},{"$f":"VLOOKUP(A114,Plan!$A$6:$V$123,10,TRUE)","v":"NAJ"},{"$f":"VLOOKUP(A114,Plan!$A$6:$V$123,11,TRUE)","v":0},{"$f":"VLOOKUP(A114,Plan!$A$6:$V$123,12,TRUE)","v":0},{"$f":"VLOOKUP(A114,Plan!$A$6:$V$123,13,TRUE)","v":"18h30-02h#"},{"$f":"VLOOKUP(A114,Plan!$A$6:$V$123,14,TRUE)","v":0},{"$f":"VLOOKUP(A114,Plan!$A$6:$V$123,15,TRUE)","v":"18h30-02h#"},{"$f":"VLOOKUP(A114,Plan!$A$6:$V$123,16,TRUE)","v":0},{"$f":"VLOOKUP(A114,Plan!$A$6:$V$123,17,TRUE)","v":"18h30-02h#"},{"$f":"VLOOKUP(A114,Plan!$A$6:$V$123,18,TRUE)","v":0},{"$f":"VLOOKUP(A114,Plan!$A$6:$V$123,19,TRUE)","v":"18h30-02h#"},{"$f":"VLOOKUP(A114,Plan!$A$6:$V$123,20,TRUE)","v":"R"},{"$f":"VLOOKUP(A114,Plan!$A$6:$V$123,21,TRUE)","v":0}]
["020914","APPRENTI",null,null,{"$f":"VLOOKUP(A115,Plan!$A$6:$V$123,3,TRUE)","v":"35h00"},{"$f":"VLOOKUP(A115,Plan!$A$6:$V$123,7,TRUE)","v":"35h00"},{"$f":"VLOOKUP(A115,Plan!$A$6:$V$123,8,TRUE)","v":"R"},{"$f":"VLOOKUP(A115,Plan!$A$6:$V$123,9,TRUE)","v":0},{"$f":"VLOOKUP(A115,Plan!$A$6:$V$123,10,TRUE)","v":0},{"$f":"VLOOKUP(A115,Plan!$A$6:$V$123,11,TRUE)","v":"16h30-24h#"},{"$f":"VLOOKUP(A115,Plan!$A$6:$V$123,12,TRUE)","v":0},{"$f":"VLOOKUP(A115,Plan!$A$6:$V$123,13,TRUE)","v":"16h30-24h#"},{"$f":"VLOOKUP(A115,Plan!$A$6:$V$123,14,TRUE)","v":0},{"$f":"VLOOKUP(A115,Plan!$A$6:$V$123,15,TRUE)","v":"16h30-24h#"},{"$f":"VLOOKUP(A115,Plan!$A$6:$V$123,16,TRUE)","v":0},{"$f":"VLOOKUP(A115,Plan!$A$6:$V$123,17,TRUE)","v":"16h30-24h#"},{"$f":"VLOOKUP(A115,Plan!$A$6:$V$123,18,TRUE)","v":0},{"$f":"VLOOKUP(A115,Plan!$A$6:$V$123,19,TRUE)","v":"16h30-24h#"},{"$f":"VLOOKUP(A115,Plan!$A$6:$V$123,20,TRUE)","v":"R"},{"$f":"VLOOKUP(A115,Plan!$A$6:$V$123,21,TRUE)","v":0}]
["143008","APPRENTI",null,null,{"$f":"VLOOKUP(A116,Plan!$A$6:$V$123,3,TRUE)","v":"35h00"},{"$f":"VLOOKUP(A116,Plan!$A$6:$V$123,7,TRUE)","v":"35h00"},{"$f":"VLOOKUP(A116,Plan!$A$6:$V$123,8,TRUE)","v":"R"},{"$f":"VLOOKUP(A116,Plan!$A$6:$V$123,9,TRUE)","v":0},{"$f":"VLOOKUP(A116,Plan!$A$6:$V$123,10,TRUE)","v":0},{"$f":"VLOOKUP(A116,Plan!$A$6:$V$123,11,TRUE)","v":"18h30-02h#"},{"$f":"VLOOKUP(A116,Plan!$A$6:$V$123,12,TRUE)","v":0},{"$f":"VLOOKUP(A116,Plan!$A$6:$V$123,13,TRUE)","v":"18h30-02h#"},{"$f":"VLOOKUP(A116,Plan!$A$6:$V$123,14,TRUE)","v":0},{"$f":"VLOOKUP(A116,Plan!$A$6:$V$123,15,TRUE)","v":"18h30-02h#"},{"$f":"VLOOKUP(A116,Plan!$A$6:$V$123,16,TRUE)","v":0},{"$f":"VLOOKUP(A116,Plan!$A$6:$V$123,17,TRUE)","v":"18h30-02h#"},{"$f":"VLOOKUP(A116,Plan!$A$6:$V$123,18,TRUE)","v":0},{"$f":"VLOOKUP(A116,Plan!$A$6:$V$123,19,TRUE)","v":"18h30-02h#"},{"$f":"VLOOKUP(A116,Plan!$A$6:$V$123,20,TRUE)","v":"R"},{"$f":"VLOOKUP(A116,Plan!$A$6:$V$123,21,TRUE)","v":0}]
[{"$nulls":4},{"$f":"VLOOKUP(A117,Plan!$A$6:$V$123,3,TRUE)","v":{"$error":"#N/A"}},{"$f":"VLOOKUP(A117,Plan!$A$6:$V$123,7,TRUE)","v":{"$error":"#N/A"}},{"$f":"VLOOKUP(A117,Plan!$A$6:$V$123,8,TRUE)","v":{"$error":"#N/A"}},{"$f":"VLOOKUP(A117,Plan!$A$6:$V$123,9,TRUE)","v":{"$error":"#N/A"}},{"$f":"VLOOKUP(A117,Plan!$A$6:$V$123,10,TRUE)","v":{"$error":"#N/A"}},{"$f":"VLOOKUP(A117,Plan!$A$6:$V$123,11,TRUE)","v":{"$error":"#N/A"}},{"$f":"VLOOKUP(A117,Plan!$A$6:$V$123,12,TRUE)","v":{"$error":"#N/A"}},{"$f":"VLOOKUP(A117,Plan!$A$6:$V$123,13,TRUE)","v":{"$error":"#N/A"}},{"$f":"VLOOKUP(A117,Plan!$A$6:$V$123,14,TRUE)","v":{"$error":"#N/A"}},{"$f":"VLOOKUP(A117,Plan!$A$6:$V$123,15,TRUE)","v":{"$error":"#N/A"}},{"$f":"VLOOKUP(A117,Plan!$A$6:$V$123,16,TRUE)","v":{"$error":"#N/A"}},{"$f":"VLOOKUP(A117,Plan!$A$6:$V$123,17,TRUE)","v":{"$error":"#N/A"}},{"$f":"VLOOKUP(A117,Plan!$A$6:$V$123,18,TRUE)","v":{"$error":"#N/A"}},{"$f":"VLOOKUP(A117,Plan!$A$6:$V$123,19,TRUE)","v":{"$error":"#N/A"}},{"$f":"VLOOKUP(A117,Plan!$A$6:$V$123,20,TRUE)","v":{"$error":"#N/A"}},{"$f":"VLOOKUP(A117,Plan!$A$6:$V$123,21,TRUE)","v":{"$error":"#N/A"}}]
[{"$nulls":4},{"$f":"VLOOKUP(A118,Plan!$A$6:$V$123,3,TRUE)","v":{"$error":"#N/A"}},{"$f":"VLOOKUP(A118,Plan!$A$6:$V$123,7,TRUE)","v":{"$error":"#N/A"}},{"$f":"VLOOKUP(A118,Plan!$A$6:$V$123,8,TRUE)","v":{"$error":"#N/A"}},{"$f":"VLOOKUP(A118,Plan!$A$6:$V$123,9,TRUE)","v":{"$error":"#N/A"}},{"$f":"VLOOKUP(A118,Plan!$A$6:$V$123,10,TRUE)","v":{"$error":"#N/A"}},{"$f":"VLOOKUP(A118,Plan!$A$6:$V$123,11,TRUE)","v":{"$error":"#N/A"}},{"$f":"VLOOKUP(A118,Plan!$A$6:$V$123,12,TRUE)","v":{"$error":"#N/A"}},{"$f":"VLOOKUP(A118,Plan!$A$6:$V$123,13,TRUE)","v":{"$error":"#N/A"}},{"$f":"VLOOKUP(A118,Plan!$A$6:$V$123,14,TRUE)","v":{"$error":"#N/A"}},{"$f":"VLOOKUP(A118,Plan!$A$6:$V$123,15,TRUE)","v":{"$error":"#N/A"}},{"$f":"VLOOKUP(A118,Plan!$A$6:$V$123,16,TRUE)","v":{"$error":"#N/A"}},{"$f":"VLOOKUP(A118,Plan!$A$6:$V$123,17,TRUE)","v":{"$error":"#N/A"}},{"$f":"VLOOKUP(A118,Plan!$A$6:$V$123,18,TRUE)","v":{"$error":"#N/A"}},{"$f":"VLOOKUP(A118,Plan!$A$6:$V$123,19,TRUE)","v":{"$error":"#N/A"}},{"$f":"VLOOKUP(A118,Plan!$A$6:$V$123,20,TRUE)","v":{"$error":"#N/A"}},{"$f":"VLOOKUP(A118,Plan!$A$6:$V$123,21,TRUE)","v":{"$error":"#N/A"}}]
[{"$nulls":4},{"$f":"VLOOKUP(A119,Plan!$A$6:$V$123,3,TRUE)","v":{"$error":"#N/A"}},{"$f":"VLOOKUP(A119,Plan!$A$6:$V$123,7,TRUE)","v":{"$error":"#N/A"}},{"$f":"VLOOKUP(A119,Plan!$A$6:$V$123,8,TRUE)","v":{"$error":"#N/A"}},{"$f":"VLOOKUP(A119,Plan!$A$6:$V$123,9,TRUE)","v":{"$error":"#N/A"}},{"$f":"VLOOKUP(A119,Plan!$A$6:$V$123,10,TRUE)","v":{"$error":"#N/A"}},{"$f":"VLOOKUP(A119,Plan!$A$6:$V$123,11,TRUE)","v":{"$error":"#N/A"}},{"$f":"VLOOKUP(A119,Plan!$A$6:$V$123,12,TRUE)","v":{"$error":"#N/A"}},{"$f":"VLOOKUP(A119,Plan!$A$6:$V$123,13,TRUE)","v":{"$error":"#N/A"}},{"$f":"VLOOKUP(A119,Plan!$A$6:$V$123,14,TRUE)","v":{"$error":"#N/A"}},{"$f":"VLOOKUP(A119,Plan!$A$6:$V$123,15,TRUE)","v":{"$error":"#N/A"}},{"$f":"VLOOKUP(A119,Plan!$A$6:$V$123,16,TRUE)","v":{"$error":"#N/A"}},{"$f":"VLOOKUP(A119,Plan!$A$6:$V$123,17,TRUE)","v":{"$error":"#N/A"}},{"$f":"VLOOKUP(A119,Plan!$A$6:$V$123,18,TRUE)","v":{"$error":"#N/A"}},{"$f":"VLOOKUP(A119,Plan!$A$6:$V$123,19,TRUE)","v":{"$error":"#N/A"}},{"$f":"VLOOKUP(A119,Plan!$A$6:$V$123,20,TRUE)","v":{"$error":"#N/A"}},{"$f":"VLOOKUP(A119,Plan!$A$6:$V$123,21,TRUE)","v":{"$error":"#N/A"}}]
[{"$nulls":4},{"$f":"VLOOKUP(A120,Plan!$A$6:$V$123,3,TRUE)","v":{"$error":"#N/A"}},{"$f":"VLOOKUP(A120,Plan!$A$6:$V$123,7,TRUE)","v":{"$error":"#N/A"}},{"$f":"VLOOKUP(A120,Plan!$A$6:$V$123,8,TRUE)","v":{"$error":"#N/A"}},{"$f":"VLOOKUP(A120,Plan!$A$6:$V$123,9,TRUE)","v":{"$error":"#N/A"}},{"$f":"VLOOKUP(A120,Plan!$A$6:$V$123,10,TRUE)","v":{"$error":"#N/A"}},{"$f":"VLOOKUP(A120,Plan!$A$6:$V$123,11,TRUE)","v":{"$error":"#N/A"}},{"$f":"VLOOKUP(A120,Plan!$A$6:$V$123,12,TRUE)","v":{"$error":"#N/A"}},{"$f":"VLOOKUP(A120,Plan!$A$6:$V$123,13,TRUE)","v":{"$error":"#N/A"}},{"$f":"VLOOKUP(A120,Plan!$A$6:$V$123,14,TRUE)","v":{"$error":"#N/A"}},{"$f":"VLOOKUP(A120,Plan!$A$6:$V$123,15,TRUE)","v":{"$error":"#N/A"}},{"$f":"VLOOKUP(A120,Plan!$A$6:$V$123,16,TRUE)","v":{"$error":"#N/A"}},{"$f":"VLOOKUP(A120,Plan!$A$6:$V$123,17,TRUE)","v":{"$error":"#N/A"}},{"$f":"VLOOKUP(A120,Plan!$A$6:$V$123,18,TRUE)","v":{"$error":"#N/A"}},{"$f":"VLOOKUP(A120,Plan!$A$6:$V$123,19,TRUE)","v":{"$error":"#N/A"}},{"$f":"VLOOKUP(A120,Plan!$A$6:$V$123,20,TRUE)","v":{"$error":"#N/A"}},{"$f":"VLOOKUP(A120,Plan!$A$6:$V$123,21,TRUE)","v":{"$error":"#N/A"}}]
[{"$nulls":4},{"$f":"VLOOKUP(A121,Plan!$A$6:$V$123,3,TRUE)","v":{"$error":"#N/A"}},{"$f":"VLOOKUP(A121,Plan!$A$6:$V$123,7,TRUE)","v":{"$error":"#N/A"}},{"$f":"VLOOKUP(A121,Plan!$A$6:$V$123,8,TRUE)","v":{"$error":"#N/A"}},{"$f":"VLOOKUP(A121,Plan!$A$6:$V$123,9,TRUE)","v":{"$error":"#N/A"}},{"$f":"VLOOKUP(A121,Plan!$A$6:$V$123,10,TRUE)","v":{"$error":"#N/A"}},{"$f":"VLOOKUP(A121,Plan!$A$6:$V$123,11,TRUE)","v":{"$error":"#N/A"}},{"$f":"VLOOKUP(A121,Plan!$A$6:$V$123,12,TRUE)","v":{"$error":"#N/A"}},{"$f":"VLOOKUP(A121,Plan!$A$6:$V$123,13,TRUE)","v":{"$error":"#N/A"}},{"$f":"VLOOKUP(A121,Plan!$A$6:$V$123,14,TRUE)","v":{"$error":"#N/A"}},{"$f":"VLOOKUP(A121,Plan!$A$6:$V$123,15,TRUE)","v":{"$error":"#N/A"}},{"$f":"VLOOKUP(A121,Plan!$A$6:$V$123,16,TRUE)","v":{"$error":"#N/A"}},{"$f":"VLOOKUP(A121,Plan!$A$6:$V$123,17,TRUE)","v":{"$error":"#N/A"}},{"$f":"VLOOKUP(A121,Plan!$A$6:$V$123,18,TRUE)","v":{"$error":"#N/A"}},{"$f":"VLOOKUP(A121,Plan!$A$6:$V$123,19,TRUE)","v":{"$error":"#N/A"}},{"$f":"VLOOKUP(A121,Plan!$A$6:$V$123,20,TRUE)","v":{"$error":"#N/A"}},{"$f":"VLOOKUP(A121,Plan!$A$6:$V$123,21,TRUE)","v":{"$error":"#N/A"}}]
[{"$nulls":4},{"$f":"VLOOKUP(A122,Plan!$A$6:$V$123,3,TRUE)","v":{"$error":"#N/A"}},{"$f":"VLOOKUP(A122,Plan!$A$6:$V$123,7,TRUE)","v":{"$error":"#N/A"}},{"$f":"VLOOKUP(A122,Plan!$A$6:$V$123,8,TRUE)","v":{"$error":"#N/A"}},{"$f":"VLOOKUP(A122,Plan!$A$6:$V$123,9,TRUE)","v":{"$error":"#N/A"}},{"$f":"VLOOKUP(A122,Plan!$A$6:$V$123,10,TRUE)","v":{"$error":"#N/A"}},{"$f":"VLOOKUP(A122,Plan!$A$6:$V$123,11,TRUE)","v":{"$error":"#N/A"}},{"$f":"VLOOKUP(A122,Plan!$A$6:$V$123,12,TRUE)","v":{"$error":"#N/A"}},{"$f":"VLOOKUP(A122,Plan!$A$6:$V$123,13,TRUE)","v":{"$error":"#N/A"}},{"$f":"VLOOKUP(A122,Plan!$A$6:$V$123,14,TRUE)","v":{"$error":"#N/A"}},{"$f":"VLOOKUP(A122,Plan!$A$6:$V$123,15,TRUE)","v":{"$error":"#N/A"}},{"$f":"VLOOKUP(A122,Plan!$A$6:$V$123,16,TRUE)","v":{"$error":"#N/A"}},{"$f":"VLOOKUP(A122,Plan!$A$6:$V$123,17,TRUE)","v":{"$error":"#N/A"}},{"$f":"VLOOKUP(A122,Plan!$A$6:$V$123,18,TRUE)","v":{"$error":"#N/A"}},{"$f":"VLOOKUP(A122,Plan!$A$6:$V$123,19,TRUE)","v":{"$error":"#N/A"}},{"$f":"VLOOKUP(A122,Plan!$A$6:$V$123,20,TRUE)","v":{"$error":"#N/A"}},{"$f":"VLOOKUP(A122,Plan!$A$6:$V$123,21,TRUE)","v":{"$error":"#N/A"}}]
[{"$nulls":4},{"$f":"VLOOKUP(A123,Plan!$A$6:$V$123,3,TRUE)","v":{"$error":"#N/A"}},{"$f":"VLOOKUP(A123,Plan!$A$6:$V$123,7,TRUE)","v":{"$error":"#N/A"}},{"$f":"VLOOKUP(A123,Plan!$A$6:$V$123,8,TRUE)","v":{"$error":"#N/A"}},{"$f":"VLOOKUP(A123,Plan!$A$6:$V$123,9,TRUE)","v":{"$error":"#N/A"}},{"$f":"VLOOKUP(A123,Plan!$A$6:$V$123,10,TRUE)","v":{"$error":"#N/A"}},{"$f":"VLOOKUP(A123,Plan!$A$6:$V$123,11,TRUE)","v":{"$error":"#N/A"}},{"$f":"VLOOKUP(A123,Plan!$A$6:$V$123,12,TRUE)","v":{"$error":"#N/A"}},{"$f":"VLOOKUP(A123,Plan!$A$6:$V$123,13,TRUE)","v":{"$error":"#N/A"}},{"$f":"VLOOKUP(A123,Plan!$A$6:$V$123,14,TRUE)","v":{"$error":"#N/A"}},{"$f":"VLOOKUP(A123,Plan!$A$6:$V$123,15,TRUE)","v":{"$error":"#N/A"}},{"$f":"VLOOKUP(A123,Plan!$A$6:$V$123,16,TRUE)","v":{"$error":"#N/A"}},{"$f":"VLOOKUP(A123,Plan!$A$6:$V$123,17,TRUE)","v":{"$error":"#N/A"}},{"$f":"VLOOKUP(A123,Plan!$A$6:$V$123,18,TRUE)","v":{"$error":"#N/A"}},{"$f":"VLOOKUP(A123,Plan!$A$6:$V$123,19,TRUE)","v":{"$error":"#N/A"}},{"$f":"VLOOKUP(A123,Plan!$A$6:$V$123,20,TRUE)","v":{"$error":"#N/A"}},{"$f":"VLOOKUP(A123,Plan!$A$6:$V$123,21,TRUE)","v":{"$error":"#N/A"}}]
[{"$nulls":4},{"$f":"VLOOKUP(A124,Plan!$A$6:$V$123,3,TRUE)","v":{"$error":"#N/A"}},{"$f":"VLOOKUP(A124,Plan!$A$6:$V$123,7,TRUE)","v":{"$error":"#N/A"}},{"$f":"VLOOKUP(A124,Plan!$A$6:$V$123,8,TRUE)","v":{"$error":"#N/A"}},{"$f":"VLOOKUP(A124,Plan!$A$6:$V$123,9,TRUE)","v":{"$error":"#N/A"}},{"$f":"VLOOKUP(A124,Plan!$A$6:$V$123,10,TRUE)","v":{"$error":"#N/A"}},{"$f":"VLOOKUP(A124,Plan!$A$6:$V$123,11,TRUE)","v":{"$error":"#N/A"}},{"$f":"VLOOKUP(A124,Plan!$A$6:$V$123,12,TRUE)","v":{"$error":"#N/A"}},{"$f":"VLOOKUP(A124,Plan!$A$6:$V$123,13,TRUE)","v":{"$error":"#N/A"}},{"$f":"VLOOKUP(A124,Plan!$A$6:$V$123,14,TRUE)","v":{"$error":"#N/A"}},{"$f":"VLOOKUP(A124,Plan!$A$6:$V$123,15,TRUE)","v":{"$error":"#N/A"}},{"$f":"VLOOKUP(A124,Plan!$A$6:$V$123,16,TRUE)","v":{"$error":"#N/A"}},{"$f":"VLOOKUP(A124,Plan!$A$6:$V$123,17,TRUE)","v":{"$error":"#N/A"}},{"$f":"VLOOKUP(A124,Plan!$A$6:$V$123,18,TRUE)","v":{"$error":"#N/A"}},{"$f":"VLOOKUP(A124,Plan!$A$6:$V$123,19,TRUE)","v":{"$error":"#N/A"}},{"$f":"VLOOKUP(A124,Plan!$A$6:$V$123,20,TRUE)","v":{"$error":"#N/A"}},{"$f":"VLOOKUP(A124,Plan!$A$6:$V$123,21,TRUE)","v":{"$error":"#N/A"}}]
[{"$nulls":4},{"$f":"VLOOKUP(A125,Plan!$A$6:$V$123,3,TRUE)","v":{"$error":"#N/A"}},{"$f":"VLOOKUP(A125,Plan!$A$6:$V$123,7,TRUE)","v":{"$error":"#N/A"}},{"$f":"VLOOKUP(A125,Plan!$A$6:$V$123,8,TRUE)","v":{"$error":"#N/A"}},{"$f":"VLOOKUP(A125,Plan!$A$6:$V$123,9,TRUE)","v":{"$error":"#N/A"}},{"$f":"VLOOKUP(A125,Plan!$A$6:$V$123,10,TRUE)","v":{"$error":"#N/A"}},{"$f":"VLOOKUP(A125,Plan!$A$6:$V$123,11,TRUE)","v":{"$error":"#N/A"}},{"$f":"VLOOKUP(A125,Plan!$A$6:$V$123,12,TRUE)","v":{"$error":"#N/A"}},{"$f":"VLOOKUP(A125,Plan!$A$6:$V$123,13,TRUE)","v":{"$error":"#N/A"}},{"$f":"VLOOKUP(A125,Plan!$A$6:$V$123,14,TRUE)","v":{"$error":"#N/A"}},{"$f":"VLOOKUP(A125,Plan!$A$6:$V$123,15,TRUE)","v":{"$error":"#N/A"}},{"$f":"VLOOKUP(A125,Plan!$A$6:$V$123,16,TRUE)","v":{"$error":"#N/A"}},{"$f":"VLOOKUP(A125,Plan!$A$6:$V$123,17,TRUE)","v":{"$error":"#N/A"}},{"$f":"VLOOKUP(A125,Plan!$A$6:$V$123,18,TRUE)","v":{"$error":"#N/A"}},{"$f":"VLOOKUP(A125,Plan!$A$6:$V$123,19,TRUE)","v":{"$error":"#N/A"}},{"$f":"VLOOKUP(A125,Plan!$A$6:$V$123,20,TRUE)","v":{"$error":"#N/A"}},{"$f":"VLOOKUP(A125,Plan!$A$6:$V$123,21,TRUE)","v":{"$error":"#N/A"}}]
[{"$nulls":4},{"$f":"VLOOKUP(A126,Plan!$A$6:$V$123,3,TRUE)","v":{"$error":"#N/A"}},{"$f":"VLOOKUP(A126,Plan!$A$6:$V$123,7,TRUE)","v":{"$error":"#N/A"}},{"$f":"VLOOKUP(A126,Plan!$A$6:$V$123,8,TRUE)","v":{"$error":"#N/A"}},{"$f":"VLOOKUP(A126,Plan!$A$6:$V$123,9,TRUE)","v":{"$error":"#N/A"}},{"$f":"VLOOKUP(A126,Plan!$A$6:$V$123,10,TRUE)","v":{"$error":"#N/A"}},{"$f":"VLOOKUP(A126,Plan!$A$6:$V$123,11,TRUE)","v":{"$error":"#N/A"}},{"$f":"VLOOKUP(A126,Plan!$A$6:$V$123,12,TRUE)","v":{"$error":"#N/A"}},{"$f":"VLOOKUP(A126,Plan!$A$6:$V$123,13,TRUE)","v":{"$error":"#N/A"}},{"$f":"VLOOKUP(A126,Plan!$A$6:$V$123,14,TRUE)","v":{"$error":"#N/A"}},{"$f":"VLOOKUP(A126,Plan!$A$6:$V$123,15,TRUE)","v":{"$error":"#N/A"}},{"$f":"VLOOKUP(A126,Plan!$A$6:$V$123,16,TRUE)","v":{"$error":"#N/A"}},{"$f":"VLOOKUP(A126,Plan!$A$6:$V$123,17,TRUE)","v":{"$error":"#N/A"}},{"$f":"VLOOKUP(A126,Plan!$A$6:$V$123,18,TRUE)","v":{"$error":"#N/A"}},{"$f":"VLOOKUP(A126,Plan!$A$6:$V$123,19,TRUE)","v":{"$error":"#N/A"}},{"$f":"VLOOKUP(A126,Plan!$A$6:$V$123,20,TRUE)","v":{"$error":"#N/A"}},{"$f":"VLOOKUP(A126,Plan!$A$6:$V$123,21,TRUE)","v":{"$error":"#N/A"}}]
[{"$nulls":4},{"$f":"VLOOKUP(A127,Plan!$A$6:$V$123,3,TRUE)","v":{"$error":"#N/A"}},{"$f":"VLOOKUP(A127,Plan!$A$6:$V$123,7,TRUE)","v":{"$error":"#N/A"}},{"$f":"VLOOKUP(A127,Plan!$A$6:$V$123,8,TRUE)","v":{"$error":"#N/A"}},{"$f":"VLOOKUP(A127,Plan!$A$6:$V$123,9,TRUE)","v":{"$error":"#N/A"}},{"$f":"VLOOKUP(A127,Plan!$A$6:$V$123,10,TRUE)","v":{"$error":"#N/A"}},{"$f":"VLOOKUP(A127,Plan!$A$6:$V$123,11,TRUE)","v":{"$error":"#N/A"}},{"$f":"VLOOKUP(A127,Plan!$A$6:$V$123,12,TRUE)","v":{"$error":"#N/A"}},{"$f":"VLOOKUP(A127,Plan!$A$6:$V$123,13,TRUE)","v":{"$error":"#N/A"}},{"$f":"VLOOKUP(A127,Plan!$A$6:$V$123,14,TRUE)","v":{"$error":"#N/A"}},{"$f":"VLOOKUP(A127,Plan!$A$6:$V$123,15,TRUE)","v":{"$error":"#N/A"}},{"$f":"VLOOKUP(A127,Plan!$A$6:$V$123,16,TRUE)","v":{"$error":"#N/A"}},{"$f":"VLOOKUP(A127,Plan!$A$6:$V$123,17,TRUE)","v":{"$error":"#N/A"}},{"$f":"VLOOKUP(A127,Plan!$A$6:$V$123,18,TRUE)","v":{"$error":"#N/A"}},{"$f":"VLOOKUP(A127,Plan!$A$6:$V$123,19,TRUE)","v":{"$error":"#N/A"}},{"$f":"VLOOKUP(A127,Plan!$A$6:$V$123,20,TRUE)","v":{"$error":"#N/A"}},{"$f":"VLOOKUP(A127,Plan!$A$6:$V$123,21,TRUE)","v":{"$error":"#N/A"}}]
["411053","COMMIS",null,null,{"$f":"VLOOKUP(A128,Plan!$A$6:$V$123,3,TRUE)","v":"39h00"},{"$f":"VLOOKUP(A128,Plan!$A$6:$V$123,7,TRUE)","v":"00h00"},{"$f":"VLOOKUP(A128,Plan!$A$6:$V$123,8,TRUE)","v":"CIF"},{"$f":"VLOOKUP(A128,Plan!$A$6:$V$123,9,TRUE)","v":0},{"$f":"VLOOKUP(A128,Plan!$A$6:$V$123,10,TRUE)","v":"CIF"},{"$f":"VLOOKUP(A128,Plan!$A$6:$V$123,11,TRUE)","v":0},{"$f":"VLOOKUP(A128,Plan!$A$6:$V$123,12,TRUE)","v":"CIF"},{"$f":"VLOOKUP(A128,Plan!$A$6:$V$123,13,TRUE)","v":0},{"$f":"VLOOKUP(A128,Plan!$A$6:$V$123,14,TRUE)","v":"CIF"},{"$f":"VLOOKUP(A128,Plan!$A$6:$V$123,15,TRUE)","v":0},{"$f":"VLOOKUP(A128,Plan!$A$6:$V$123,16,TRUE)","v":"CIF"},{"$f":"VLOOKUP(A128,Plan!$A$6:$V$123,17,TRUE)","v":0},{"$f":"VLOOKUP(A128,Plan!$A$6:$V$123,18,TRUE)","v":"R"},{"$f":"VLOOKUP(A128,Plan!$A$6:$V$123,19,TRUE)","v":0},{"$f":"VLOOKUP(A128,Plan!$A$6:$V$123,20,TRUE)","v":"R"},{"$f":"VLOOKUP(A128,Plan!$A$6:$V$123,21,TRUE)","v":0}]
["241014","COMMIS",null,null,{"$f":"VLOOKUP(A129,Plan!$A$6:$V$123,3,TRUE)","v":"35h00"},{"$f":"VLOOKUP(A129,Plan!$A$6:$V$123,7,TRUE)","v":"35h00"},{"$f":"VLOOKUP(A129,Plan!$A$6:$V$123,8,TRUE)","v":"12h-15h#"},{"$f":"VLOOKUP(A129,Plan!$A$6:$V$123,9,TRUE)","v":"19h-23h30#"},{"$f":"VLOOKUP(A129,Plan!$A$6:$V$123,10,TRUE)","v":"12h-15h#"},{"$f":"VLOOKUP(A129,Plan!$A$6:$V$123,11,TRUE)","v":"19h-24h#"},{"$f":"VLOOKUP(A129,Plan!$A$6:$V$123,12,TRUE)","v":"R"},{"$f":"VLOOKUP(A129,Plan!$A$6:$V$123,13,TRUE)","v":0},{"$f":"VLOOKUP(A129,Plan!$A$6:$V$123,14,TRUE)","v":"R"},{"$f":"VLOOKUP(A129,Plan!$A$6:$V$123,15,TRUE)","v":0},{"$f":"VLOOKUP(A129,Plan!$A$6:$V$123,16,TRUE)","v":"12h-15h#"},{"$f":"VLOOKUP(A129,Plan!$A$6:$V$123,17,TRUE)","v":"19h-24h30#"},{"$f":"VLOOKUP(A129,Plan!$A$6:$V$123,18,TRUE)","v":"12h-15h#"},{"$f":"VLOOKUP(A129,Plan!$A$6:$V$123,19,TRUE)","v":"19h-24h#"},{"$f":"VLOOKUP(A129,Plan!$A$6:$V$123,20,TRUE)","v":"12h-19h30#"},{"$f":"VLOOKUP(A129,Plan!$A$6:$V$123,21,TRUE)","v":0}]
["140315","COMMIS",null,null,{"$f":"VLOOKUP(A130,Plan!$A$6:$V$123,3,TRUE)","v":"35h00"},{"$f":"VLOOKUP(A130,Plan!$A$6:$V$123,7,TRUE)","v":"35h00"},{"$f":"VLOOKUP(A130,Plan!$A$6:$V$123,8,TRUE)","v":"09h-16h30#"},{"$f":"VLOOKUP(A130,Plan!$A$6:$V$123,9,TRUE)","v":0},{"$f":"VLOOKUP(A130,Plan!$A$6:$V$123,10,TRUE)","v":"09h-16h30#"},{"$f":"VLOOKUP(A130,Plan!$A$6:$V$123,11,TRUE)","v":0},{"$f":"VLOOKUP(A130,Plan!$A$6:$V$123,12,TRUE)","v":"R"},{"$f":"VLOOKUP(A130,Plan!$A$6:$V$123,13,TRUE)","v":0},{"$f":"VLOOKUP(A130,Plan!$A$6:$V$123,14,TRUE)","v":"R"},{"$f":"VLOOKUP(A130,Plan!$A$6:$V$123,15,TRUE)","v":0},{"$f":"VLOOKUP(A130,Plan!$A$6:$V$123,16,TRUE)","v":"11h45-15h#"},{"$f":"VLOOKUP(A130,Plan!$A$6:$V$123,17,TRUE)","v":"18h30-23h15#"},{"$f":"VLOOKUP(A130,Plan!$A$6:$V$123,18,TRUE)","v":"11h45-15h#"},{"$f":"VLOOKUP(A130,Plan!$A$6:$V$123,19,TRUE)","v":"18h30-23h15#"},{"$f":"VLOOKUP(A130,Plan!$A$6:$V$123,20,TRUE)","v":"11h30-19h#"},{"$f":"VLOOKUP(A130,Plan!$A$6:$V$123,21,TRUE)","v":0}]
["290314","COMMIS",null,null,{"$f":"VLOOKUP(A131,Plan!$A$6:$V$123,3,TRUE)","v":"35h00"},{"$f":"VLOOKUP(A131,Plan!$A$6:$V$123,7,TRUE)","v":"20h00"},{"$f":"VLOOKUP(A131,Plan!$A$6:$V$123,8,TRUE)","v":"R"},{"$f":"VLOOKUP(A131,Plan!$A$6:$V$123,9,TRUE)","v":0},{"$f":"VLOOKUP(A131,Plan!$A$6:$V$123,10,TRUE)","v":"R"},{"$f":"VLOOKUP(A131,Plan!$A$6:$V$123,11,TRUE)","v":0},{"$f":"VLOOKUP(A131,Plan!$A$6:$V$123,12,TRUE)","v":"CP"},{"$f":"VLOOKUP(A131,Plan!$A$6:$V$123,13,TRUE)","v":0},{"$f":"VLOOKUP(A131,Plan!$A$6:$V$123,14,TRUE)","v":"CP"},{"$f":"VLOOKUP(A131,Plan!$A$6:$V$123,15,TRUE)","v":0},{"$f":"VLOOKUP(A131,Plan!$A$6:$V$123,16,TRUE)","v":0},{"$f":"VLOOKUP(A131,Plan!$A$6:$V$123,17,TRUE)","v":"18h-02h#"},{"$f":"VLOOKUP(A131,Plan!$A$6:$V$123,18,TRUE)","v":0},{"$f":"VLOOKUP(A131,Plan!$A$6:$V$123,19,TRUE)","v":"18h-02h#"},{"$f":"VLOOKUP(A131,Plan!$A$6:$V$123,20,TRUE)","v":0},{"$f":"VLOOKUP(A131,Plan!$A$6:$V$123,21,TRUE)","v":"18h-23h30#"}]
["141206","COMMIS",null,null,{"$f":"VLOOKUP(A132,Plan!$A$6:$V$123,3,TRUE)","v":"25h00"},{"$f":"VLOOKUP(A132,Plan!$A$6:$V$123,7,TRUE)","v":"24h45"},{"$f":"VLOOKUP(A132,Plan!$A$6:$V$123,8,TRUE)","v":"12h-15h30#"},{"$f":"VLOOKUP(A132,Plan!$A$6:$V$123,9,TRUE)","v":"18h45-21h45#"},{"$f":"VLOOKUP(A132,Plan!$A$6:$V$123,10,TRUE)","v":"12h-15h30#"},{"$f":"VLOOKUP(A132,Plan!$A$6:$V$123,11,TRUE)","v":"18h45-21h45#"},{"$f":"VLOOKUP(A132,Plan!$A$6:$V$123,12,TRUE)","v":"12h-15h30#"},{"$f":"VLOOKUP(A132,Plan!$A$6:$V$123,13,TRUE)","v":"18h45-21h45#"},{"$f":"VLOOKUP(A132,Plan!$A$6:$V$123,14,TRUE)","v":"R"},{"$f":"VLOOKUP(A132,Plan!$A$6:$V$123,15,TRUE)","v":0},{"$f":"VLOOKUP(A132,Plan!$A$6:$V$123,16,TRUE)","v":"R"},{"$f":"VLOOKUP(A132,Plan!$A$6:$V$123,17,TRUE)","v":0},{"$f":"VLOOKUP(A132,Plan!$A$6:$V$123,18,TRUE)","v":0},{"$f":"VLOOKUP(A132,Plan!$A$6:$V$123,19,TRUE)","v":"18h15-21h45#"},{"$f":"VLOOKUP(A132,Plan!$A$6:$V$123,20,TRUE)","v":"12h15-15h30#"},{"$f":"VLOOKUP(A132,Plan!$A$6:$V$123,21,TRUE)","v":"18h45-21h45#"}]
["141220","COMMIS",null,null,{"$f":"VLOOKUP(A133,Plan!$A$6:$V$123,3,TRUE)","v":"15h00"},{"$f":"VLOOKUP(A133,Plan!$A$6:$V$123,7,TRUE)","v":"15h00"},{"$f":"VLOOKUP(A133,Plan!$A$6:$V$123,8,TRUE)","v":"R"},{"$f":"VLOOKUP(A133,Plan!$A$6:$V$123,9,TRUE)","v":0},{"$f":"VLOOKUP(A133,Plan!$A$6:$V$123,10,TRUE)","v":"R"},{"$f":"VLOOKUP(A133,Plan!$A$6:$V$123,11,TRUE)","v":0},{"$f":"VLOOKUP(A133,Plan!$A$6:$V$123,12,TRUE)","v":"R"},{"$f":"VLOOKUP(A133,Plan!$A$6:$V$123,13,TRUE)","v":0},{"$f":"VLOOKUP(A133,Plan!$A$6:$V$123,14,TRUE)","v":"R"},{"$f":"VLOOKUP(A133,Plan!$A$6:$V$123,15,TRUE)","v":0},{"$f":"VLOOKUP(A133,Plan!$A$6:$V$123,16,TRUE)","v":0},{"$f":"VLOOKUP(A133,Plan!$A$6:$V$123,17,TRUE)","v":"17h-22h30#"},{"$f":"VLOOKUP(A133,Plan!$A$6:$V$123,18,TRUE)","v":"11h30-18h#"},{"$f":"VLOOKUP(A133,Plan!$A$6:$V$123,19,TRUE)","v":"18h-22h30#"},{"$f":"VLOOKUP(A133,Plan!$A$6:$V$123,20,TRUE)","v":0},{"$f":"VLOOKUP(A133,Plan!$A$6:$V$123,21,TRUE)","v":0}]
["141025","COMMIS",null,null,{"$f":"VLOOKUP(A134,Plan!$A$6:$V$123,3,TRUE)","v":"15h00"},{"$f":"VLOOKUP(A134,Plan!$A$6:$V$123,7,TRUE)","v":"15h00"},{"$f":"VLOOKUP(A134,Plan!$A$6:$V$123,8,TRUE)","v":"R"},{"$f":"VLOOKUP(A134,Plan!$A$6:$V$123,9,TRUE)","v":0},{"$f":"VLOOKUP(A134,Plan!$A$6:$V$123,10,TRUE)","v":"R"},{"$f":"VLOOKUP(A134,Plan!$A$6:$V$123,11,TRUE)","v":0},{"$f":"VLOOKUP(A134,Plan!$A$6:$V$123,12,TRUE)","v":"R"},{"$f":"VLOOKUP(A134,Plan!$A$6:$V$123,13,TRUE)","v":0},{"$f":"VLOOKUP(A134,Plan!$A$6:$V$123,14,TRUE)","v":"R"},{"$f":"VLOOKUP(A134,Plan!$A$6:$V$123,15,TRUE)","v":0},{"$f":"VLOOKUP(A134,Plan!$A$6:$V$123,16,TRUE)","v":0},{"$f":"VLOOKUP(A134,Plan!$A$6:$V$123,17,TRUE)","v":"17h30-01h#"},{"$f":"VLOOKUP(A134,Plan!$A$6:$V$123,18,TRUE)","v":0},{"$f":"VLOOKUP(A134,Plan!$A$6:$V$123,19,TRUE)","v":"16h30-01h#"},{"$f":"VLOOKUP(A134,Plan!$A$6:$V$123,20,TRUE)","v":"R"},{"$f":"VLOOKUP(A134,Plan!$A$6:$V$123,21,TRUE)","v":0}]
[{"$nulls":4},{"$f":"VLOOKUP(A135,Plan!$A$6:$V$123,3,TRUE)","v":{"$error":"#N/A"}},{"$f":"VLOOKUP(A135,Plan!$A$6:$V$123,7,TRUE)","v":{"$error":"#N/A"}},{"$f":"VLOOKUP(A135,Plan!$A$6:$V$123,8,TRUE)","v":{"$error":"#N/A"}},{"$f":"VLOOKUP(A135,Plan!$A$6:$V$123,9,TRUE)","v":{"$error":"#N/A"}},{"$f":"VLOOKUP(A135,Plan!$A$6:$V$123,10,TRUE)","v":{"$error":"#N/A"}},{"$f":"VLOOKUP(A135,Plan!$A$6:$V$123,11,TRUE)","v":{"$error":"#N/A"}},{"$f":"VLOOKUP(A135,Plan!$A$6:$V$123,12,TRUE)","v":{"$error":"#N/A"}},{"$f":"VLOOKUP(A135,Plan!$A$6:$V$123,13,TRUE)","v":{"$error":"#N/A"}},{"$f":"VLOOKUP(A135,Plan!$A$6:$V$123,14,TRUE)","v":{"$error":"#N/A"}},{"$f":"VLOOKUP(A135,Plan!$A$6:$V$123,15,TRUE)","v":{"$error":"#N/A"}},{"$f":"VLOOKUP(A135,Plan!$A$6:$V$123,16,TRUE)","v":{"$error":"#N/A"}},{"$f":"VLOOKUP(A135,Plan!$A$6:$V$123,17,TRUE)","v":{"$error":"#N/A"}},{"$f":"VLOOKUP(A135,Plan!$A$6:$V$123,18,TRUE)","v":{"$error":"#N/A"}},{"$f":"VLOOKUP(A135,Plan!$A$6:$V$123,19,TRUE)","v":{"$error":"#N/A"}},{"$f":"VLOOKUP(A135,Plan!$A$6:$V$123,20,TRUE)","v":{"$error":"#N/A"}},{"$f":"VLOOKUP(A135,Plan!$A$6:$V$123,21,TRUE)","v":{"$error":"#N/A"}}]
[{"$nulls":4},{"$f":"VLOOKUP(A136,Plan!$A$6:$V$123,3,TRUE)","v":{"$error":"#N/A"}},{"$f":"VLOOKUP(A136,Plan!$A$6:$V$123,7,TRUE)","v":{"$error":"#N/A"}},{"$f":"VLOOKUP(A136,Plan!$A$6:$V$123,8,TRUE)","v":{"$error":"#N/A"}},{"$f":"VLOOKUP(A136,Plan!$A$6:$V$123,9,TRUE)","v":{"$error":"#N/A"}},{"$f":"VLOOKUP(A136,Plan!$A$6:$V$123,10,TRUE)","v":{"$error":"#N/A"}},{"$f":"VLOOKUP(A136,Plan!$A$6:$V$123,11,TRUE)","v":{"$error":"#N/A"}},{"$f":"VLOOKUP(A136,Plan!$A$6:$V$123,12,TRUE)","v":{"$error":"#N/A"}},{"$f":"VLOOKUP(A136,Plan!$A$6:$V$123,13,TRUE)","v":{"$error":"#N/A"}},{"$f":"VLOOKUP(A136,Plan!$A$6:$V$123,14,TRUE)","v":{"$error":"#N/A"}},{"$f":"VLOOKUP(A136,Plan!$A$6:$V$123,15,TRUE)","v":{"$error":"#N/A"}},{"$f":"VLOOKUP(A136,Plan!$A$6:$V$123,16,TRUE)","v":{"$error":"#N/A"}},{"$f":"VLOOKUP(A136,Plan!$A$6:$V$123,17,TRUE)","v":{"$error":"#N/A"}},{"$f":"VLOOKUP(A136,Plan!$A$6:$V$123,18,TRUE)","v":{"$error":"#N/A"}},{"$f":"VLOOKUP(A136,Plan!$A$6:$V$123,19,TRUE)","v":{"$error":"#N/A"}},{"$f":"VLOOKUP(A136,Plan!$A$6:$V$123,20,TRUE)","v":{"$error":"#N/A"}},{"$f":"VLOOKUP(A136,Plan!$A$6:$V$123,21,TRUE)","v":{"$error":"#N/A"}}]
[{"$nulls":4},{"$f":"VLOOKUP(A137,Plan!$A$6:$V$123,3,TRUE)","v":{"$error":"#N/A"}},{"$f":"VLOOKUP(A137,Plan!$A$6:$V$123,7,TRUE)","v":{"$error":"#N/A"}},{"$f":"VLOOKUP(A137,Plan!$A$6:$V$123,8,TRUE)","v":{"$error":"#N/A"}},{"$f":"VLOOKUP(A137,Plan!$A$6:$V$123,9,TRUE)","v":{"$error":"#N/A"}},{"$f":"VLOOKUP(A137,Plan!$A$6:$V$123,10,TRUE)","v":{"$error":"#N/A"}},{"$f":"VLOOKUP(A137,Plan!$A$6:$V$123,11,TRUE)","v":{"$error":"#N/A"}},{"$f":"VLOOKUP(A137,Plan!$A$6:$V$123,12,TRUE)","v":{"$error":"#N/A"}},{"$f":"VLOOKUP(A137,Plan!$A$6:$V$123,13,TRUE)","v":{"$error":"#N/A"}},{"$f":"VLOOKUP(A137,Plan!$A$6:$V$123,14,TRUE)","v":{"$error":"#N/A"}},{"$f":"VLOOKUP(A137,Plan!$A$6:$V$123,15,TRUE)","v":{"$error":"#N/A"}},{"$f":"VLOOKUP(A137,Plan!$A$6:$V$123,16,TRUE)","v":{"$error":"#N/A"}},{"$f":"VLOOKUP(A137,Plan!$A$6:$V$123,17,TRUE)","v":{"$error":"#N/A"}},{"$f":"VLOOKUP(A137,Plan!$A$6:$V$123,18,TRUE)","v":{"$error":"#N/A"}},{"$f":"VLOOKUP(A137,Plan!$A$6:$V$123,19,TRUE)","v":{"$error":"#N/A"}},{"$f":"VLOOKUP(A137,Plan!$A$6:$V$123,20,TRUE)","v":{"$error":"#N/A"}},{"$f":"VLOOKUP(A137,Plan!$A$6:$V$123,21,TRUE)","v":{"$error":"#N/A"}}]
[{"$nulls":4},{"$f":"VLOOKUP(A138,Plan!$A$6:$V$123,3,TRUE)","v":{"$error":"#N/A"}},{"$f":"VLOOKUP(A138,Plan!$A$6:$V$123,7,TRUE)","v":{"$error":"#N/A"}},{"$f":"VLOOKUP(A138,Plan!$A$6:$V$123,8,TRUE)","v":{"$error":"#N/A"}},{"$f":"VLOOKUP(A138,Plan!$A$6:$V$123,9,TRUE)","v":{"$error":"#N/A"}},{"$f":"VLOOKUP(A138,Plan!$A$6:$V$123,10,TRUE)","v":{"$error":"#N/A"}},{"$f":"VLOOKUP(A138,Plan!$A$6:$V$123,11,TRUE)","v":{"$error":"#N/A"}},{"$f":"VLOOKUP(A138,Plan!$A$6:$V$123,12,TRUE)","v":{"$error":"#N/A"}},{"$f":"VLOOKUP(A138,Plan!$A$6:$V$123,13,TRUE)","v":{"$error":"#N/A"}},{"$f":"VLOOKUP(A138,Plan!$A$6:$V$123,14,TRUE)","v":{"$error":"#N/A"}},{"$f":"VLOOKUP(A138,Plan!$A$6:$V$123,15,TRUE)","v":{"$error":"#N/A"}},{"$f":"VLOOKUP(A138,Plan!$A$6:$V$123,16,TRUE)","v":{"$error":"#N/A"}},{"$f":"VLOOKUP(A138,Plan!$A$6:$V$123,17,TRUE)","v":{"$error":"#N/A"}},{"$f":"VLOOKUP(A138,Plan!$A$6:$V$123,18,TRUE)","v":{"$error":"#N/A"}},{"$f":"VLOOKUP(A138,Plan!$A$6:$V$123,19,TRUE)","v":{"$error":"#N/A"}},{"$f":"VLOOKUP(A138,Plan!$A$6:$V$123,20,TRUE)","v":{"$error":"#N/A"}},{"$f":"VLOOKUP(A138,Plan!$A$6:$V$123,21,TRUE)","v":{"$error":"#N/A"}}]
[{"$nulls":4},{"$f":"VLOOKUP(A139,Plan!$A$6:$V$123,3,TRUE)","v":{"$error":"#N/A"}},{"$f":"VLOOKUP(A139,Plan!$A$6:$V$123,7,TRUE)","v":{"$error":"#N/A"}},{"$f":"VLOOKUP(A139,Plan!$A$6:$V$123,8,TRUE)","v":{"$error":"#N/A"}},{"$f":"VLOOKUP(A139,Plan!$A$6:$V$123,9,TRUE)","v":{"$error":"#N/A"}},{"$f":"VLOOKUP(A139,Plan!$A$6:$V$123,10,TRUE)","v":{"$error":"#N/A"}},{"$f":"VLOOKUP(A139,Plan!$A$6:$V$123,11,TRUE)","v":{"$error":"#N/A"}},{"$f":"VLOOKUP(A139,Plan!$A$6:$V$123,12,TRUE)","v":{"$error":"#N/A"}},{"$f":"VLOOKUP(A139,Plan!$A$6:$V$123,13,TRUE)","v":{"$error":"#N/A"}},{"$f":"VLOOKUP(A139,Plan!$A$6:$V$123,14,TRUE)","v":{"$error":"#N/A"}},{"$f":"VLOOKUP(A139,Plan!$A$6:$V$123,15,TRUE)","v":{"$error":"#N/A"}},{"$f":"VLOOKUP(A139,Plan!$A$6:$V$123,16,TRUE)","v":{"$error":"#N/A"}},{"$f":"VLOOKUP(A139,Plan!$A$6:$V$123,17,TRUE)","v":{"$error":"#N/A"}},{"$f":"VLOOKUP(A139,Plan!$A$6:$V$123,18,TRUE)","v":{"$error":"#N/A"}},{"$f":"VLOOKUP(A139,Plan!$A$6:$V$123,19,TRUE)","v":{"$error":"#N/A"}},{"$f":"VLOOKUP(A139,Plan!$A$6:$V$123,20,TRUE)","v":{"$error":"#N/A"}},{"$f":"VLOOKUP(A139,Plan!$A$6:$V$123,21,TRUE)","v":{"$error":"#N/A"}}]
[{"$nulls":4},{"$f":"VLOOKUP(A140,Plan!$A$6:$V$123,3,TRUE)","v":{"$error":"#N/A"}},{"$f":"VLOOKUP(A140,Plan!$A$6:$V$123,7,TRUE)","v":{"$error":"#N/A"}},{"$f":"VLOOKUP(A140,Plan!$A$6:$V$123,8,TRUE)","v":{"$error":"#N/A"}},{"$f":"VLOOKUP(A140,Plan!$A$6:$V$123,9,TRUE)","v":{"$error":"#N/A"}},{"$f":"VLOOKUP(A140,Plan!$A$6:$V$123,10,TRUE)","v":{"$error":"#N/A"}},{"$f":"VLOOKUP(A140,Plan!$A$6:$V$123,11,TRUE)","v":{"$error":"#N/A"}},{"$f":"VLOOKUP(A140,Plan!$A$6:$V$123,12,TRUE)","v":{"$error":"#N/A"}},{"$f":"VLOOKUP(A140,Plan!$A$6:$V$123,13,TRUE)","v":{"$error":"#N/A"}},{"$f":"VLOOKUP(A140,Plan!$A$6:$V$123,14,TRUE)","v":{"$error":"#N/A"}},{"$f":"VLOOKUP(A140,Plan!$A$6:$V$123,15,TRUE)","v":{"$error":"#N/A"}},{"$f":"VLOOKUP(A140,Plan!$A$6:$V$123,16,TRUE)","v":{"$error":"#N/A"}},{"$f":"VLOOKUP(A140,Plan!$A$6:$V$123,17,TRUE)","v":{"$error":"#N/A"}},{"$f":"VLOOKUP(A140,Plan!$A$6:$V$123,18,TRUE)","v":{"$error":"#N/A"}},{"$f":"VLOOKUP(A140,Plan!$A$6:$V$123,19,TRUE)","v":{"$error":"#N/A"}},{"$f":"VLOOKUP(A140,Plan!$A$6:$V$123,20,TRUE)","v":{"$error":"#N/A"}},{"$f":"VLOOKUP(A140,Plan!$A$6:$V$123,21,TRUE)","v":{"$error":"#N/A"}}]
[{"$nulls":4},{"$f":"VLOOKUP(A141,Plan!$A$6:$V$123,3,TRUE)","v":{"$error":"#N/A"}},{"$f":"VLOOKUP(A141,Plan!$A$6:$V$123,7,TRUE)","v":{"$error":"#N/A"}},{"$f":"VLOOKUP(A141,Plan!$A$6:$V$123,8,TRUE)","v":{"$error":"#N/A"}},{"$f":"VLOOKUP(A141,Plan!$A$6:$V$123,9,TRUE)","v":{"$error":"#N/A"}},{"$f":"VLOOKUP(A141,Plan!$A$6:$V$123,10,TRUE)","v":{"$error":"#N/A"}},{"$f":"VLOOKUP(A141,Plan!$A$6:$V$123,11,TRUE)","v":{"$error":"#N/A"}},{"$f":"VLOOKUP(A141,Plan!$A$6:$V$123,12,TRUE)","v":{"$error":"#N/A"}},{"$f":"VLOOKUP(A141,Plan!$A$6:$V$123,13,TRUE)","v":{"$error":"#N/A"}},{"$f":"VLOOKUP(A141,Plan!$A$6:$V$123,14,TRUE)","v":{"$error":"#N/A"}},{"$f":"VLOOKUP(A141,Plan!$A$6:$V$123,15,TRUE)","v":{"$error":"#N/A"}},{"$f":"VLOOKUP(A141,Plan!$A$6:$V$123,16,TRUE)","v":{"$error":"#N/A"}},{"$f":"VLOOKUP(A141,Plan!$A$6:$V$123,17,TRUE)","v":{"$error":"#N/A"}},{"$f":"VLOOKUP(A141,Plan!$A$6:$V$123,18,TRUE)","v":{"$error":"#N/A"}},{"$f":"VLOOKUP(A141,Plan!$A$6:$V$123,19,TRUE)","v":{"$error":"#N/A"}},{"$f":"VLOOKUP(A141,Plan!$A$6:$V$123,20,TRUE)","v":{"$error":"#N/A"}},{"$f":"VLOOKUP(A141,Plan!$A$6:$V$123,21,TRUE)","v":{"$error":"#N/A"}}]
[{"$nulls":4},{"$f":"VLOOKUP(A142,Plan!$A$6:$V$123,3,TRUE)","v":{"$error":"#N/A"}},{"$f":"VLOOKUP(A142,Plan!$A$6:$V$123,7,TRUE)","v":{"$error":"#N/A"}},{"$f":"VLOOKUP(A142,Plan!$A$6:$V$123,8,TRUE)","v":{"$error":"#N/A"}},{"$f":"VLOOKUP(A142,Plan!$A$6:$V$123,9,TRUE)","v":{"$error":"#N/A"}},{"$f":"VLOOKUP(A142,Plan!$A$6:$V$123,10,TRUE)","v":{"$error":"#N/A"}},{"$f":"VLOOKUP(A142,Plan!$A$6:$V$123,11,TRUE)","v":{"$error":"#N/A"}},{"$f":"VLOOKUP(A142,Plan!$A$6:$V$123,12,TRUE)","v":{"$error":"#N/A"}},{"$f":"VLOOKUP(A142,Plan!$A$6:$V$123,13,TRUE)","v":{"$error":"#N/A"}},{"$f":"VLOOKUP(A142,Plan!$A$6:$V$123,14,TRUE)","v":{"$error":"#N/A"}},{"$f":"VLOOKUP(A142,Plan!$A$6:$V$123,15,TRUE)","v":{"$error":"#N/A"}},{"$f":"VLOOKUP(A142,Plan!$A$6:$V$123,16,TRUE)","v":{"$error":"#N/A"}},{"$f":"VLOOKUP(A142,Plan!$A$6:$V$123,17,TRUE)","v":{"$error":"#N/A"}},{"$f":"VLOOKUP(A142,Plan!$A$6:$V$123,18,TRUE)","v":{"$error":"#N/A"}},{"$f":"VLOOKUP(A142,Plan!$A$6:$V$123,19,TRUE)","v":{"$error":"#N/A"}},{"$f":"VLOOKUP(A142,Plan!$A$6:$V$123,20,TRUE)","v":{"$error":"#N/A"}},{"$f":"VLOOKUP(A142,Plan!$A$6:$V$123,21,TRUE)","v":{"$error":"#N/A"}}]
[{"$nulls":4},{"$f":"VLOOKUP(A143,Plan!$A$6:$V$123,3,TRUE)","v":{"$error":"#N/A"}},{"$f":"VLOOKUP(A143,Plan!$A$6:$V$123,7,TRUE)","v":{"$error":"#N/A"}},{"$f":"VLOOKUP(A143,Plan!$A$6:$V$123,8,TRUE)","v":{"$error":"#N/A"}},{"$f":"VLOOKUP(A143,Plan!$A$6:$V$123,9,TRUE)","v":{"$error":"#N/A"}},{"$f":"VLOOKUP(A143,Plan!$A$6:$V$123,10,TRUE)","v":{"$error":"#N/A"}},{"$f":"VLOOKUP(A143,Plan!$A$6:$V$123,11,TRUE)","v":{"$error":"#N/A"}},{"$f":"VLOOKUP(A143,Plan!$A$6:$V$123,12,TRUE)","v":{"$error":"#N/A"}},{"$f":"VLOOKUP(A143,Plan!$A$6:$V$123,13,TRUE)","v":{"$error":"#N/A"}},{"$f":"VLOOKUP(A143,Plan!$A$6:$V$123,14,TRUE)","v":{"$error":"#N/A"}},{"$f":"VLOOKUP(A143,Plan!$A$6:$V$123,15,TRUE)","v":{"$error":"#N/A"}},{"$f":"VLOOKUP(A143,Plan!$A$6:$V$123,16,TRUE)","v":{"$error":"#N/A"}},{"$f":"VLOOKUP(A143,Plan!$A$6:$V$123,17,TRUE)","v":{"$error":"#N/A"}},{"$f":"VLOOKUP(A143,Plan!$A$6:$V$123,18,TRUE)","v":{"$error":"#N/A"}},{"$f":"VLOOKUP(A143,Plan!$A$6:$V$123,19,TRUE)","v":{"$error":"#N/A"}},{"$f":"VLOOKUP(A143,Plan!$A$6:$V$123,20,TRUE)","v":{"$error":"#N/A"}},{"$f":"VLOOKUP(A143,Plan!$A$6:$V$123,21,TRUE)","v":{"$error":"#N/A"}}]
[{"$nulls":4},{"$f":"VLOOKUP(A144,Plan!$A$6:$V$123,3,TRUE)","v":{"$error":"#N/A"}},{"$f":"VLOOKUP(A144,Plan!$A$6:$V$123,7,TRUE)","v":{"$error":"#N/A"}},{"$f":"VLOOKUP(A144,Plan!$A$6:$V$123,8,TRUE)","v":{"$error":"#N/A"}},{"$f":"VLOOKUP(A144,Plan!$A$6:$V$123,9,TRUE)","v":{"$error":"#N/A"}},{"$f":"VLOOKUP(A144,Plan!$A$6:$V$123,10,TRUE)","v":{"$error":"#N/A"}},{"$f":"VLOOKUP(A144,Plan!$A$6:$V$123,11,TRUE)","v":{"$error":"#N/A"}},{"$f":"VLOOKUP(A144,Plan!$A$6:$V$123,12,TRUE)","v":{"$error":"#N/A"}},{"$f":"VLOOKUP(A144,Plan!$A$6:$V$123,13,TRUE)","v":{"$error":"#N/A"}},{"$f":"VLOOKUP(A144,Plan!$A$6:$V$123,14,TRUE)","v":{"$error":"#N/A"}},{"$f":"VLOOKUP(A144,Plan!$A$6:$V$123,15,TRUE)","v":{"$error":"#N/A"}},{"$f":"VLOOKUP(A144,Plan!$A$6:$V$123,16,TRUE)","v":{"$error":"#N/A"}},{"$f":"VLOOKUP(A144,Plan!$A$6:$V$123,17,TRUE)","v":{"$error":"#N/A"}},{"$f":"VLOOKUP(A144,Plan!$A$6:$V$123,18,TRUE)","v":{"$error":"#N/A"}},{"$f":"VLOOKUP(A144,Plan!$A$6:$V$123,19,TRUE)","v":{"$error":"#N/A"}},{"$f":"VLOOKUP(A144,Plan!$A$6:$V$123,20,TRUE)","v":{"$error":"#N/A"}},{"$f":"VLOOKUP(A144,Plan!$A$6:$V$123,21,TRUE)","v":{"$error":"#N/A"}}]
[" ",{"$nulls":3},{"$f":"VLOOKUP(A145,Plan!$A$6:$V$123,3,TRUE)","v":{"$error":"#N/A"}},{"$f":"VLOOKUP(A145,Plan!$A$6:$V$123,7,TRUE)","v":{"$error":"#N/A"}},{"$f":"VLOOKUP(A145,Plan!$A$6:$V$123,8,TRUE)","v":{"$error":"#N/A"}},{"$f":"VLOOKUP(A145,Plan!$A$6:$V$123,9,TRUE)","v":{"$error":"#N/A"}},{"$f":"VLOOKUP(A145,Plan!$A$6:$V$123,10,TRUE)","v":{"$error":"#N/A"}},{"$f":"VLOOKUP(A145,Plan!$A$6:$V$123,11,TRUE)","v":{"$error":"#N/A"}},{"$f":"VLOOKUP(A145,Plan!$A$6:$V$123,12,TRUE)","v":{"$error":"#N/A"}},{"$f":"VLOOKUP(A145,Plan!$A$6:$V$123,13,TRUE)","v":{"$error":"#N/A"}},{"$f":"VLOOKUP(A145,Plan!$A$6:$V$123,14,TRUE)","v":{"$error":"#N/A"}},{"$f":"VLOOKUP(A145,Plan!$A$6:$V$123,15,TRUE)","v":{"$error":"#N/A"}},{"$f":"VLOOKUP(A145,Plan!$A$6:$V$123,16,TRUE)","v":{"$error":"#N/A"}},{"$f":"VLOOKUP(A145,Plan!$A$6:$V$123,17,TRUE)","v":{"$error":"#N/A"}},{"$f":"VLOOKUP(A145,Plan!$A$6:$V$123,18,TRUE)","v":{"$error":"#N/A"}},{"$f":"VLOOKUP(A145,Plan!$A$6:$V$123,19,TRUE)","v":{"$error":"#N/A"}},{"$f":"VLOOKUP(A145,Plan!$A$6:$V$123,20,TRUE)","v":{"$error":"#N/A"}},{"$f":"VLOOKUP(A145,Plan!$A$6:$V$123,21,TRUE)","v":{"$error":"#N/A"}}]
["703131","CHEF BARMAN",null,null,{"$f":"VLOOKUP(A146,Plan!$A$6:$V$123,3,TRUE)","v":"39h00"},{"$f":"VLOOKUP(A146,Plan!$A$6:$V$123,7,TRUE)","v":"31h12"},{"$f":"VLOOKUP(A146,Plan!$A$6:$V$123,8,TRUE)","v":"R"},{"$f":"VLOOKUP(A146,Plan!$A$6:$V$123,9,TRUE)","v":0},{"$f":"VLOOKUP(A146,Plan!$A$6:$V$123,10,TRUE)","v":"CP"},{"$f":"VLOOKUP(A146,Plan!$A$6:$V$123,11,TRUE)","v":0},{"$f":"VLOOKUP(A146,Plan!$A$6:$V$123,12,TRUE)","v":0},{"$f":"VLOOKUP(A146,Plan!$A$6:$V$123,13,TRUE)","v":"16h-00h18#"},{"$f":"VLOOKUP(A146,Plan!$A$6:$V$123,14,TRUE)","v":0},{"$f":"VLOOKUP(A146,Plan!$A$6:$V$123,15,TRUE)","v":"16h-00h18#"},{"$f":"VLOOKUP(A146,Plan!$A$6:$V$123,16,TRUE)","v":0},{"$f":"VLOOKUP(A146,Plan!$A$6:$V$123,17,TRUE)","v":"16h-00h18#"},{"$f":"VLOOKUP(A146,Plan!$A$6:$V$123,18,TRUE)","v":0},{"$f":"VLOOKUP(A146,Plan!$A$6:$V$123,19,TRUE)","v":"16h-00h18#"},{"$f":"VLOOKUP(A146,Plan!$A$6:$V$123,20,TRUE)","v":"R"},{"$f":"VLOOKUP(A146,Plan!$A$6:$V$123,21,TRUE)","v":0}]
["603281","BARMAN",null,null,{"$f":"VLOOKUP(A147,Plan!$A$6:$V$123,3,TRUE)","v":"39h00"},{"$f":"VLOOKUP(A147,Plan!$A$6:$V$123,7,TRUE)","v":"39h00"},{"$f":"VLOOKUP(A147,Plan!$A$6:$V$123,8,TRUE)","v":"R"},{"$f":"VLOOKUP(A147,Plan!$A$6:$V$123,9,TRUE)","v":0},{"$f":"VLOOKUP(A147,Plan!$A$6:$V$123,10,TRUE)","v":"R"},{"$f":"VLOOKUP(A147,Plan!$A$6:$V$123,11,TRUE)","v":0},{"$f":"VLOOKUP(A147,Plan!$A$6:$V$123,12,TRUE)","v":"10h-18h18#"},{"$f":"VLOOKUP(A147,Plan!$A$6:$V$123,13,TRUE)","v":0},{"$f":"VLOOKUP(A147,Plan!$A$6:$V$123,14,TRUE)","v":"10h-18h18#"},{"$f":"VLOOKUP(A147,Plan!$A$6:$V$123,15,TRUE)","v":0},{"$f":"VLOOKUP(A147,Plan!$A$6:$V$123,16,TRUE)","v":"10h-18h18#"},{"$f":"VLOOKUP(A147,Plan!$A$6:$V$123,17,TRUE)","v":0},{"$f":"VLOOKUP(A147,Plan!$A$6:$V$123,18,TRUE)","v":"10h-18h18#"},{"$f":"VLOOKUP(A147,Plan!$A$6:$V$123,19,TRUE)","v":0},{"$f":"VLOOKUP(A147,Plan!$A$6:$V$123,20,TRUE)","v":"10h-18h18#"},{"$f":"VLOOKUP(A147,Plan!$A$6:$V$123,21,TRUE)","v":0}]
["038145","BARMAN",null,null,{"$f":"VLOOKUP(A148,Plan!$A$6:$V$123,3,TRUE)","v":"39h00"},{"$f":"VLOOKUP(A148,Plan!$A$6:$V$123,7,TRUE)","v":"39h00"},{"$f":"VLOOKUP(A148,Plan!$A$6:$V$123,8,TRUE)","v":"R"},{"$f":"VLOOKUP(A148,Plan!$A$6:$V$123,9,TRUE)","v":0},{"$f":"VLOOKUP(A148,Plan!$A$6:$V$123,10,TRUE)","v":"R"},{"$f":"VLOOKUP(A148,Plan!$A$6:$V$123,11,TRUE)","v":0},{"$f":"VLOOKUP(A148,Plan!$A$6:$V$123,12,TRUE)","v":"09h-17h18#"},{"$f":"VLOOKUP(A148,Plan!$A$6:$V$123,13,TRUE)","v":0},{"$f":"VLOOKUP(A148,Plan!$A$6:$V$123,14,TRUE)","v":"09h-17h18#"},{"$f":"VLOOKUP(A148,Plan!$A$6:$V$123,15,TRUE)","v":0},{"$f":"VLOOKUP(A148,Plan!$A$6:$V$123,16,TRUE)","v":"09h-17h18#"},{"$f":"VLOOKUP(A148,Plan!$A$6:$V$123,17,TRUE)","v":0},{"$f":"VLOOKUP(A148,Plan!$A$6:$V$123,18,TRUE)","v":"08h30-16h48#"},{"$f":"VLOOKUP(A148,Plan!$A$6:$V$123,19,TRUE)","v":0},{"$f":"VLOOKUP(A148,Plan!$A$6:$V$123,20,TRUE)","v":"08h30-16h48#"},{"$f":"VLOOKUP(A148,Plan!$A$6:$V$123,21,TRUE)","v":0}]
["609045","BARMAN",null,null,{"$f":"VLOOKUP(A149,Plan!$A$6:$V$123,3,TRUE)","v":"39h00"},{"$f":"VLOOKUP(A149,Plan!$A$6:$V$123,7,TRUE)","v":"39h00"},{"$f":"VLOOKUP(A149,Plan!$A$6:$V$123,8,TRUE)","v":0},{"$f":"VLOOKUP(A149,Plan!$A$6:$V$123,9,TRUE)","v":"14h30-23h#"},{"$f":"VLOOKUP(A149,Plan!$A$6:$V$123,10,TRUE)","v":0},{"$f":"VLOOKUP(A149,Plan!$A$6:$V$123,11,TRUE)","v":"15h-24h#"},{"$f":"VLOOKUP(A149,Plan!$A$6:$V$123,12,TRUE)","v":"R"},{"$f":"VLOOKUP(A149,Plan!$A$6:$V$123,13,TRUE)","v":0},{"$f":"VLOOKUP(A149,Plan!$A$6:$V$123,14,TRUE)","v":"R"},{"$f":"VLOOKUP(A149,Plan!$A$6:$V$123,15,TRUE)","v":0},{"$f":"VLOOKUP(A149,Plan!$A$6:$V$123,16,TRUE)","v":0},{"$f":"VLOOKUP(A149,Plan!$A$6:$V$123,17,TRUE)","v":"16h-24h30#"},{"$f":"VLOOKUP(A149,Plan!$A$6:$V$123,18,TRUE)","v":0},{"$f":"VLOOKUP(A149,Plan!$A$6:$V$123,19,TRUE)","v":"16h-24h30#"},{"$f":"VLOOKUP(A149,Plan!$A$6:$V$123,20,TRUE)","v":0},{"$f":"VLOOKUP(A149,Plan!$A$6:$V$123,21,TRUE)","v":"17h-24h#"}]
["808013","BARMAN",null,null,{"$f":"VLOOKUP(A150,Plan!$A$6:$V$123,3,TRUE)","v":"39h00"},{"$f":"VLOOKUP(A150,Plan!$A$6:$V$123,7,TRUE)","v":"39h00"},{"$f":"VLOOKUP(A150,Plan!$A$6:$V$123,8,TRUE)","v":0},{"$f":"VLOOKUP(A150,Plan!$A$6:$V$123,9,TRUE)","v":"16h-00h18#"},{"$f":"VLOOKUP(A150,Plan!$A$6:$V$123,10,TRUE)","v":"R"},{"$f":"VLOOKUP(A150,Plan!$A$6:$V$123,11,TRUE)","v":0},{"$f":"VLOOKUP(A150,Plan!$A$6:$V$123,12,TRUE)","v":"R"},{"$f":"VLOOKUP(A150,Plan!$A$6:$V$123,13,TRUE)","v":0},{"$f":"VLOOKUP(A150,Plan!$A$6:$V$123,14,TRUE)","v":0},{"$f":"VLOOKUP(A150,Plan!$A$6:$V$123,15,TRUE)","v":"16h-00h18#"},{"$f":"VLOOKUP(A150,Plan!$A$6:$V$123,16,TRUE)","v":0},{"$f":"VLOOKUP(A150,Plan!$A$6:$V$123,17,TRUE)","v":"16h-00h18#"},{"$f":"VLOOKUP(A150,Plan!$A$6:$V$123,18,TRUE)","v":0},{"$f":"VLOOKUP(A150,Plan!$A$6:$V$123,19,TRUE)","v":"16h-00h18#"},{"$f":"VLOOKUP(A150,Plan!$A$6:$V$123,20,TRUE)","v":0},{"$f":"VLOOKUP(A150,Plan!$A$6:$V$123,21,TRUE)","v":"15h-23h18#"}]
["142608","BARMAN",null,null,{"$f":"VLOOKUP(A151,Plan!$A$6:$V$123,3,TRUE)","v":"35h00"},{"$f":"VLOOKUP(A151,Plan!$A$6:$V$123,7,TRUE)","v":"35h00"},{"$f":"VLOOKUP(A151,Plan!$A$6:$V$123,8,TRUE)","v":"R"},{"$f":"VLOOKUP(A151,Plan!$A$6:$V$123,9,TRUE)","v":0},{"$f":"VLOOKUP(A151,Plan!$A$6:$V$123,10,TRUE)","v":"R"},{"$f":"VLOOKUP(A151,Plan!$A$6:$V$123,11,TRUE)","v":0},{"$f":"VLOOKUP(A151,Plan!$A$6:$V$123,12,TRUE)","v":0},{"$f":"VLOOKUP(A151,Plan!$A$6:$V$123,13,TRUE)","v":"16h30-24h#"},{"$f":"VLOOKUP(A151,Plan!$A$6:$V$123,14,TRUE)","v":0},{"$f":"VLOOKUP(A151,Plan!$A$6:$V$123,15,TRUE)","v":"16h30-24h#"},{"$f":"VLOOKUP(A151,Plan!$A$6:$V$123,16,TRUE)","v":0},{"$f":"VLOOKUP(A151,Plan!$A$6:$V$123,17,TRUE)","v":"16h30-24h#"},{"$f":"VLOOKUP(A151,Plan!$A$6:$V$123,18,TRUE)","v":0},{"$f":"VLOOKUP(A151,Plan!$A$6:$V$123,19,TRUE)","v":"16h30-24h#"},{"$f":"VLOOKUP(A151,Plan!$A$6:$V$123,20,TRUE)","v":"11h30-19h#"},{"$f":"VLOOKUP(A151,Plan!$A$6:$V$123,21,TRUE)","v":0}]
[{"$nulls":4},{"$f":"VLOOKUP(A152,Plan!$A$6:$V$123,3,TRUE)","v":{"$error":"#N/A"}},{"$f":"VLOOKUP(A152,Plan!$A$6:$V$123,7,TRUE)","v":{"$error":"#N/A"}},{"$f":"VLOOKUP(A152,Plan!$A$6:$V$123,8,TRUE)","v":{"$error":"#N/A"}},{"$f":"VLOOKUP(A152,Plan!$A$6:$V$123,9,TRUE)","v":{"$error":"#N/A"}},{"$f":"VLOOKUP(A152,Plan!$A$6:$V$123,10,TRUE)","v":{"$error":"#N/A"}},{"$f":"VLOOKUP(A152,Plan!$A$6:$V$123,11,TRUE)","v":{"$error":"#N/A"}},{"$f":"VLOOKUP(A152,Plan!$A$6:$V$123,12,TRUE)","v":{"$error":"#N/A"}},{"$f":"VLOOKUP(A152,Plan!$A$6:$V$123,13,TRUE)","v":{"$error":"#N/A"}},{"$f":"VLOOKUP(A152,Plan!$A$6:$V$123,14,TRUE)","v":{"$error":"#N/A"}},{"$f":"VLOOKUP(A152,Plan!$A$6:$V$123,15,TRUE)","v":{"$error":"#N/A"}},{"$f":"VLOOKUP(A152,Plan!$A$6:$V$123,16,TRUE)","v":{"$error":"#N/A"}},{"$f":"VLOOKUP(A152,Plan!$A$6:$V$123,17,TRUE)","v":{"$error":"#N/A"}},{"$f":"VLOOKUP(A152,Plan!$A$6:$V$123,18,TRUE)","v":{"$error":"#N/A"}},{"$f":"VLOOKUP(A152,Plan!$A$6:$V$123,19,TRUE)","v":{"$error":"#N/A"}},{"$f":"VLOOKUP(A152,Plan!$A$6:$V$123,20,TRUE)","v":{"$error":"#N/A"}},{"$f":"VLOOKUP(A152,Plan!$A$6:$V$123,21,TRUE)","v":{"$error":"#N/A"}}]
[{"$nulls":4},{"$f":"VLOOKUP(A153,Plan!$A$6:$V$123,3,TRUE)","v":{"$error":"#N/A"}},{"$f":"VLOOKUP(A153,Plan!$A$6:$V$123,7,TRUE)","v":{"$error":"#N/A"}},{"$f":"VLOOKUP(A153,Plan!$A$6:$V$123,8,TRUE)","v":{"$error":"#N/A"}},{"$f":"VLOOKUP(A153,Plan!$A$6:$V$123,9,TRUE)","v":{"$error":"#N/A"}},{"$f":"VLOOKUP(A153,Plan!$A$6:$V$123,10,TRUE)","v":{"$error":"#N/A"}},{"$f":"VLOOKUP(A153,Plan!$A$6:$V$123,11,TRUE)","v":{"$error":"#N/A"}},{"$f":"VLOOKUP(A153,Plan!$A$6:$V$123,12,TRUE)","v":{"$error":"#N/A"}},{"$f":"VLOOKUP(A153,Plan!$A$6:$V$123,13,TRUE)","v":{"$error":"#N/A"}},{"$f":"VLOOKUP(A153,Plan!$A$6:$V$123,14,TRUE)","v":{"$error":"#N/A"}},{"$f":"VLOOKUP(A153,Plan!$A$6:$V$123,15,TRUE)","v":{"$error":"#N/A"}},{"$f":"VLOOKUP(A153,Plan!$A$6:$V$123,16,TRUE)","v":{"$error":"#N/A"}},{"$f":"VLOOKUP(A153,Plan!$A$6:$V$123,17,TRUE)","v":{"$error":"#N/A"}},{"$f":"VLOOKUP(A153,Plan!$A$6:$V$123,18,TRUE)","v":{"$error":"#N/A"}},{"$f":"VLOOKUP(A153,Plan!$A$6:$V$123,19,TRUE)","v":{"$error":"#N/A"}},{"$f":"VLOOKUP(A153,Plan!$A$6:$V$123,20,TRUE)","v":{"$error":"#N/A"}},{"$f":"VLOOKUP(A153,Plan!$A$6:$V$123,21,TRUE)","v":{"$error":"#N/A"}}]
[{"$nulls":4},{"$f":"VLOOKUP(A154,Plan!$A$6:$V$123,3,TRUE)","v":{"$error":"#N/A"}},{"$f":"VLOOKUP(A154,Plan!$A$6:$V$123,7,TRUE)","v":{"$error":"#N/A"}},{"$f":"VLOOKUP(A154,Plan!$A$6:$V$123,8,TRUE)","v":{"$error":"#N/A"}},{"$f":"VLOOKUP(A154,Plan!$A$6:$V$123,9,TRUE)","v":{"$error":"#N/A"}},{"$f":"VLOOKUP(A154,Plan!$A$6:$V$123,10,TRUE)","v":{"$error":"#N/A"}},{"$f":"VLOOKUP(A154,Plan!$A$6:$V$123,11,TRUE)","v":{"$error":"#N/A"}},{"$f":"VLOOKUP(A154,Plan!$A$6:$V$123,12,TRUE)","v":{"$error":"#N/A"}},{"$f":"VLOOKUP(A154,Plan!$A$6:$V$123,13,TRUE)","v":{"$error":"#N/A"}},{"$f":"VLOOKUP(A154,Plan!$A$6:$V$123,14,TRUE)","v":{"$error":"#N/A"}},{"$f":"VLOOKUP(A154,Plan!$A$6:$V$123,15,TRUE)","v":{"$error":"#N/A"}},{"$f":"VLOOKUP(A154,Plan!$A$6:$V$123,16,TRUE)","v":{"$error":"#N/A"}},{"$f":"VLOOKUP(A154,Plan!$A$6:$V$123,17,TRUE)","v":{"$error":"#N/A"}},{"$f":"VLOOKUP(A154,Plan!$A$6:$V$123,18,TRUE)","v":{"$error":"#N/A"}},{"$f":"VLOOKUP(A154,Plan!$A$6:$V$123,19,TRUE)","v":{"$error":"#N/A"}},{"$f":"VLOOKUP(A154,Plan!$A$6:$V$123,20,TRUE)","v":{"$error":"#N/A"}},{"$f":"VLOOKUP(A154,Plan!$A$6:$V$123,21,TRUE)","v":{"$error":"#N/A"}}]
[{"$nulls":4},{"$f":"VLOOKUP(A155,Plan!$A$6:$V$123,3,TRUE)","v":{"$error":"#N/A"}},{"$f":"VLOOKUP(A155,Plan!$A$6:$V$123,7,TRUE)","v":{"$error":"#N/A"}},{"$f":"VLOOKUP(A155,Plan!$A$6:$V$123,8,TRUE)","v":{"$error":"#N/A"}},{"$f":"VLOOKUP(A155,Plan!$A$6:$V$123,9,TRUE)","v":{"$error":"#N/A"}},{"$f":"VLOOKUP(A155,Plan!$A$6:$V$123,10,TRUE)","v":{"$error":"#N/A"}},{"$f":"VLOOKUP(A155,Plan!$A$6:$V$123,11,TRUE)","v":{"$error":"#N/A"}},{"$f":"VLOOKUP(A155,Plan!$A$6:$V$123,12,TRUE)","v":{"$error":"#N/A"}},{"$f":"VLOOKUP(A155,Plan!$A$6:$V$123,13,TRUE)","v":{"$error":"#N/A"}},{"$f":"VLOOKUP(A155,Plan!$A$6:$V$123,14,TRUE)","v":{"$error":"#N/A"}},{"$f":"VLOOKUP(A155,Plan!$A$6:$V$123,15,TRUE)","v":{"$error":"#N/A"}},{"$f":"VLOOKUP(A155,Plan!$A$6:$V$123,16,TRUE)","v":{"$error":"#N/A"}},{"$f":"VLOOKUP(A155,Plan!$A$6:$V$123,17,TRUE)","v":{"$error":"#N/A"}},{"$f":"VLOOKUP(A155,Plan!$A$6:$V$123,18,TRUE)","v":{"$error":"#N/A"}},{"$f":"VLOOKUP(A155,Plan!$A$6:$V$123,19,TRUE)","v":{"$error":"#N/A"}},{"$f":"VLOOKUP(A155,Plan!$A$6:$V$123,20,TRUE)","v":{"$error":"#N/A"}},{"$f":"VLOOKUP(A155,Plan!$A$6:$V$123,21,TRUE)","v":{"$error":"#N/A"}}]
[{"$nulls":4},{"$f":"VLOOKUP(A156,Plan!$A$6:$V$123,3,TRUE)","v":{"$error":"#N/A"}},{"$f":"VLOOKUP(A156,Plan!$A$6:$V$123,7,TRUE)","v":{"$error":"#N/A"}},{"$f":"VLOOKUP(A156,Plan!$A$6:$V$123,8,TRUE)","v":{"$error":"#N/A"}},{"$f":"VLOOKUP(A156,Plan!$A$6:$V$123,9,TRUE)","v":{"$error":"#N/A"}},{"$f":"VLOOKUP(A156,Plan!$A$6:$V$123,10,TRUE)","v":{"$error":"#N/A"}},{"$f":"VLOOKUP(A156,Plan!$A$6:$V$123,11,TRUE)","v":{"$error":"#N/A"}},{"$f":"VLOOKUP(A156,Plan!$A$6:$V$123,12,TRUE)","v":{"$error":"#N/A"}},{"$f":"VLOOKUP(A156,Plan!$A$6:$V$123,13,TRUE)","v":{"$error":"#N/A"}},{"$f":"VLOOKUP(A156,Plan!$A$6:$V$123,14,TRUE)","v":{"$error":"#N/A"}},{"$f":"VLOOKUP(A156,Plan!$A$6:$V$123,15,TRUE)","v":{"$error":"#N/A"}},{"$f":"VLOOKUP(A156,Plan!$A$6:$V$123,16,TRUE)","v":{"$error":"#N/A"}},{"$f":"VLOOKUP(A156,Plan!$A$6:$V$123,17,TRUE)","v":{"$error":"#N/A"}},{"$f":"VLOOKUP(A156,Plan!$A$6:$V$123,18,TRUE)","v":{"$error":"#N/A"}},{"$f":"VLOOKUP(A156,Plan!$A$6:$V$123,19,TRUE)","v":{"$error":"#N/A"}},{"$f":"VLOOKUP(A156,Plan!$A$6:$V$123,20,TRUE)","v":{"$error":"#N/A"}},{"$f":"VLOOKUP(A156,Plan!$A$6:$V$123,21,TRUE)","v":{"$error":"#N/A"}}]
[{"$nulls":4},{"$f":"VLOOKUP(A157,Plan!$A$6:$V$123,3,TRUE)","v":{"$error":"#N/A"}},{"$f":"VLOOKUP(A157,Plan!$A$6:$V$123,7,TRUE)","v":{"$error":"#N/A"}},{"$f":"VLOOKUP(A157,Plan!$A$6:$V$123,8,TRUE)","v":{"$error":"#N/A"}},{"$f":"VLOOKUP(A157,Plan!$A$6:$V$123,9,TRUE)","v":{"$error":"#N/A"}},{"$f":"VLOOKUP(A157,Plan!$A$6:$V$123,10,TRUE)","v":{"$error":"#N/A"}},{"$f":"VLOOKUP(A157,Plan!$A$6:$V$123,11,TRUE)","v":{"$error":"#N/A"}},{"$f":"VLOOKUP(A157,Plan!$A$6:$V$123,12,TRUE)","v":{"$error":"#N/A"}},{"$f":"VLOOKUP(A157,Plan!$A$6:$V$123,13,TRUE)","v":{"$error":"#N/A"}},{"$f":"VLOOKUP(A157,Plan!$A$6:$V$123,14,TRUE)","v":{"$error":"#N/A"}},{"$f":"VLOOKUP(A157,Plan!$A$6:$V$123,15,TRUE)","v":{"$error":"#N/A"}},{"$f":"VLOOKUP(A157,Plan!$A$6:$V$123,16,TRUE)","v":{"$error":"#N/A"}},{"$f":"VLOOKUP(A157,Plan!$A$6:$V$123,17,TRUE)","v":{"$error":"#N/A"}},{"$f":"VLOOKUP(A157,Plan!$A$6:$V$123,18,TRUE)","v":{"$error":"#N/A"}},{"$f":"VLOOKUP(A157,Plan!$A$6:$V$123,19,TRUE)","v":{"$error":"#N/A"}},{"$f":"VLOOKUP(A157,Plan!$A$6:$V$123,20,TRUE)","v":{"$error":"#N/A"}},{"$f":"VLOOKUP(A157,Plan!$A$6:$V$123,21,TRUE)","v":{"$error":"#N/A"}}]
[{"$nulls":4},{"$f":"VLOOKUP(A158,Plan!$A$6:$V$123,3,TRUE)","v":{"$error":"#N/A"}},{"$f":"VLOOKUP(A158,Plan!$A$6:$V$123,7,TRUE)","v":{"$error":"#N/A"}},{"$f":"VLOOKUP(A158,Plan!$A$6:$V$123,8,TRUE)","v":{"$error":"#N/A"}},{"$f":"VLOOKUP(A158,Plan!$A$6:$V$123,9,TRUE)","v":{"$error":"#N/A"}},{"$f":"VLOOKUP(A158,Plan!$A$6:$V$123,10,TRUE)","v":{"$error":"#N/A"}},{"$f":"VLOOKUP(A158,Plan!$A$6:$V$123,11,TRUE)","v":{"$error":"#N/A"}},{"$f":"VLOOKUP(A158,Plan!$A$6:$V$123,12,TRUE)","v":{"$error":"#N/A"}},{"$f":"VLOOKUP(A158,Plan!$A$6:$V$123,13,TRUE)","v":{"$error":"#N/A"}},{"$f":"VLOOKUP(A158,Plan!$A$6:$V$123,14,TRUE)","v":{"$error":"#N/A"}},{"$f":"VLOOKUP(A158,Plan!$A$6:$V$123,15,TRUE)","v":{"$error":"#N/A"}},{"$f":"VLOOKUP(A158,Plan!$A$6:$V$123,16,TRUE)","v":{"$error":"#N/A"}},{"$f":"VLOOKUP(A158,Plan!$A$6:$V$123,17,TRUE)","v":{"$error":"#N/A"}},{"$f":"VLOOKUP(A158,Plan!$A$6:$V$123,18,TRUE)","v":{"$error":"#N/A"}},{"$f":"VLOOKUP(A158,Plan!$A$6:$V$123,19,TRUE)","v":{"$error":"#N/A"}},{"$f":"VLOOKUP(A158,Plan!$A$6:$V$123,20,TRUE)","v":{"$error":"#N/A"}},{"$f":"VLOOKUP(A158,Plan!$A$6:$V$123,21,TRUE)","v":{"$error":"#N/A"}}]
[{"$nulls":4},{"$f":"VLOOKUP(A159,Plan!$A$6:$V$123,3,TRUE)","v":{"$error":"#N/A"}},{"$f":"VLOOKUP(A159,Plan!$A$6:$V$123,7,TRUE)","v":{"$error":"#N/A"}},{"$f":"VLOOKUP(A159,Plan!$A$6:$V$123,8,TRUE)","v":{"$error":"#N/A"}},{"$f":"VLOOKUP(A159,Plan!$A$6:$V$123,9,TRUE)","v":{"$error":"#N/A"}},{"$f":"VLOOKUP(A159,Plan!$A$6:$V$123,10,TRUE)","v":{"$error":"#N/A"}},{"$f":"VLOOKUP(A159,Plan!$A$6:$V$123,11,TRUE)","v":{"$error":"#N/A"}},{"$f":"VLOOKUP(A159,Plan!$A$6:$V$123,12,TRUE)","v":{"$error":"#N/A"}},{"$f":"VLOOKUP(A159,Plan!$A$6:$V$123,13,TRUE)","v":{"$error":"#N/A"}},{"$f":"VLOOKUP(A159,Plan!$A$6:$V$123,14,TRUE)","v":{"$error":"#N/A"}},{"$f":"VLOOKUP(A159,Plan!$A$6:$V$123,15,TRUE)","v":{"$error":"#N/A"}},{"$f":"VLOOKUP(A159,Plan!$A$6:$V$123,16,TRUE)","v":{"$error":"#N/A"}},{"$f":"VLOOKUP(A159,Plan!$A$6:$V$123,17,TRUE)","v":{"$error":"#N/A"}},{"$f":"VLOOKUP(A159,Plan!$A$6:$V$123,18,TRUE)","v":{"$error":"#N/A"}},{"$f":"VLOOKUP(A159,Plan!$A$6:$V$123,19,TRUE)","v":{"$error":"#N/A"}},{"$f":"VLOOKUP(A159,Plan!$A$6:$V$123,20,TRUE)","v":{"$error":"#N/A"}},{"$f":"VLOOKUP(A159,Plan!$A$6:$V$123,21,TRUE)","v":{"$error":"#N/A"}}]
[{"$nulls":4},{"$f":"VLOOKUP(A160,Plan!$A$6:$V$123,3,TRUE)","v":{"$error":"#N/A"}},{"$f":"VLOOKUP(A160,Plan!$A$6:$V$123,7,TRUE)","v":{"$error":"#N/A"}},{"$f":"VLOOKUP(A160,Plan!$A$6:$V$123,8,TRUE)","v":{"$error":"#N/A"}},{"$f":"VLOOKUP(A160,Plan!$A$6:$V$123,9,TRUE)","v":{"$error":"#N/A"}},{"$f":"VLOOKUP(A160,Plan!$A$6:$V$123,10,TRUE)","v":{"$error":"#N/A"}},{"$f":"VLOOKUP(A160,Plan!$A$6:$V$123,11,TRUE)","v":{"$error":"#N/A"}},{"$f":"VLOOKUP(A160,Plan!$A$6:$V$123,12,TRUE)","v":{"$error":"#N/A"}},{"$f":"VLOOKUP(A160,Plan!$A$6:$V$123,13,TRUE)","v":{"$error":"#N/A"}},{"$f":"VLOOKUP(A160,Plan!$A$6:$V$123,14,TRUE)","v":{"$error":"#N/A"}},{"$f":"VLOOKUP(A160,Plan!$A$6:$V$123,15,TRUE)","v":{"$error":"#N/A"}},{"$f":"VLOOKUP(A160,Plan!$A$6:$V$123,16,TRUE)","v":{"$error":"#N/A"}},{"$f":"VLOOKUP(A160,Plan!$A$6:$V$123,17,TRUE)","v":{"$error":"#N/A"}},{"$f":"VLOOKUP(A160,Plan!$A$6:$V$123,18,TRUE)","v":{"$error":"#N/A"}},{"$f":"VLOOKUP(A160,Plan!$A$6:$V$123,19,TRUE)","v":{"$error":"#N/A"}},{"$f":"VLOOKUP(A160,Plan!$A$6:$V$123,20,TRUE)","v":{"$error":"#N/A"}},{"$f":"VLOOKUP(A160,Plan!$A$6:$V$123,21,TRUE)","v":{"$error":"#N/A"}}]
[{"$nulls":4},{"$f":"VLOOKUP(A161,Plan!$A$6:$V$123,3,TRUE)","v":{"$error":"#N/A"}},{"$f":"VLOOKUP(A161,Plan!$A$6:$V$123,7,TRUE)","v":{"$error":"#N/A"}},{"$f":"VLOOKUP(A161,Plan!$A$6:$V$123,8,TRUE)","v":{"$error":"#N/A"}},{"$f":"VLOOKUP(A161,Plan!$A$6:$V$123,9,TRUE)","v":{"$error":"#N/A"}},{"$f":"VLOOKUP(A161,Plan!$A$6:$V$123,10,TRUE)","v":{"$error":"#N/A"}},{"$f":"VLOOKUP(A161,Plan!$A$6:$V$123,11,TRUE)","v":{"$error":"#N/A"}},{"$f":"VLOOKUP(A161,Plan!$A$6:$V$123,12,TRUE)","v":{"$error":"#N/A"}},{"$f":"VLOOKUP(A161,Plan!$A$6:$V$123,13,TRUE)","v":{"$error":"#N/A"}},{"$f":"VLOOKUP(A161,Plan!$A$6:$V$123,14,TRUE)","v":{"$error":"#N/A"}},{"$f":"VLOOKUP(A161,Plan!$A$6:$V$123,15,TRUE)","v":{"$error":"#N/A"}},{"$f":"VLOOKUP(A161,Plan!$A$6:$V$123,16,TRUE)","v":{"$error":"#N/A"}},{"$f":"VLOOKUP(A161,Plan!$A$6:$V$123,17,TRUE)","v":{"$error":"#N/A"}},{"$f":"VLOOKUP(A161,Plan!$A$6:$V$123,18,TRUE)","v":{"$error":"#N/A"}},{"$f":"VLOOKUP(A161,Plan!$A$6:$V$123,19,TRUE)","v":{"$error":"#N/A"}},{"$f":"VLOOKUP(A161,Plan!$A$6:$V$123,20,TRUE)","v":{"$error":"#N/A"}},{"$f":"VLOOKUP(A161,Plan!$A$6:$V$123,21,TRUE)","v":{"$error":"#N/A"}}]
[{"$nulls":4},{"$f":"VLOOKUP(A162,Plan!$A$6:$V$123,3,TRUE)","v":{"$error":"#N/A"}},{"$f":"VLOOKUP(A162,Plan!$A$6:$V$123,7,TRUE)","v":{"$error":"#N/A"}},{"$f":"VLOOKUP(A162,Plan!$A$6:$V$123,8,TRUE)","v":{"$error":"#N/A"}},{"$f":"VLOOKUP(A162,Plan!$A$6:$V$123,9,TRUE)","v":{"$error":"#N/A"}},{"$f":"VLOOKUP(A162,Plan!$A$6:$V$123,10,TRUE)","v":{"$error":"#N/A"}},{"$f":"VLOOKUP(A162,Plan!$A$6:$V$123,11,TRUE)","v":{"$error":"#N/A"}},{"$f":"VLOOKUP(A162,Plan!$A$6:$V$123,12,TRUE)","v":{"$error":"#N/A"}},{"$f":"VLOOKUP(A162,Plan!$A$6:$V$123,13,TRUE)","v":{"$error":"#N/A"}},{"$f":"VLOOKUP(A162,Plan!$A$6:$V$123,14,TRUE)","v":{"$error":"#N/A"}},{"$f":"VLOOKUP(A162,Plan!$A$6:$V$123,15,TRUE)","v":{"$error":"#N/A"}},{"$f":"VLOOKUP(A162,Plan!$A$6:$V$123,16,TRUE)","v":{"$error":"#N/A"}},{"$f":"VLOOKUP(A162,Plan!$A$6:$V$123,17,TRUE)","v":{"$error":"#N/A"}},{"$f":"VLOOKUP(A162,Plan!$A$6:$V$123,18,TRUE)","v":{"$error":"#N/A"}},{"$f":"VLOOKUP(A162,Plan!$A$6:$V$123,19,TRUE)","v":{"$error":"#N/A"}},{"$f":"VLOOKUP(A162,Plan!$A$6:$V$123,20,TRUE)","v":{"$error":"#N/A"}},{"$f":"VLOOKUP(A162,Plan!$A$6:$V$123,21,TRUE)","v":{"$error":"#N/A"}}]
["110525","CHEF HOTESSE ACCUEIL",null,null,{"$f":"VLOOKUP(A163,Plan!$A$6:$V$123,3,TRUE)","v":"35h00"},{"$f":"VLOOKUP(A163,Plan!$A$6:$V$123,7,TRUE)","v":"35h00"},{"$f":"VLOOKUP(A163,Plan!$A$6:$V$123,8,TRUE)","v":"R"},{"$f":"VLOOKUP(A163,Plan!$A$6:$V$123,9,TRUE)","v":0},{"$f":"VLOOKUP(A163,Plan!$A$6:$V$123,10,TRUE)","v":0},{"$f":"VLOOKUP(A163,Plan!$A$6:$V$123,11,TRUE)","v":"16h-23h30#"},{"$f":"VLOOKUP(A163,Plan!$A$6:$V$123,12,TRUE)","v":0},{"$f":"VLOOKUP(A163,Plan!$A$6:$V$123,13,TRUE)","v":"16h-23h30#"},{"$f":"VLOOKUP(A163,Plan!$A$6:$V$123,14,TRUE)","v":0},{"$f":"VLOOKUP(A163,Plan!$A$6:$V$123,15,TRUE)","v":"16h-23h30#"},{"$f":"VLOOKUP(A163,Plan!$A$6:$V$123,16,TRUE)","v":0},{"$f":"VLOOKUP(A163,Plan!$A$6:$V$123,17,TRUE)","v":"16h-23h30#"},{"$f":"VLOOKUP(A163,Plan!$A$6:$V$123,18,TRUE)","v":0},{"$f":"VLOOKUP(A163,Plan!$A$6:$V$123,19,TRUE)","v":"16h-23h30#"},{"$f":"VLOOKUP(A163,Plan!$A$6:$V$123,20,TRUE)","v":"R"},{"$f":"VLOOKUP(A163,Plan!$A$6:$V$123,21,TRUE)","v":0}]
["141171","HOTESSE ACCUEIL",null,null,{"$f":"VLOOKUP(A164,Plan!$A$6:$V$123,3,TRUE)","v":"18h00"},{"$f":"VLOOKUP(A164,Plan!$A$6:$V$123,7,TRUE)","v":"18h00"},{"$f":"VLOOKUP(A164,Plan!$A$6:$V$123,8,TRUE)","v":0},{"$f":"VLOOKUP(A164,Plan!$A$6:$V$123,9,TRUE)","v":"18h30-23h#"},{"$f":"VLOOKUP(A164,Plan!$A$6:$V$123,10,TRUE)","v":"R"},{"$f":"VLOOKUP(A164,Plan!$A$6:$V$123,11,TRUE)","v":0},{"$f":"VLOOKUP(A164,Plan!$A$6:$V$123,12,TRUE)","v":"R"},{"$f":"VLOOKUP(A164,Plan!$A$6:$V$123,13,TRUE)","v":0},{"$f":"VLOOKUP(A164,Plan!$A$6:$V$123,14,TRUE)","v":0},{"$f":"VLOOKUP(A164,Plan!$A$6:$V$123,15,TRUE)","v":"18h30-22h#"},{"$f":"VLOOKUP(A164,Plan!$A$6:$V$123,16,TRUE)","v":0},{"$f":"VLOOKUP(A164,Plan!$A$6:$V$123,17,TRUE)","v":"18h30-22h30#"},{"$f":"VLOOKUP(A164,Plan!$A$6:$V$123,18,TRUE)","v":0},{"$f":"VLOOKUP(A164,Plan!$A$6:$V$123,19,TRUE)","v":"18h30-22h30#"},{"$f":"VLOOKUP(A164,Plan!$A$6:$V$123,20,TRUE)","v":0},{"$f":"VLOOKUP(A164,Plan!$A$6:$V$123,21,TRUE)","v":"18h30-23h#"}]
["911095","HOTESSE ACCUEIL",null,null,{"$f":"VLOOKUP(A165,Plan!$A$6:$V$123,3,TRUE)","v":"35h00"},{"$f":"VLOOKUP(A165,Plan!$A$6:$V$123,7,TRUE)","v":"00h00"},{"$f":"VLOOKUP(A165,Plan!$A$6:$V$123,8,TRUE)","v":"CIF"},{"$f":"VLOOKUP(A165,Plan!$A$6:$V$123,9,TRUE)","v":0},{"$f":"VLOOKUP(A165,Plan!$A$6:$V$123,10,TRUE)","v":"CIF"},{"$f":"VLOOKUP(A165,Plan!$A$6:$V$123,11,TRUE)","v":0},{"$f":"VLOOKUP(A165,Plan!$A$6:$V$123,12,TRUE)","v":"R"},{"$f":"VLOOKUP(A165,Plan!$A$6:$V$123,13,TRUE)","v":0},{"$f":"VLOOKUP(A165,Plan!$A$6:$V$123,14,TRUE)","v":"R"},{"$f":"VLOOKUP(A165,Plan!$A$6:$V$123,15,TRUE)","v":0},{"$f":"VLOOKUP(A165,Plan!$A$6:$V$123,16,TRUE)","v":"CIF"},{"$f":"VLOOKUP(A165,Plan!$A$6:$V$123,17,TRUE)","v":0},{"$f":"VLOOKUP(A165,Plan!$A$6:$V$123,18,TRUE)","v":"CIF"},{"$f":"VLOOKUP(A165,Plan!$A$6:$V$123,19,TRUE)","v":0},{"$f":"VLOOKUP(A165,Plan!$A$6:$V$123,20,TRUE)","v":"CIF"},{"$f":"VLOOKUP(A165,Plan!$A$6:$V$123,21,TRUE)","v":0}]
["501051","HOTESSE ACCUEIL",null,null,{"$f":"VLOOKUP(A166,Plan!$A$6:$V$123,3,TRUE)","v":"39h00"},{"$f":"VLOOKUP(A166,Plan!$A$6:$V$123,7,TRUE)","v":"00h00"},{"$f":"VLOOKUP(A166,Plan!$A$6:$V$123,8,TRUE)","v":"CIF"},{"$f":"VLOOKUP(A166,Plan!$A$6:$V$123,9,TRUE)","v":0},{"$f":"VLOOKUP(A166,Plan!$A$6:$V$123,10,TRUE)","v":"CIF"},{"$f":"VLOOKUP(A166,Plan!$A$6:$V$123,11,TRUE)","v":0},{"$f":"VLOOKUP(A166,Plan!$A$6:$V$123,12,TRUE)","v":"CIF"},{"$f":"VLOOKUP(A166,Plan!$A$6:$V$123,13,TRUE)","v":0},{"$f":"VLOOKUP(A166,Plan!$A$6:$V$123,14,TRUE)","v":"CIF"},{"$f":"VLOOKUP(A166,Plan!$A$6:$V$123,15,TRUE)","v":0},{"$f":"VLOOKUP(A166,Plan!$A$6:$V$123,16,TRUE)","v":"CIF"},{"$f":"VLOOKUP(A166,Plan!$A$6:$V$123,17,TRUE)","v":0},{"$f":"VLOOKUP(A166,Plan!$A$6:$V$123,18,TRUE)","v":"R"},{"$f":"VLOOKUP(A166,Plan!$A$6:$V$123,19,TRUE)","v":0},{"$f":"VLOOKUP(A166,Plan!$A$6:$V$123,20,TRUE)","v":"R"},{"$f":"VLOOKUP(A166,Plan!$A$6:$V$123,21,TRUE)","v":0}]
["171014","HOTESSE ACCUEIL",null,null,{"$f":"VLOOKUP(A167,Plan!$A$6:$V$123,3,TRUE)","v":"15h00"},{"$f":"VLOOKUP(A167,Plan!$A$6:$V$123,7,TRUE)","v":"07h30"},{"$f":"VLOOKUP(A167,Plan!$A$6:$V$123,8,TRUE)","v":"R"},{"$f":"VLOOKUP(A167,Plan!$A$6:$V$123,9,TRUE)","v":0},{"$f":"VLOOKUP(A167,Plan!$A$6:$V$123,10,TRUE)","v":"R"},{"$f":"VLOOKUP(A167,Plan!$A$6:$V$123,11,TRUE)","v":0},{"$f":"VLOOKUP(A167,Plan!$A$6:$V$123,12,TRUE)","v":"R"},{"$f":"VLOOKUP(A167,Plan!$A$6:$V$123,13,TRUE)","v":0},{"$f":"VLOOKUP(A167,Plan!$A$6:$V$123,14,TRUE)","v":"R"},{"$f":"VLOOKUP(A167,Plan!$A$6:$V$123,15,TRUE)","v":0},{"$f":"VLOOKUP(A167,Plan!$A$6:$V$123,16,TRUE)","v":"R"},{"$f":"VLOOKUP(A167,Plan!$A$6:$V$123,17,TRUE)","v":0},{"$f":"VLOOKUP(A167,Plan!$A$6:$V$123,18,TRUE)","v":"CNP"},{"$f":"VLOOKUP(A167,Plan!$A$6:$V$123,19,TRUE)","v":0},{"$f":"VLOOKUP(A167,Plan!$A$6:$V$123,20,TRUE)","v":"11h-19h#"},{"$f":"VLOOKUP(A167,Plan!$A$6:$V$123,21,TRUE)","v":0}]
["504061","HOTESSE ACCUEIL",null,null,{"$f":"VLOOKUP(A168,Plan!$A$6:$V$123,3,TRUE)","v":"24h30"},{"$f":"VLOOKUP(A168,Plan!$A$6:$V$123,7,TRUE)","v":"00h00"},{"$f":"VLOOKUP(A168,Plan!$A$6:$V$123,8,TRUE)","v":"R"},{"$f":"VLOOKUP(A168,Plan!$A$6:$V$123,9,TRUE)","v":0},{"$f":"VLOOKUP(A168,Plan!$A$6:$V$123,10,TRUE)","v":"R"},{"$f":"VLOOKUP(A168,Plan!$A$6:$V$123,11,TRUE)","v":0},{"$f":"VLOOKUP(A168,Plan!$A$6:$V$123,12,TRUE)","v":"R"},{"$f":"VLOOKUP(A168,Plan!$A$6:$V$123,13,TRUE)","v":0},{"$f":"VLOOKUP(A168,Plan!$A$6:$V$123,14,TRUE)","v":"MAL"},{"$f":"VLOOKUP(A168,Plan!$A$6:$V$123,15,TRUE)","v":0},{"$f":"VLOOKUP(A168,Plan!$A$6:$V$123,16,TRUE)","v":"MAL"},{"$f":"VLOOKUP(A168,Plan!$A$6:$V$123,17,TRUE)","v":0},{"$f":"VLOOKUP(A168,Plan!$A$6:$V$123,18,TRUE)","v":"MAL"},{"$f":"VLOOKUP(A168,Plan!$A$6:$V$123,19,TRUE)","v":0},{"$f":"VLOOKUP(A168,Plan!$A$6:$V$123,20,TRUE)","v":"R"},{"$f":"VLOOKUP(A168,Plan!$A$6:$V$123,21,TRUE)","v":0}]
["171214","HOTESSE ACCUEIL",null,null,{"$f":"VLOOKUP(A169,Plan!$A$6:$V$123,3,TRUE)","v":"25h00"},{"$f":"VLOOKUP(A169,Plan!$A$6:$V$123,7,TRUE)","v":"25h00"},{"$f":"VLOOKUP(A169,Plan!$A$6:$V$123,8,TRUE)","v":0},{"$f":"VLOOKUP(A169,Plan!$A$6:$V$123,9,TRUE)","v":"18h-22h30#"},{"$f":"VLOOKUP(A169,Plan!$A$6:$V$123,10,TRUE)","v":"R"},{"$f":"VLOOKUP(A169,Plan!$A$6:$V$123,11,TRUE)","v":0},{"$f":"VLOOKUP(A169,Plan!$A$6:$V$123,12,TRUE)","v":"R"},{"$f":"VLOOKUP(A169,Plan!$A$6:$V$123,13,TRUE)","v":0},{"$f":"VLOOKUP(A169,Plan!$A$6:$V$123,14,TRUE)","v":0},{"$f":"VLOOKUP(A169,Plan!$A$6:$V$123,15,TRUE)","v":"18h-23h30#"},{"$f":"VLOOKUP(A169,Plan!$A$6:$V$123,16,TRUE)","v":0},{"$f":"VLOOKUP(A169,Plan!$A$6:$V$123,17,TRUE)","v":"17h30-00h30#"},{"$f":"VLOOKUP(A169,Plan!$A$6:$V$123,18,TRUE)","v":0},{"$f":"VLOOKUP(A169,Plan!$A$6:$V$123,19,TRUE)","v":"18h30-00h30#"},{"$f":"VLOOKUP(A169,Plan!$A$6:$V$123,20,TRUE)","v":0},{"$f":"VLOOKUP(A169,Plan!$A$6:$V$123,21,TRUE)","v":"18h-22h30#"}]
["607043","HOTESSE ACCUEIL",null,null,{"$f":"VLOOKUP(A170,Plan!$A$6:$V$123,3,TRUE)","v":"39h00"},{"$f":"VLOOKUP(A170,Plan!$A$6:$V$123,7,TRUE)","v":"39h00"},{"$f":"VLOOKUP(A170,Plan!$A$6:$V$123,8,TRUE)","v":"09h30-17h#"},{"$f":"VLOOKUP(A170,Plan!$A$6:$V$123,9,TRUE)","v":0},{"$f":"VLOOKUP(A170,Plan!$A$6:$V$123,10,TRUE)","v":"09h30-17h#"},{"$f":"VLOOKUP(A170,Plan!$A$6:$V$123,11,TRUE)","v":0},{"$f":"VLOOKUP(A170,Plan!$A$6:$V$123,12,TRUE)","v":"R"},{"$f":"VLOOKUP(A170,Plan!$A$6:$V$123,13,TRUE)","v":0},{"$f":"VLOOKUP(A170,Plan!$A$6:$V$123,14,TRUE)","v":"R"},{"$f":"VLOOKUP(A170,Plan!$A$6:$V$123,15,TRUE)","v":0},{"$f":"VLOOKUP(A170,Plan!$A$6:$V$123,16,TRUE)","v":"09h-17h#"},{"$f":"VLOOKUP(A170,Plan!$A$6:$V$123,17,TRUE)","v":0},{"$f":"VLOOKUP(A170,Plan!$A$6:$V$123,18,TRUE)","v":"09h-18h#"},{"$f":"VLOOKUP(A170,Plan!$A$6:$V$123,19,TRUE)","v":0},{"$f":"VLOOKUP(A170,Plan!$A$6:$V$123,20,TRUE)","v":"09h-18h30#"},{"$f":"VLOOKUP(A170,Plan!$A$6:$V$123,21,TRUE)","v":0}]
{"$rows_empty":10}
["  "]
[null,"  ","",null,"","","","","","","","","","","","","","","",""]
[]
[{"$nulls":6},{"$f":"G13","v":42107},null,{"$f":"I13","v":42108},null,{"$f":"K13","v":42109},null,{"$f":"M13","v":42110},null,{"$f":"O13","v":42111},null,{"$f":"Q13","v":42112},null,{"$f":"S13","v":42113}]
[null,"  ","","DA  MIDI ",null,"",{"$f":"COUNTIF(G20:G23,\"-.*\")","v":0},null,{"$f":"COUNTIF(I20:I23,\"07h30-15h48#\")+COUNTIF(J20:J23,\"14h-22h#\")+COUNTIF(I20:I23,\"11h30-19h48#\")+COUNTIF(I20:I23,\"10h-18h18#\")+COUNTIF(I20:I23,\"11h-20h30#\")","v":0},null,{"$f":"COUNTIF(K20:K23,\"07h30-15h48#\")+COUNTIF(L20:L23,\"14h-22h#\")+COUNTIF(K20:K23,\"11h30-19h48#\")+COUNTIF(K20:K23,\"10h-18h18#\")+COUNTIF(K20:K23,\"11h-20h30#\")","v":1},null,{"$f":"COUNTIF(M20:M23,\"07h30-15h48#\")+COUNTIF(N20:N23,\"14h-22h#\")+COUNTIF(M20:M23,\"11h30-19h48#\")+COUNTIF(M20:M23,\"10h-18h18#\")+COUNTIF(M20:M23,\"11h-20h30#\")","v":1},null,{"$f":"COUNTIF(O20:O23,\"07h30-15h48#\")+COUNTIF(P20:P23,\"14h-22h#\")+COUNTIF(O20:O23,\"11h30-19h48#\")+COUNTIF(O20:O23,\"10h-18h18#\")+COUNTIF(O20:O23,\"11h-20h30#\")","v":1},null,{"$f":"COUNTIF(Q20:Q23,\"07h30-15h48#\")+COUNTIF(R20:R23,\"14h-22h#\")+COUNTIF(Q20:Q23,\"11h30-19h48#\")+COUNTIF(Q20:Q23,\"10h-18h18#\")+COUNTIF(Q20:Q23,\"11h-20h30#\")","v":0},null,{"$f":"COUNTIF(S20:S23,\"07h30-15h48#\")+COUNTIF(T20:T23,\"14h-22h#\")+COUNTIF(S20:S23,\"11h30-19h48#\")+COUNTIF(S20:S23,\"10h-18h18#\")+COUNTIF(S20:S23,\"11h-20h30#\")","v":0}]
[null,"  ","","DA  SOIR",null,"",{"$f":"COUNTIF(H20:H23,\"18h12-02h30#\")+COUNTIF(H20:H23,\"18h30-02h48#\")+COUNTIF(H20:H23,\"16h00-00h18#\")","v":1},null,{"$f":"COUNTIF(J20:J23,\"18h12-02h30#\")+COUNTIF(J20:J23,\"18h30-02h48#\")+COUNTIF(J20:J23,\"16h00-00h18#\")","v":1},null,{"$f":"COUNTIF(L20:L23,\"18h12-02h30#\")+COUNTIF(L20:L23,\"18h30-02h48#\")+COUNTIF(L20:L23,\"16h00-00h18#\")","v":1},null,{"$f":"COUNTIF(N20:N23,\"18h12-02h30#\")+COUNTIF(N20:N23,\"18h30-02h48#\")+COUNTIF(N20:N23,\"16h00-00h18#\")","v":1},null,{"$f":"COUNTIF(P20:P23,\"18h12-02h30#\")+COUNTIF(P20:P23,\"18h30-02h48#\")+COUNTIF(P20:P23,\"16h00-00h18#\")","v":2},null,{"$f":"COUNTIF(R20:R23,\"18h12-02h30#\")+COUNTIF(R20:R23,\"18h30-02h48#\")+COUNTIF(R20:R23,\"16h00-00h18#\")","v":1},null,{"$f":"COUNTIF(T20:T23,\"18h12-02h30#\")+COUNTIF(T20:T23,\"18h30-02h48#\")+COUNTIF(T20:T23,\"16h00-00h18#\")","v":1}]
[null,"  ","","MDH RESP JOUR",null,"",{"$f":"COUNTIF(G29:G33,\"10h-18h30#\")+COUNTIF(G29:G33,\"07h30-17h#\")+COUNTIF(G29:G33,\"08h-16h#\")+COUNTIF(G29:G33,\"08h-15h30#\")","v":0},null,{"$f":"COUNTIF(I29:I33,\"10h-18h30#\")+COUNTIF(I29:I33,\"07h30-17h#\")+COUNTIF(I29:I33,\"08h-16h#\")+COUNTIF(I29:I33,\"08h-15h30#\")","v":1},null,{"$f":"COUNTIF(K29:K33,\"10h-18h30#\")+COUNTIF(K29:K33,\"07h30-17h#\")+COUNTIF(K29:K33,\"08h-16h#\")+COUNTIF(K29:K33,\"08h-15h30#\")","v":1},null,{"$f":"COUNTIF(M29:M33,\"10h-18h30#\")+COUNTIF(M29:M33,\"07h30-17h#\")+COUNTIF(M29:M33,\"08h-16h#\")+COUNTIF(M29:M33,\"08h-15h30#\")","v":1},null,{"$f":"COUNTIF(O29:O33,\"10h-18h30#\")+COUNTIF(O29:O33,\"07h30-17h#\")+COUNTIF(O29:O33,\"08h-16h#\")+COUNTIF(O29:O33,\"08h-15h30#\")","v":1},null,{"$f":"COUNTIF(Q29:Q33,\"10h-18h30#\")+COUNTIF(Q29:Q33,\"07h30-17h#\")+COUNTIF(Q29:Q33,\"08h-16h#\")+COUNTIF(Q29:Q33,\"08h-15h30#\")","v":1},null,{"$f":"COUNTIF(S29:S33,\"10h-18h30#\")+COUNTIF(S29:S33,\"07h30-17h#\")+COUNTIF(S29:S33,\"08h-16h#\")+COUNTIF(S29:S33,\"08h-15h30#\")","v":1}]
[null,"  ","","MDH RESP SOIR",null,"",{"$f":"+COUNTIF(H29:H33,\"19h-02h#\")+COUNTIF(H29:H33,\"14h30-23h#\")+COUNTIF(H29:H33,\"18h-02h#\")+COUNTIF(H29:H33,\"18h30-02h#\")+COUNTIF(H29:H33,\"17h30-24h#\")+COUNTIF(H29:H33,\"19h-01h#\")+COUNTIF(H29:H33,\"14h30-23H30#\")+COUNTIF(H29:H33,\"19h-01H30#\")","v":1},null,{"$f":"+COUNTIF(J29:J33,\"19h-02h#\")+COUNTIF(J29:J33,\"14h30-23h#\")+COUNTIF(J29:J33,\"18h-02h#\")+COUNTIF(J29:J33,\"18h30-02h#\")+COUNTIF(J29:J33,\"17h30-24h#\")+COUNTIF(J29:J33,\"19h-01h#\")+COUNTIF(J29:J33,\"14h30-23H30#\")+COUNTIF(J29:J33,\"19h-01H30#\")","v":3},null,{"$f":"+COUNTIF(L29:L33,\"19h-02h#\")+COUNTIF(L29:L33,\"14h30-23h#\")+COUNTIF(L29:L33,\"18h-02h#\")+COUNTIF(L29:L33,\"18h30-02h#\")+COUNTIF(L29:L33,\"17h30-24h#\")+COUNTIF(L29:L33,\"19h-01h#\")+COUNTIF(L29:L33,\"14h30-23H30#\")+COUNTIF(L29:L33,\"19h-01H30#\")","v":3},null,{"$f":"+COUNTIF(N29:N33,\"19h-02h#\")+COUNTIF(N29:N33,\"14h30-23h#\")+COUNTIF(N29:N33,\"18h-02h#\")+COUNTIF(N29:N33,\"18h30-02h#\")+COUNTIF(N29:N33,\"17h30-24h#\")+COUNTIF(N29:N33,\"19h-01h#\")+COUNTIF(N29:N33,\"14h30-23H30#\")+COUNTIF(N29:N33,\"19h-01H30#\")","v":2},null,{"$f":"+COUNTIF(P29:P33,\"19h-02h#\")+COUNTIF(P29:P33,\"14h30-23h#\")+COUNTIF(P29:P33,\"18h-02h#\")+COUNTIF(P29:P33,\"18h30-02h#\")+COUNTIF(P29:P33,\"17h30-24h#\")+COUNTIF(P29:P33,\"19h-01h#\")+COUNTIF(P29:P33,\"14h30-23H30#\")+COUNTIF(P29:P33,\"19h-01H30#\")","v":2},null,{"$f":"+COUNTIF(R29:R33,\"19h-02h#\")+COUNTIF(R29:R33,\"14h30-23h#\")+COUNTIF(R29:R33,\"18h-02h#\")+COUNTIF(R29:R33,\"18h30-02h#\")+COUNTIF(R29:R33,\"17h30-24h#\")+COUNTIF(R29:R33,\"19h-01h#\")+COUNTIF(R29:R33,\"14h30-23H30#\")+COUNTIF(R29:R33,\"19h-01H30#\")","v":3},null,{"$f":"+COUNTIF(T29:T33,\"19h-02h#\")+COUNTIF(T29:T33,\"14h30-23h#\")+COUNTIF(T29:T33,\"18h-02h#\")+COUNTIF(T29:T33,\"18h30-02h#\")+COUNTIF(T29:T33,\"17h30-24h#\")+COUNTIF(T29:T33,\"19h-01h#\")+COUNTIF(T29:T33,\"14h30-23H30#\")+COUNTIF(T29:T33,\"19h-01H30#\")","v":1}]
[null,"  ","","MDH MATIN",null,"",{"$f":"COUNTIF(G45:G67,\"09h-17h18#\")+COUNTIF(G45:G67,\"08h-16h18#\")+COUNTIF(G45:G67,\"11h45-15h#\")+COUNTIF(G45:G67,\"09h30-17h30#\")+COUNTIF(G45:G67,\"08h30-18h#\")+COUNTIF(G45:G67,\"07h-15h18#\")+COUNTIF(G45:G67,\"10h-18h18#\")+COUNTIF(G45:G67,\"11h45-16h#\")+COUNTIF(G45:G67,\"11h45-15h30#\")+COUNTIF(G45:G67,\"11h30-17h#\")","v":5},null,{"$f":"COUNTIF(I45:I67,\"09h-17h18#\")+COUNTIF(I45:I67,\"08h-16h18#\")+COUNTIF(I45:I67,\"11h45-15h#\")+COUNTIF(I45:I67,\"09h30-17h30#\")+COUNTIF(I45:I67,\"08h30-18h#\")+COUNTIF(I45:I67,\"07h-15h18#\")+COUNTIF(I45:I67,\"10h-18h18#\")+COUNTIF(I45:I67,\"11h45-16h#\")+COUNTIF(I45:I67,\"11h45-15h30#\")+COUNTIF(I45:I67,\"11h30-17h#\")","v":7},null,{"$f":"COUNTIF(K45:K67,\"09h-17h18#\")+COUNTIF(K45:K67,\"08h-16h18#\")+COUNTIF(K45:K67,\"11h45-15h#\")+COUNTIF(K45:K67,\"09h30-17h30#\")+COUNTIF(K45:K67,\"08h30-18h#\")+COUNTIF(K45:K67,\"07h-15h18#\")+COUNTIF(K45:K67,\"10h-18h18#\")+COUNTIF(K45:K67,\"11h45-16h#\")+COUNTIF(K45:K67,\"11h45-15h30#\")+COUNTIF(K45:K67,\"11h30-17h#\")","v":8},null,{"$f":"COUNTIF(M45:M67,\"09h-17h18#\")+COUNTIF(M45:M67,\"08h-16h18#\")+COUNTIF(M45:M67,\"11h45-15h#\")+COUNTIF(M45:M67,\"09h30-17h30#\")+COUNTIF(M45:M67,\"08h30-18h#\")+COUNTIF(M45:M67,\"07h-15h18#\")+COUNTIF(M45:M67,\"10h-18h18#\")+COUNTIF(M45:M67,\"11h45-16h#\")+COUNTIF(M45:M67,\"11h45-15h30#\")+COUNTIF(M45:M67,\"11h30-17h#\")","v":8},null,{"$f":"COUNTIF(O45:O67,\"09h-17h18#\")+COUNTIF(O45:O67,\"08h-16h18#\")+COUNTIF(O45:O67,\"11h45-15h#\")+COUNTIF(O45:O67,\"09h30-17h30#\")+COUNTIF(O45:O67,\"08h30-18h#\")+COUNTIF(O45:O67,\"07h-15h18#\")+COUNTIF(O45:O67,\"10h-18h18#\")+COUNTIF(O45:O67,\"11h45-16h#\")+COUNTIF(O45:O67,\"11h45-15h30#\")+COUNTIF(O45:O67,\"11h30-17h#\")","v":9},null,{"$f":"COUNTIF(Q45:Q67,\"09h-17h18#\")+COUNTIF(Q45:Q67,\"08h-16h18#\")+COUNTIF(Q45:Q67,\"11h45-15h#\")+COUNTIF(Q45:Q67,\"09h30-17h30#\")+COUNTIF(Q45:Q67,\"08h30-18h#\")+COUNTIF(Q45:Q67,\"07h-15h18#\")+COUNTIF(Q45:Q67,\"10h-18h18#\")+COUNTIF(Q45:Q67,\"11h45-16h#\")+COUNTIF(Q45:Q67,\"11h45-15h30#\")+COUNTIF(Q45:Q67,\"11h30-17h#\")","v":9},null,{"$f":"COUNTIF(S45:S67,\"09h-17h18#\")+COUNTIF(S45:S67,\"08h-16h18#\")+COUNTIF(S45:S67,\"11h45-15h#\")+COUNTIF(S45:S67,\"09h30-17h30#\")+COUNTIF(S45:S67,\"08h30-18h#\")+COUNTIF(S45:S67,\"07h-15h18#\")+COUNTIF(S45:S67,\"10h-18h18#\")+COUNTIF(S45:S67,\"11h45-16h#\")+COUNTIF(S45:S67,\"11h45-15h30#\")+COUNTIF(S45:S67,\"11h30-17h#\")","v":7}]
[null,"  ","","MDH SOIR",null,"",{"$f":"COUNTIF(H45:H67,\"18h-02h#\")+COUNTIF(H45:H67,\"17h30-02h#\")+COUNTIF(H45:H67,\"17h-02h#\")+COUNTIF(H45:H67,\"18h30-24h15#\")+COUNTIF(H45:H67,\"18h30-24h#\")+COUNTIF(H45:H67,\"18h-02h18#\")+COUNTIF(H45:H67,\"18h-02h30#\")+COUNTIF(H45:H67,\"16h-00h18#\")+COUNTIF(H45:H67,\"18h30-23h#\")+COUNTIF(H45:H67,\"18h-01h30#\")+COUNTIF(H45:H67,\"18h30-23h15#\")+COUNTIF(H45:H67,\"18h-01h45#\")+COUNTIF(H45:H67,\"16h-01h45#\")+COUNTIF(H45:H67,\"17h30-02h30#\")+COUNTIF(H45:H67,\"15h-23h#\")+COUNTIF(H45:H67,\"15h-00h15#\")+COUNTIF(H45:H67,\"18h30-00h15#\")+COUNTIF(H45:H67,\"15h-00h30#\")+COUNTIF(H45:H67,\"18h-23h30#\")","v":6},null,{"$f":"COUNTIF(J45:J67,\"18h-02h#\")+COUNTIF(J45:J67,\"17h30-02h#\")+COUNTIF(J45:J67,\"17h-02h#\")+COUNTIF(J45:J67,\"18h30-24h15#\")+COUNTIF(J45:J67,\"18h30-24h#\")+COUNTIF(J45:J67,\"18h-02h18#\")+COUNTIF(J45:J67,\"18h-02h30#\")+COUNTIF(J45:J67,\"16h-00h18#\")+COUNTIF(J45:J67,\"18h30-23h#\")+COUNTIF(J45:J67,\"18h-01h30#\")+COUNTIF(J45:J67,\"18h30-23h15#\")+COUNTIF(J45:J67,\"18h-01h45#\")+COUNTIF(J45:J67,\"16h-01h45#\")+COUNTIF(J45:J67,\"17h30-02h30#\")+COUNTIF(J45:J67,\"15h-23h#\")+COUNTIF(J45:J67,\"15h-00h15#\")+COUNTIF(J45:J67,\"18h30-00h15#\")+COUNTIF(J45:J67,\"15h-00h30#\")+COUNTIF(J45:J67,\"18h-23h30#\")","v":7},null,{"$f":"COUNTIF(L45:L67,\"18h-02h#\")+COUNTIF(L45:L67,\"17h30-02h#\")+COUNTIF(L45:L67,\"17h-02h#\")+COUNTIF(L45:L67,\"18h30-24h15#\")+COUNTIF(L45:L67,\"18h30-24h#\")+COUNTIF(L45:L67,\"18h-02h18#\")+COUNTIF(L45:L67,\"18h-02h30#\")+COUNTIF(L45:L67,\"16h-00h18#\")+COUNTIF(L45:L67,\"18h30-23h#\")+COUNTIF(L45:L67,\"18h-01h30#\")+COUNTIF(L45:L67,\"18h30-23h15#\")+COUNTIF(L45:L67,\"18h-01h45#\")+COUNTIF(L45:L67,\"16h-01h45#\")+COUNTIF(L45:L67,\"17h30-02h30#\")+COUNTIF(L45:L67,\"15h-23h#\")+COUNTIF(L45:L67,\"15h-00h15#\")+COUNTIF(L45:L67,\"18h30-00h15#\")+COUNTIF(L45:L67,\"15h-00h30#\")+COUNTIF(L45:L67,\"18h-23h30#\")","v":9},null,{"$f":"COUNTIF(N45:N67,\"18h-02h#\")+COUNTIF(N45:N67,\"17h30-02h#\")+COUNTIF(N45:N67,\"17h-02h#\")+COUNTIF(N45:N67,\"18h30-24h15#\")+COUNTIF(N45:N67,\"18h30-24h#\")+COUNTIF(N45:N67,\"18h-02h18#\")+COUNTIF(N45:N67,\"18h-02h30#\")+COUNTIF(N45:N67,\"16h-00h18#\")+COUNTIF(N45:N67,\"18h30-23h#\")+COUNTIF(N45:N67,\"18h-01h30#\")+COUNTIF(N45:N67,\"18h30-23h15#\")+COUNTIF(N45:N67,\"18h-01h45#\")+COUNTIF(N45:N67,\"16h-01h45#\")+COUNTIF(N45:N67,\"17h30-02h30#\")+COUNTIF(N45:N67,\"15h-23h#\")+COUNTIF(N45:N67,\"15h-00h15#\")+COUNTIF(N45:N67,\"18h30-00h15#\")+COUNTIF(N45:N67,\"15h-00h30#\")+COUNTIF(N45:N67,\"18h-23h30#\")","v":11},null,{"$f":"COUNTIF(P45:P67,\"18h-02h#\")+COUNTIF(P45:P67,\"17h30-02h#\")+COUNTIF(P45:P67,\"17h-02h#\")+COUNTIF(P45:P67,\"18h30-24h15#\")+COUNTIF(P45:P67,\"18h30-24h#\")+COUNTIF(P45:P67,\"18h-02h18#\")+COUNTIF(P45:P67,\"18h-02h30#\")+COUNTIF(P45:P67,\"16h-00h18#\")+COUNTIF(P45:P67,\"18h30-23h#\")+COUNTIF(P45:P67,\"18h-01h30#\")+COUNTIF(P45:P67,\"18h30-23h15#\")+COUNTIF(P45:P67,\"18h-01h45#\")+COUNTIF(P45:P67,\"16h-01h45#\")+COUNTIF(P45:P67,\"17h30-02h30#\")+COUNTIF(P45:P67,\"15h-23h#\")+COUNTIF(P45:P67,\"15h-00h15#\")+COUNTIF(P45:P67,\"18h30-00h15#\")+COUNTIF(P45:P67,\"15h-00h30#\")+COUNTIF(P45:P67,\"18h-23h30#\")","v":9},null,{"$f":"COUNTIF(R45:R67,\"18h-02h#\")+COUNTIF(R45:R67,\"17h30-02h#\")+COUNTIF(R45:R67,\"17h-02h#\")+COUNTIF(R45:R67,\"18h30-24h15#\")+COUNTIF(R45:R67,\"18h30-24h#\")+COUNTIF(R45:R67,\"18h-02h18#\")+COUNTIF(R45:R67,\"18h-02h30#\")+COUNTIF(R45:R67,\"16h-00h18#\")+COUNTIF(R45:R67,\"18h30-23h#\")+COUNTIF(R45:R67,\"18h-01h30#\")+COUNTIF(R45:R67,\"18h30-23h15#\")+COUNTIF(R45:R67,\"18h-01h45#\")+COUNTIF(R45:R67,\"16h-01h45#\")+COUNTIF(R45:R67,\"17h30-02h30#\")+COUNTIF(R45:R67,\"15h-23h#\")+COUNTIF(R45:R67,\"15h-00h15#\")+COUNTIF(R45:R67,\"18h30-00h15#\")+COUNTIF(R45:R67,\"15h-00h30#\")+COUNTIF(R45:R67,\"18h-23h30#\")","v":10},null,{"$f":"COUNTIF(T45:T67,\"18h-02h#\")+COUNTIF(T45:T67,\"17h30-02h#\")+COUNTIF(T45:T67,\"17h-02h#\")+COUNTIF(T45:T67,\"18h30-24h15#\")+COUNTIF(T45:T67,\"18h30-24h#\")+COUNTIF(T45:T67,\"18h-02h18#\")+COUNTIF(T45:T67,\"18h-02h30#\")+COUNTIF(T45:T67,\"16h-00h18#\")+COUNTIF(T45:T67,\"18h30-23h#\")+COUNTIF(T45:T67,\"18h-01h30#\")+COUNTIF(T45:T67,\"18h30-23h15#\")+COUNTIF(T45:T67,\"18h-01h45#\")+COUNTIF(T45:T67,\"16h-01h45#\")+COUNTIF(T45:T67,\"17h30-02h30#\")+COUNTIF(T45:T67,\"15h-23h#\")+COUNTIF(T45:T67,\"15h-00h15#\")+COUNTIF(T45:T67,\"18h30-00h15#\")+COUNTIF(T45:T67,\"15h-00h30#\")+COUNTIF(T45:T67,\"18h-23h30#\")","v":5}]
[null,"  ","","CDR MATIN ",null,"",{"$f":"COUNTIF(G79:G116,\"11h45-15h#\")+COUNTIF(G79:G116,\"09h-17h18#\")+COUNTIF(G79:G116,\"11h45-20h#\")+COUNTIF(G79:G116,\"11h30-18h45#\")+COUNTIF(G79:G116,\"11h-18h45#\")+COUNTIF(G79:G116,\"09h30-17h#\")+COUNTIF(G79:G116,\"11h45-19h#\")+COUNTIF(G79:G116,\"11h30-17h#\")+COUNTIF(G79:G116,\"11h30-19h30#\")+COUNTIF(G79:G116,\"11h45-16h#\")+COUNTIF(G79:G116,\"11h30-16h#\")+COUNTIF(G79:G116,\"08h30-16h#\")+COUNTIF(G79:G116,\"11h15-14h45#\")+COUNTIF(G79:G116,\"11h30-15h#\")+COUNTIF(G79:G116,\"11h45-15h30#\")+COUNTIF(G79:G116,\"11h15-15h#\")+COUNTIF(G79:G116,\"11h30-19h#\")","v":6},null,{"$f":"COUNTIF(I79:I116,\"11h45-15h#\")+COUNTIF(I79:I116,\"09h-17h18#\")+COUNTIF(I79:I116,\"11h45-20h#\")+COUNTIF(I79:I116,\"11h30-18h45#\")+COUNTIF(I79:I116,\"11h-18h45#\")+COUNTIF(I79:I116,\"09h30-17h#\")+COUNTIF(I79:I116,\"11h45-19h#\")+COUNTIF(I79:I116,\"11h30-17h#\")+COUNTIF(I79:I116,\"11h30-19h30#\")+COUNTIF(I79:I116,\"11h45-16h#\")+COUNTIF(I79:I116,\"11h30-16h#\")+COUNTIF(I79:I116,\"08h30-16h#\")+COUNTIF(I79:I116,\"11h15-14h45#\")+COUNTIF(I79:I116,\"11h30-15h#\")+COUNTIF(I79:I116,\"11h45-15h30#\")+COUNTIF(I79:I116,\"11h15-15h#\")+COUNTIF(I79:I116,\"11h30-19h#\")","v":8},null,{"$f":"COUNTIF(K79:K116,\"11h45-15h#\")+COUNTIF(K79:K116,\"09h-17h18#\")+COUNTIF(K79:K116,\"11h45-20h#\")+COUNTIF(K79:K116,\"11h30-18h45#\")+COUNTIF(K79:K116,\"11h-18h45#\")+COUNTIF(K79:K116,\"09h30-17h#\")+COUNTIF(K79:K116,\"11h45-19h#\")+COUNTIF(K79:K116,\"11h30-17h#\")+COUNTIF(K79:K116,\"11h30-19h30#\")+COUNTIF(K79:K116,\"11h45-16h#\")+COUNTIF(K79:K116,\"11h30-16h#\")+COUNTIF(K79:K116,\"08h30-16h#\")+COUNTIF(K79:K116,\"11h15-14h45#\")+COUNTIF(K79:K116,\"11h30-15h#\")+COUNTIF(K79:K116,\"11h45-15h30#\")+COUNTIF(K79:K116,\"11h15-15h#\")+COUNTIF(K79:K116,\"11h30-19h#\")","v":6},null,{"$f":"COUNTIF(M79:M116,\"11h45-15h#\")+COUNTIF(M79:M116,\"09h-17h18#\")+COUNTIF(M79:M116,\"11h45-20h#\")+COUNTIF(M79:M116,\"11h30-18h45#\")+COUNTIF(M79:M116,\"11h-18h45#\")+COUNTIF(M79:M116,\"09h30-17h#\")+COUNTIF(M79:M116,\"11h45-19h#\")+COUNTIF(M79:M116,\"11h30-17h#\")+COUNTIF(M79:M116,\"11h30-19h30#\")+COUNTIF(M79:M116,\"11h45-16h#\")+COUNTIF(M79:M116,\"11h30-16h#\")+COUNTIF(M79:M116,\"08h30-16h#\")+COUNTIF(M79:M116,\"11h15-14h45#\")+COUNTIF(M79:M116,\"11h30-15h#\")+COUNTIF(M79:M116,\"11h45-15h30#\")+COUNTIF(M79:M116,\"11h15-15h#\")+COUNTIF(M79:M116,\"11h30-19h#\")","v":7},null,{"$f":"COUNTIF(O79:O116,\"11h45-15h#\")+COUNTIF(O79:O116,\"09h-17h18#\")+COUNTIF(O79:O116,\"11h45-20h#\")+COUNTIF(O79:O116,\"11h30-18h45#\")+COUNTIF(O79:O116,\"11h-18h45#\")+COUNTIF(O79:O116,\"09h30-17h#\")+COUNTIF(O79:O116,\"11h45-19h#\")+COUNTIF(O79:O116,\"11h30-17h#\")+COUNTIF(O79:O116,\"11h30-19h30#\")+COUNTIF(O79:O116,\"11h45-16h#\")+COUNTIF(O79:O116,\"11h30-16h#\")+COUNTIF(O79:O116,\"08h30-16h#\")+COUNTIF(O79:O116,\"11h15-14h45#\")+COUNTIF(O79:O116,\"11h30-15h#\")+COUNTIF(O79:O116,\"11h45-15h30#\")+COUNTIF(O79:O116,\"11h15-15h#\")+COUNTIF(O79:O116,\"11h30-19h#\")","v":7},null,{"$f":"COUNTIF(Q79:Q116,\"11h45-15h#\")+COUNTIF(Q79:Q116,\"09h-17h18#\")+COUNTIF(Q79:Q116,\"11h45-20h#\")+COUNTIF(Q79:Q116,\"11h30-18h45#\")+COUNTIF(Q79:Q116,\"11h-18h45#\")+COUNTIF(Q79:Q116,\"09h30-17h#\")+COUNTIF(Q79:Q116,\"11h45-19h#\")+COUNTIF(Q79:Q116,\"11h30-17h#\")+COUNTIF(Q79:Q116,\"11h30-19h30#\")+COUNTIF(Q79:Q116,\"11h45-16h#\")+COUNTIF(Q79:Q116,\"11h30-16h#\")+COUNTIF(Q79:Q116,\"08h30-16h#\")+COUNTIF(Q79:Q116,\"11h15-14h45#\")+COUNTIF(Q79:Q116,\"11h30-15h#\")+COUNTIF(Q79:Q116,\"11h45-15h30#\")+COUNTIF(Q79:Q116,\"11h15-15h#\")+COUNTIF(Q79:Q116,\"11h30-19h#\")","v":7},null,{"$f":"COUNTIF(S79:S116,\"11h45-15h#\")+COUNTIF(S79:S116,\"09h-17h18#\")+COUNTIF(S79:S116,\"11h45-20h#\")+COUNTIF(S79:S116,\"11h30-18h45#\")+COUNTIF(S79:S116,\"11h-18h45#\")+COUNTIF(S79:S116,\"09h30-17h#\")+COUNTIF(S79:S116,\"11h45-19h#\")+COUNTIF(S79:S116,\"11h30-17h#\")+COUNTIF(S79:S116,\"11h30-19h30#\")+COUNTIF(S79:S116,\"11h45-16h#\")+COUNTIF(S79:S116,\"11h30-16h#\")+COUNTIF(S79:S116,\"08h30-16h#\")+COUNTIF(S79:S116,\"11h15-14h45#\")+COUNTIF(S79:S116,\"11h30-15h#\")+COUNTIF(S79:S116,\"11h45-15h30#\")+COUNTIF(S79:S116,\"11h15-15h#\")+COUNTIF(S79:S116,\"11h30-19h#\")","v":9}]
[null,"  ","","CDR SOIR",null,"",{"$f":"COUNTIF(H79:H116,\"18h30-23h15#\")+COUNTIF(H79:H116,\"18h30-24h15#\")+COUNTIF(H79:H116,\"15h-00h30#\")+COUNTIF(H79:H116,\"16h30-24h#\")+COUNTIF(H79:H116,\"18h-02h#\")+COUNTIF(H79:H116,\"18h-23h30#\")+COUNTIF(H79:H116,\"18h30-24h#\")+COUNTIF(H79:H116,\"18h-01h45#\")+COUNTIF(H79:H116,\"16h-01h45#\")+COUNTIF(H79:H116,\"15h-24h15#\")+COUNTIF(H79:H116,\"16h-0h30#\")+COUNTIF(H79:H116,\"18h30-23h#\")+COUNTIF(H79:H116,\"18h-24h#\")+COUNTIF(H79:H116,\"18h30-23h45#\")+COUNTIF(H79:H116,\"15h-23h#\")+COUNTIF(H79:H116,\"18h30-23h30#\")+COUNTIF(H79:H116,\"18h-01h30#\")+COUNTIF(H79:H116,\"18h30-00h15#\")+COUNTIF(H79:H116,\"15h-24h#\")+COUNTIF(H79:H116,\"15h-00h30#\")+COUNTIF(H79:H116,\"18h-24h15#\")+COUNTIF(H79:H116,\"15h-24h30#\")+COUNTIF(H79:H116,\"15h-21h#\")","v":7},null,{"$f":"COUNTIF(J79:J116,\"18h30-23h15#\")+COUNTIF(J79:J116,\"18h30-24h15#\")+COUNTIF(J79:J116,\"15h-00h30#\")+COUNTIF(J79:J116,\"16h30-24h#\")+COUNTIF(J79:J116,\"18h-02h#\")+COUNTIF(J79:J116,\"18h-23h30#\")+COUNTIF(J79:J116,\"18h30-24h#\")+COUNTIF(J79:J116,\"18h-01h45#\")+COUNTIF(J79:J116,\"16h-01h45#\")+COUNTIF(J79:J116,\"15h-24h15#\")+COUNTIF(J79:J116,\"16h-0h30#\")+COUNTIF(J79:J116,\"18h30-23h#\")+COUNTIF(J79:J116,\"18h-24h#\")+COUNTIF(J79:J116,\"18h30-23h45#\")+COUNTIF(J79:J116,\"15h-23h#\")+COUNTIF(J79:J116,\"18h30-23h30#\")+COUNTIF(J79:J116,\"18h-01h30#\")+COUNTIF(J79:J116,\"18h30-00h15#\")+COUNTIF(J79:J116,\"15h-24h#\")+COUNTIF(J79:J116,\"15h-00h30#\")+COUNTIF(J79:J116,\"18h-24h15#\")+COUNTIF(J79:J116,\"15h-24h30#\")+COUNTIF(J79:J116,\"15h-21h#\")","v":11},null,{"$f":"COUNTIF(L79:L116,\"18h30-23h15#\")+COUNTIF(L79:L116,\"18h30-24h15#\")+COUNTIF(L79:L116,\"15h-00h30#\")+COUNTIF(L79:L116,\"16h30-24h#\")+COUNTIF(L79:L116,\"18h-02h#\")+COUNTIF(L79:L116,\"18h-23h30#\")+COUNTIF(L79:L116,\"18h30-24h#\")+COUNTIF(L79:L116,\"18h-01h45#\")+COUNTIF(L79:L116,\"16h-01h45#\")+COUNTIF(L79:L116,\"15h-24h15#\")+COUNTIF(L79:L116,\"16h-0h30#\")+COUNTIF(L79:L116,\"18h30-23h#\")+COUNTIF(L79:L116,\"18h-24h#\")+COUNTIF(L79:L116,\"18h30-23h45#\")+COUNTIF(L79:L116,\"15h-23h#\")+COUNTIF(L79:L116,\"18h30-23h30#\")+COUNTIF(L79:L116,\"18h-01h30#\")+COUNTIF(L79:L116,\"18h30-00h15#\")+COUNTIF(L79:L116,\"15h-24h#\")+COUNTIF(L79:L116,\"15h-00h30#\")+COUNTIF(L79:L116,\"18h-24h15#\")+COUNTIF(L79:L116,\"15h-24h30#\")+COUNTIF(L79:L116,\"15h-21h#\")","v":11},null,{"$f":"COUNTIF(N79:N116,\"18h30-23h15#\")+COUNTIF(N79:N116,\"18h30-24h15#\")+COUNTIF(N79:N116,\"15h-00h30#\")+COUNTIF(N79:N116,\"16h30-24h#\")+COUNTIF(N79:N116,\"18h-02h#\")+COUNTIF(N79:N116,\"18h-23h30#\")+COUNTIF(N79:N116,\"18h30-24h#\")+COUNTIF(N79:N116,\"18h-01h45#\")+COUNTIF(N79:N116,\"16h-01h45#\")+COUNTIF(N79:N116,\"15h-24h15#\")+COUNTIF(N79:N116,\"16h-0h30#\")+COUNTIF(N79:N116,\"18h30-23h#\")+COUNTIF(N79:N116,\"18h-24h#\")+COUNTIF(N79:N116,\"18h30-23h45#\")+COUNTIF(N79:N116,\"15h-23h#\")+COUNTIF(N79:N116,\"18h30-23h30#\")+COUNTIF(N79:N116,\"18h-01h30#\")+COUNTIF(N79:N116,\"18h30-00h15#\")+COUNTIF(N79:N116,\"15h-24h#\")+COUNTIF(N79:N116,\"15h-00h30#\")+COUNTIF(N79:N116,\"18h-24h15#\")+COUNTIF(N79:N116,\"15h-24h30#\")+COUNTIF(N79:N116,\"15h-21h#\")","v":10},null,{"$f":"COUNTIF(P79:P116,\"18h30-23h15#\")+COUNTIF(P79:P116,\"18h30-24h15#\")+COUNTIF(P79:P116,\"15h-00h30#\")+COUNTIF(P79:P116,\"16h30-24h#\")+COUNTIF(P79:P116,\"18h-02h#\")+COUNTIF(P79:P116,\"18h-23h30#\")+COUNTIF(P79:P116,\"18h30-24h#\")+COUNTIF(P79:P116,\"18h-01h45#\")+COUNTIF(P79:P116,\"16h-01h45#\")+COUNTIF(P79:P116,\"15h-24h15#\")+COUNTIF(P79:P116,\"16h-0h30#\")+COUNTIF(P79:P116,\"18h30-23h#\")+COUNTIF(P79:P116,\"18h-24h#\")+COUNTIF(P79:P116,\"18h30-23h45#\")+COUNTIF(P79:P116,\"15h-23h#\")+COUNTIF(P79:P116,\"18h30-23h30#\")+COUNTIF(P79:P116,\"18h-01h30#\")+COUNTIF(P79:P116,\"18h30-00h15#\")+COUNTIF(P79:P116,\"15h-24h#\")+COUNTIF(P79:P116,\"15h-00h30#\")+COUNTIF(P79:P116,\"18h-24h15#\")+COUNTIF(P79:P116,\"15h-24h30#\")+COUNTIF(P79:P116,\"15h-21h#\")","v":10},null,{"$f":"COUNTIF(R79:R116,\"18h30-23h15#\")+COUNTIF(R79:R116,\"18h30-24h15#\")+COUNTIF(R79:R116,\"15h-00h30#\")+COUNTIF(R79:R116,\"16h30-24h#\")+COUNTIF(R79:R116,\"18h-02h#\")+COUNTIF(R79:R116,\"18h-23h30#\")+COUNTIF(R79:R116,\"18h30-24h#\")+COUNTIF(R79:R116,\"18h-01h45#\")+COUNTIF(R79:R116,\"16h-01h45#\")+COUNTIF(R79:R116,\"15h-24h15#\")+COUNTIF(R79:R116,\"16h-0h30#\")+COUNTIF(R79:R116,\"18h30-23h#\")+COUNTIF(R79:R116,\"18h-24h#\")+COUNTIF(R79:R116,\"18h30-23h45#\")+COUNTIF(R79:R116,\"15h-23h#\")+COUNTIF(R79:R116,\"18h30-23h30#\")+COUNTIF(R79:R116,\"18h-01h30#\")+COUNTIF(R79:R116,\"18h30-00h15#\")+COUNTIF(R79:R116,\"15h-24h#\")+COUNTIF(R79:R116,\"15h-00h30#\")+COUNTIF(R79:R116,\"18h-24h15#\")+COUNTIF(R79:R116,\"15h-24h30#\")+COUNTIF(R79:R116,\"15h-21h#\")","v":10},null,{"$f":"COUNTIF(T79:T116,\"18h30-23h15#\")+COUNTIF(T79:T116,\"18h30-24h15#\")+COUNTIF(T79:T116,\"15h-00h30#\")+COUNTIF(T79:T116,\"16h30-24h#\")+COUNTIF(T79:T116,\"18h-02h#\")+COUNTIF(T79:T116,\"18h-23h30#\")+COUNTIF(T79:T116,\"18h30-24h#\")+COUNTIF(T79:T116,\"18h-01h45#\")+COUNTIF(T79:T116,\"16h-01h45#\")+COUNTIF(T79:T116,\"15h-24h15#\")+COUNTIF(T79:T116,\"16h-0h30#\")+COUNTIF(T79:T116,\"18h30-23h#\")+COUNTIF(T79:T116,\"18h-24h#\")+COUNTIF(T79:T116,\"18h30-23h45#\")+COUNTIF(T79:T116,\"15h-23h#\")+COUNTIF(T79:T116,\"18h30-23h30#\")+COUNTIF(T79:T116,\"18h-01h30#\")+COUNTIF(T79:T116,\"18h30-00h15#\")+COUNTIF(T79:T116,\"15h-24h#\")+COUNTIF(T79:T116,\"15h-00h30#\")+COUNTIF(T79:T116,\"18h-24h15#\")+COUNTIF(T79:T116,\"15h-24h30#\")+COUNTIF(T79:T116,\"15h-21h#\")","v":8}]
[{"$nulls":3},"RUNNER MIDI",null,null,{"$f":"COUNTIF(G128:G136,\"12h-15h#\")+COUNTIF(G128:G136,\"09h-16h30#\")+COUNTIF(G128:G136,\"12h15-15h30#\")+COUNTIF(G128:G136,\"11h45-15h#\")+COUNTIF(G128:G136,\"11h30-18h#\")+COUNTIF(G128:G136,\"11h30-22h30#\")+COUNTIF(G128:G136,\"11h30-19h#\")+COUNTIF(G128:G136,\"12h-19h30#\")","v":2},null,{"$f":"COUNTIF(I128:I136,\"12h-15h#\")+COUNTIF(I128:I136,\"09h-16h30#\")+COUNTIF(I128:I136,\"12h15-15h30#\")+COUNTIF(I128:I136,\"11h45-15h#\")+COUNTIF(I128:I136,\"11h30-18h#\")+COUNTIF(I128:I136,\"11h30-22h30#\")+COUNTIF(I128:I136,\"11h30-19h#\")+COUNTIF(I128:I136,\"12h-19h30#\")","v":2},null,{"$f":"COUNTIF(K128:K136,\"12h-15h#\")+COUNTIF(K128:K136,\"09h-16h30#\")+COUNTIF(K128:K136,\"12h15-15h30#\")+COUNTIF(K128:K136,\"11h45-15h#\")+COUNTIF(K128:K136,\"11h30-18h#\")+COUNTIF(K128:K136,\"11h30-22h30#\")+COUNTIF(K128:K136,\"11h30-19h#\")+COUNTIF(K128:K136,\"12h-19h30#\")","v":0},null,{"$f":"COUNTIF(M128:M136,\"12h-15h#\")+COUNTIF(M128:M136,\"09h-16h30#\")+COUNTIF(M128:M136,\"12h15-15h30#\")+COUNTIF(M128:M136,\"11h45-15h#\")+COUNTIF(M128:M136,\"11h30-18h#\")+COUNTIF(M128:M136,\"11h30-22h30#\")+COUNTIF(M128:M136,\"11h30-19h#\")+COUNTIF(M128:M136,\"12h-19h30#\")","v":0},null,{"$f":"COUNTIF(O128:O136,\"12h-15h#\")+COUNTIF(O128:O136,\"09h-16h30#\")+COUNTIF(O128:O136,\"12h15-15h30#\")+COUNTIF(O128:O136,\"11h45-15h#\")+COUNTIF(O128:O136,\"11h30-18h#\")+COUNTIF(O128:O136,\"11h30-22h30#\")+COUNTIF(O128:O136,\"11h30-19h#\")+COUNTIF(O128:O136,\"12h-19h30#\")","v":2},null,{"$f":"COUNTIF(Q128:Q136,\"12h-15h#\")+COUNTIF(Q128:Q136,\"09h-16h30#\")+COUNTIF(Q128:Q136,\"12h15-15h30#\")+COUNTIF(Q128:Q136,\"11h45-15h#\")+COUNTIF(Q128:Q136,\"11h30-18h#\")+COUNTIF(Q128:Q136,\"11h30-22h30#\")+COUNTIF(Q128:Q136,\"11h30-19h#\")+COUNTIF(Q128:Q136,\"12h-19h30#\")","v":3},null,{"$f":"COUNTIF(S128:S136,\"12h-15h#\")+COUNTIF(S128:S136,\"09h-16h30#\")+COUNTIF(S128:S136,\"12h15-15h30#\")+COUNTIF(S128:S136,\"11h45-15h#\")+COUNTIF(S128:S136,\"11h30-18h#\")+COUNTIF(S128:S136,\"11h30-22h30#\")+COUNTIF(S128:S136,\"11h30-19h#\")+COUNTIF(S128:S136,\"12h-19h30#\")","v":3}]
[{"$nulls":3},"RUNNER SOIR",null,null,{"$f":"COUNTIF(H128:H136,\"19h-23h30#\")+COUNTIF(H128:H136,\"11h30-22h30#\")+COUNTIF(H128:H136,\"18h45-21h45#\")+COUNTIF(H128:H136,\"18h-02h#\")+COUNTIF(H128:H136,\"18h30-24h#\")+COUNTIF(H128:H136,\"19h-24h#\")+COUNTIF(H128:H136,\"19h-24h30#\")+COUNTIF(H128:H136,\"18h30-23h15#\")+COUNTIF(H128:H136,\"18h-21h45#\")+COUNTIF(H128:H136,\"18h30-22h30#\")+COUNTIF(H128:H136,\"17h-01h#\")+COUNTIF(H128:H136,\"18h30-23h#\")+COUNTIF(H128:H136,\"18h-22h30#\")+COUNTIF(H128:H136,\"18h-23h30#\")","v":2},null,{"$f":"COUNTIF(J128:J136,\"19h-23h30#\")+COUNTIF(J128:J136,\"11h30-22h30#\")+COUNTIF(J128:J136,\"18h45-21h45#\")+COUNTIF(J128:J136,\"18h-02h#\")+COUNTIF(J128:J136,\"18h30-24h#\")+COUNTIF(J128:J136,\"19h-24h#\")+COUNTIF(J128:J136,\"19h-24h30#\")+COUNTIF(J128:J136,\"18h30-23h15#\")+COUNTIF(J128:J136,\"18h-21h45#\")+COUNTIF(J128:J136,\"18h30-22h30#\")+COUNTIF(J128:J136,\"17h-01h#\")+COUNTIF(J128:J136,\"18h30-23h#\")+COUNTIF(J128:J136,\"18h-22h30#\")+COUNTIF(J128:J136,\"18h-23h30#\")","v":2},null,{"$f":"COUNTIF(L128:L136,\"19h-23h30#\")+COUNTIF(L128:L136,\"11h30-22h30#\")+COUNTIF(L128:L136,\"18h45-21h45#\")+COUNTIF(L128:L136,\"18h-02h#\")+COUNTIF(L128:L136,\"18h30-24h#\")+COUNTIF(L128:L136,\"19h-24h#\")+COUNTIF(L128:L136,\"19h-24h30#\")+COUNTIF(L128:L136,\"18h30-23h15#\")+COUNTIF(L128:L136,\"18h-21h45#\")+COUNTIF(L128:L136,\"18h30-22h30#\")+COUNTIF(L128:L136,\"17h-01h#\")+COUNTIF(L128:L136,\"18h30-23h#\")+COUNTIF(L128:L136,\"18h-22h30#\")+COUNTIF(L128:L136,\"18h-23h30#\")","v":1},null,{"$f":"COUNTIF(N128:N136,\"19h-23h30#\")+COUNTIF(N128:N136,\"11h30-22h30#\")+COUNTIF(N128:N136,\"18h45-21h45#\")+COUNTIF(N128:N136,\"18h-02h#\")+COUNTIF(N128:N136,\"18h30-24h#\")+COUNTIF(N128:N136,\"19h-24h#\")+COUNTIF(N128:N136,\"19h-24h30#\")+COUNTIF(N128:N136,\"18h30-23h15#\")+COUNTIF(N128:N136,\"18h-21h45#\")+COUNTIF(N128:N136,\"18h30-22h30#\")+COUNTIF(N128:N136,\"17h-01h#\")+COUNTIF(N128:N136,\"18h30-23h#\")+COUNTIF(N128:N136,\"18h-22h30#\")+COUNTIF(N128:N136,\"18h-23h30#\")","v":0},null,{"$f":"COUNTIF(P128:P136,\"19h-23h30#\")+COUNTIF(P128:P136,\"11h30-22h30#\")+COUNTIF(P128:P136,\"18h45-21h45#\")+COUNTIF(P128:P136,\"18h-02h#\")+COUNTIF(P128:P136,\"18h30-24h#\")+COUNTIF(P128:P136,\"19h-24h#\")+COUNTIF(P128:P136,\"19h-24h30#\")+COUNTIF(P128:P136,\"18h30-23h15#\")+COUNTIF(P128:P136,\"18h-21h45#\")+COUNTIF(P128:P136,\"18h30-22h30#\")+COUNTIF(P128:P136,\"17h-01h#\")+COUNTIF(P128:P136,\"18h30-23h#\")+COUNTIF(P128:P136,\"18h-22h30#\")+COUNTIF(P128:P136,\"18h-23h30#\")","v":3},null,{"$f":"COUNTIF(R128:R136,\"19h-23h30#\")+COUNTIF(R128:R136,\"11h30-22h30#\")+COUNTIF(R128:R136,\"18h45-21h45#\")+COUNTIF(R128:R136,\"18h-02h#\")+COUNTIF(R128:R136,\"18h30-24h#\")+COUNTIF(R128:R136,\"19h-24h#\")+COUNTIF(R128:R136,\"19h-24h30#\")+COUNTIF(R128:R136,\"18h30-23h15#\")+COUNTIF(R128:R136,\"18h-21h45#\")+COUNTIF(R128:R136,\"18h30-22h30#\")+COUNTIF(R128:R136,\"17h-01h#\")+COUNTIF(R128:R136,\"18h30-23h#\")+COUNTIF(R128:R136,\"18h-22h30#\")+COUNTIF(R128:R136,\"18h-23h30#\")","v":4},null,{"$f":"COUNTIF(T128:T136,\"19h-23h30#\")+COUNTIF(T128:T136,\"11h30-22h30#\")+COUNTIF(T128:T136,\"18h45-21h45#\")+COUNTIF(T128:T136,\"18h-02h#\")+COUNTIF(T128:T136,\"18h30-24h#\")+COUNTIF(T128:T136,\"19h-24h#\")+COUNTIF(T128:T136,\"19h-24h30#\")+COUNTIF(T128:T136,\"18h30-23h15#\")+COUNTIF(T128:T136,\"18h-21h45#\")+COUNTIF(T128:T136,\"18h30-22h30#\")+COUNTIF(T128:T136,\"17h-01h#\")+COUNTIF(T128:T136,\"18h30-23h#\")+COUNTIF(T128:T136,\"18h-22h30#\")+COUNTIF(T128:T136,\"18h-23h30#\")","v":2}]
[null,"  ","","HÔTESSE MIDI ",null,"",{"$f":"COUNTIF(G163:G170,\"11h-15h#\")+COUNTIF(G163:G170,\"09h30-17h#\")+COUNTIF(G163:G170,\"09h-17h#\")+COUNTIF(G163:G170,\"09h-18h#\")+COUNTIF(G163:G170,\"09h-18h30#\")+COUNTIF(G163:G170,\"09h30-16h30#\")+COUNTIF(G163:G170,\"10h-15h30#\")+COUNTIF(G163:G170,\"11h-16h#\")+COUNTIF(G163:G170,\"11h30-15h#\")+COUNTIF(H163:H170,\"13h30-21h#\")","v":1},null,{"$f":"COUNTIF(I163:I170,\"11h-15h#\")+COUNTIF(I163:I170,\"09h30-17h#\")+COUNTIF(I163:I170,\"09h-17h#\")+COUNTIF(I163:I170,\"09h-18h#\")+COUNTIF(I163:I170,\"09h-18h30#\")+COUNTIF(I163:I170,\"09h30-16h30#\")+COUNTIF(I163:I170,\"10h-15h30#\")+COUNTIF(I163:I170,\"11h-16h#\")+COUNTIF(I163:I170,\"11h30-15h#\")+COUNTIF(J163:J170,\"13h30-21h#\")","v":1},null,{"$f":"COUNTIF(K163:K170,\"11h-15h#\")+COUNTIF(K163:K170,\"09h30-17h#\")+COUNTIF(K163:K170,\"09h-17h#\")+COUNTIF(K163:K170,\"09h-18h#\")+COUNTIF(K163:K170,\"09h-18h30#\")+COUNTIF(K163:K170,\"09h30-16h30#\")+COUNTIF(K163:K170,\"10h-15h30#\")+COUNTIF(K163:K170,\"11h-16h#\")+COUNTIF(K163:K170,\"11h30-15h#\")+COUNTIF(L163:L170,\"13h30-21h#\")","v":0},null,{"$f":"COUNTIF(M163:M170,\"11h-15h#\")+COUNTIF(M163:M170,\"09h30-17h#\")+COUNTIF(M163:M170,\"09h-17h#\")+COUNTIF(M163:M170,\"09h-18h#\")+COUNTIF(M163:M170,\"09h-18h30#\")+COUNTIF(M163:M170,\"09h30-16h30#\")+COUNTIF(M163:M170,\"10h-15h30#\")+COUNTIF(M163:M170,\"11h-16h#\")+COUNTIF(M163:M170,\"11h30-15h#\")+COUNTIF(N163:N170,\"13h30-21h#\")","v":0},null,{"$f":"COUNTIF(O163:O170,\"11h-15h#\")+COUNTIF(O163:O170,\"09h30-17h#\")+COUNTIF(O163:O170,\"09h-17h#\")+COUNTIF(O163:O170,\"09h-18h#\")+COUNTIF(O163:O170,\"09h-18h30#\")+COUNTIF(O163:O170,\"09h30-16h30#\")+COUNTIF(O163:O170,\"10h-15h30#\")+COUNTIF(O163:O170,\"11h-16h#\")+COUNTIF(O163:O170,\"11h30-15h#\")+COUNTIF(P163:P170,\"13h30-21h#\")","v":1},null,{"$f":"COUNTIF(Q163:Q170,\"11h-15h#\")+COUNTIF(Q163:Q170,\"09h30-17h#\")+COUNTIF(Q163:Q170,\"09h-17h#\")+COUNTIF(Q163:Q170,\"09h-18h#\")+COUNTIF(Q163:Q170,\"09h-18h30#\")+COUNTIF(Q163:Q170,\"09h30-16h30#\")+COUNTIF(Q163:Q170,\"10h-15h30#\")+COUNTIF(Q163:Q170,\"11h-16h#\")+COUNTIF(Q163:Q170,\"11h30-15h#\")+COUNTIF(R163:R170,\"13h30-21h#\")","v":1},null,{"$f":"COUNTIF(S163:S170,\"11h-15h#\")+COUNTIF(S163:S170,\"09h30-17h#\")+COUNTIF(S163:S170,\"09h-17h#\")+COUNTIF(S163:S170,\"09h-18h#\")+COUNTIF(S163:S170,\"09h-18h30#\")+COUNTIF(S163:S170,\"09h30-16h30#\")+COUNTIF(S163:S170,\"10h-15h30#\")+COUNTIF(S163:S170,\"11h-16h#\")+COUNTIF(S163:S170,\"11h30-15h#\")+COUNTIF(T163:T170,\"13h30-21h#\")","v":1}]
[null,"  ","","HÔTESSE SOIR",null,"",{"$f":"COUNTIF(H163:H170,\"18h30-23h#\")+COUNTIF(H163:H170,\"18h30-22h#\")+COUNTIF(H163:H170,\"18h30-22h30#\")+COUNTIF(H163:H170,\"17h30-00h30#\")+COUNTIF(H163:H170,\"16h-23h#\")+COUNTIF(H163:H170,\"13h30-21h#\")+COUNTIF(H163:H170,\"17h-23h30#\")","v":1},null,{"$f":"COUNTIF(J163:J170,\"18h30-23h#\")+COUNTIF(J163:J170,\"18h30-22h#\")+COUNTIF(J163:J170,\"18h30-22h30#\")+COUNTIF(J163:J170,\"17h30-00h30#\")+COUNTIF(J163:J170,\"16h-23h#\")+COUNTIF(J163:J170,\"13h30-21h#\")+COUNTIF(J163:J170,\"17h-23h30#\")","v":0},null,{"$f":"COUNTIF(L163:L170,\"18h30-23h#\")+COUNTIF(L163:L170,\"18h30-22h#\")+COUNTIF(L163:L170,\"18h30-22h30#\")+COUNTIF(L163:L170,\"17h30-00h30#\")+COUNTIF(L163:L170,\"16h-23h#\")+COUNTIF(L163:L170,\"13h30-21h#\")+COUNTIF(L163:L170,\"17h-23h30#\")","v":0},null,{"$f":"COUNTIF(N163:N170,\"18h30-23h#\")+COUNTIF(N163:N170,\"18h30-22h#\")+COUNTIF(N163:N170,\"18h30-22h30#\")+COUNTIF(N163:N170,\"17h30-00h30#\")+COUNTIF(N163:N170,\"16h-23h#\")+COUNTIF(N163:N170,\"13h30-21h#\")+COUNTIF(N163:N170,\"17h-23h30#\")","v":1},null,{"$f":"COUNTIF(P163:P170,\"18h30-23h#\")+COUNTIF(P163:P170,\"18h30-22h#\")+COUNTIF(P163:P170,\"18h30-22h30#\")+COUNTIF(P163:P170,\"17h30-00h30#\")+COUNTIF(P163:P170,\"16h-23h#\")+COUNTIF(P163:P170,\"13h30-21h#\")+COUNTIF(P163:P170,\"17h-23h30#\")","v":2},null,{"$f":"COUNTIF(R163:R170,\"18h30-23h#\")+COUNTIF(R163:R170,\"18h30-22h#\")+COUNTIF(R163:R170,\"18h30-22h30#\")+COUNTIF(R163:R170,\"17h30-00h30#\")+COUNTIF(R163:R170,\"16h-23h#\")+COUNTIF(R163:R170,\"13h30-21h#\")+COUNTIF(R163:R170,\"17h-23h30#\")","v":1},null,{"$f":"COUNTIF(T163:T170,\"18h30-23h#\")+COUNTIF(T163:T170,\"18h30-22h#\")+COUNTIF(T163:T170,\"18h30-22h30#\")+COUNTIF(T163:T170,\"17h30-00h30#\")+COUNTIF(T163:T170,\"16h-23h#\")+COUNTIF(T163:T170,\"13h30-21h#\")+COUNTIF(T163:T170,\"17h-23h30#\")","v":1}]
[null,"  ","","BAR MIDI ",null,"",{"$f":"COUNTIF(G146:G151,\"10h-18h18#\")+COUNTIF(G146:G151,\"09h-17h18#\")+COUNTIF(G146:G151,\"08h30-16h48#\")+COUNTIF(G146:G151,\"11h30-19h#\")","v":0},null,{"$f":"COUNTIF(I146:I151,\"10h-18h18#\")+COUNTIF(I146:I151,\"09h-17h18#\")+COUNTIF(I146:I151,\"08h30-16h48#\")+COUNTIF(I146:I151,\"11h30-19h#\")","v":0},null,{"$f":"COUNTIF(K146:K151,\"10h-18h18#\")+COUNTIF(K146:K151,\"09h-17h18#\")+COUNTIF(K146:K151,\"08h30-16h48#\")+COUNTIF(K146:K151,\"11h30-19h#\")","v":2},null,{"$f":"COUNTIF(M146:M151,\"10h-18h18#\")+COUNTIF(M146:M151,\"09h-17h18#\")+COUNTIF(M146:M151,\"08h30-16h48#\")+COUNTIF(M146:M151,\"11h30-19h#\")","v":2},null,{"$f":"COUNTIF(O146:O151,\"10h-18h18#\")+COUNTIF(O146:O151,\"09h-17h18#\")+COUNTIF(O146:O151,\"08h30-16h48#\")+COUNTIF(O146:O151,\"11h30-19h#\")","v":2},null,{"$f":"COUNTIF(Q146:Q151,\"10h-18h18#\")+COUNTIF(Q146:Q151,\"09h-17h18#\")+COUNTIF(Q146:Q151,\"08h30-16h48#\")+COUNTIF(Q146:Q151,\"11h30-19h#\")","v":2},null,{"$f":"COUNTIF(S146:S151,\"10h-18h18#\")+COUNTIF(S146:S151,\"09h-17h18#\")+COUNTIF(S146:S151,\"08h30-16h48#\")+COUNTIF(S146:S151,\"11h30-19h#\")","v":3}]
[null,"  ","","BAR SOIR",null,"",{"$f":"COUNTIF(H146:H151,\"14h30-23H#\")+COUNTIF(H146:H151,\"15h-23h18#\")+COUNTIF(H146:H151,\"16h-00h18#\")+COUNTIF(H146:H151,\"15h-24h#\")+COUNTIF(H146:H151,\"16h30-24h#\")+COUNTIF(H146:H151,\"17h-24h#\")+COUNTIF(H146:H151,\"16h-24h30#\")","v":2},null,{"$f":"COUNTIF(J146:J151,\"14h30-23H#\")+COUNTIF(J146:J151,\"15h-23h18#\")+COUNTIF(J146:J151,\"16h-00h18#\")+COUNTIF(J146:J151,\"15h-24h#\")+COUNTIF(J146:J151,\"16h30-24h#\")+COUNTIF(J146:J151,\"17h-24h#\")+COUNTIF(J146:J151,\"16h-24h30#\")","v":1},null,{"$f":"COUNTIF(L146:L151,\"14h30-23H#\")+COUNTIF(L146:L151,\"15h-23h18#\")+COUNTIF(L146:L151,\"16h-00h18#\")+COUNTIF(L146:L151,\"15h-24h#\")+COUNTIF(L146:L151,\"16h30-24h#\")+COUNTIF(L146:L151,\"17h-24h#\")+COUNTIF(L146:L151,\"16h-24h30#\")","v":2},null,{"$f":"COUNTIF(N146:N151,\"14h30-23H#\")+COUNTIF(N146:N151,\"15h-23h18#\")+COUNTIF(N146:N151,\"16h-00h18#\")+COUNTIF(N146:N151,\"15h-24h#\")+COUNTIF(N146:N151,\"16h30-24h#\")+COUNTIF(N146:N151,\"17h-24h#\")+COUNTIF(N146:N151,\"16h-24h30#\")","v":3},null,{"$f":"COUNTIF(P146:P151,\"14h30-23H#\")+COUNTIF(P146:P151,\"15h-23h18#\")+COUNTIF(P146:P151,\"16h-00h18#\")+COUNTIF(P146:P151,\"15h-24h#\")+COUNTIF(P146:P151,\"16h30-24h#\")+COUNTIF(P146:P151,\"17h-24h#\")+COUNTIF(P146:P151,\"16h-24h30#\")","v":4},null,{"$f":"COUNTIF(R146:R151,\"14h30-23H#\")+COUNTIF(R146:R151,\"15h-23h18#\")+COUNTIF(R146:R151,\"16h-00h18#\")+COUNTIF(R146:R151,\"15h-24h#\")+COUNTIF(R146:R151,\"16h30-24h#\")+COUNTIF(R146:R151,\"17h-24h#\")+COUNTIF(R146:R151,\"16h-24h30#\")","v":4},null,{"$f":"COUNTIF(T146:T151,\"14h30-23H#\")+COUNTIF(T146:T151,\"15h-23h18#\")+COUNTIF(T146:T151,\"16h-00h18#\")+COUNTIF(T146:T151,\"15h-24h#\")+COUNTIF(T146:T151,\"16h30-24h#\")+COUNTIF(T146:T151,\"17h-24h#\")+COUNTIF(T146:T151,\"16h-24h30#\")","v":2}]
[{"$nulls":10},"  "]

{"sheet":"Feuil1","index":1,"n_rows":0,"n_cols":0,"rows_kept":0}

{"sheet":"Feuil2","index":2,"n_rows":0,"n_cols":0,"rows_kept":0}

{"sheet":"Plan","index":3,"n_rows":89,"n_cols":22,"rows_kept":89}
["205 : La Coupole","SALLE"]
["Semaine 16","Du lundi 13/04 au dimanche 19/04/2015"]
["2015-04-13",null,"2015-04-14",null,"2015-04-15",null,"2015-04-16",null,"2015-04-17",null,"2015-04-18",null,"2015-04-19"]
[" 264h45",null," 327h30",null," 350h54",null," 390h00",null," 458h03",null," 436h51",null," 288h30"]
["19","  24","  25","  26","  24","  30","  26","  34","  29","  40","  26","  42","  26","  23"]
["000401","M","39h00","GERMAY"," JEAN YVES","MDH (MAITRE D'HOTEL)","00h00","MAL",null,"MAL",null,"MAL",null,"MAL",null,"MAL",null,"R",null,"R",null,"-00:35"]
["000443","M","39h00","BARGAIN"," GILLES","MDH (MAITRE D'HOTEL)","00h00","ATJ",null,"ATJ",null,"ATJ",null,"ATJ",null,"ATJ",null,"R",null,"R",null,"-00:35"]
["000614","M","39h00","GROS"," CHRISTIAN","MDH_RES (MAITRE D'HO","39h00","R",null,null,"18h-02h#",null,"18h-02h#",null,"18h-02h#",null,"14h30-23h30#",null,"14h30-23h#","R",null,"+00:00"]
["001921","M","39h00","MEGASSI"," MOHAMED","MDH (MAITRE D'HOTEL)","39h00","11h45-15h#","18h30-23h15#","11h45-15h#","18h30-24h15#","11h45-15h#","18h30-24h15#","11h45-15h#","18h30-24h15#","R",null,"R",null,"11h45-16h#","18h30-23h15#","+00:00"]
["002011","M","39h00","ADAM"," SEBASTIEN","DIR_ADJ (DIRECTEUR","39h00",null,"18h30-02h48#",null,"18h30-02h48#","R",null,"R",null,null,"18h30-02h48#",null,"18h30-02h48#",null,"18h30-02h48#","+00:00"]
["002404","M","39h00","BENAMEUR"," LYES","MDH (MAITRE D'HOTEL)","39h00","R",null,"11h45-15h#","18h30-24h#","11h45-15h#","18h30-24h#","11h45-15h#","18h30-24h#","11h45-15h#","18h30-24h#","11h45-15h#","18h30-00h15#","R",null,"+00:00"]
["003394","M","39h00","COUROUX"," MAURICE","MDH (MAITRE D'HOTEL)","00h00","MAL",null,"MAL",null,"MAL",null,"MAL",null,"MAL",null,"R",null,"R",null,"-00:35"]
["004050","M","39h00","VILAIN"," JEAN LUC","MDH (MAITRE D'HOTEL)","39h00","R",null,"10h-18h18#",null,"10h-18h18#",null,"06h-14h18#",null,"10h-18h18#",null,"10h-18h18#",null,"R",null,"+00:00"]
["004070","M","39h00","LANSON"," HERVE","MDH (MAITRE D'HOTEL)","39h00","07h-15h18#",null,"07h-15h18#",null,"07h-15h18#",null,"07h-15h18#",null,"07h-15h18#",null,"R",null,"R",null,"+00:00"]
["004368","M","39h00","AELLIG"," ERIC","1ERMHR (1ER MAITRE D","39h00","09h-17h18#",null,"09h-17h18#",null,"09h-17h18#",null,"09h-17h18#",null,"R",null,"R",null,"09h-17h18#",null,"+00:00"]
["004523","M","39h00","LOR"," RENE","MDH (MAITRE D'HOTEL)","39h00","09h-17h18#",null,"R",null,"R",null,"09h-17h18#",null,"09h-17h18#",null,"09h-17h18#",null,"09h-17h18#",null,"+00:00"]
["004569","M","39h00","LOUARRADI"," ABDELHAKAM","MDH (MAITRE D'HOTEL)","39h00","11h45-15h#","18h30-23h15#","11h45-15h#","18h30-24h15#","11h45-15h#","18h30-24h15#","R",null,"R",null,"11h45-15h30#","18h30-24h15#","11h45-15h30#","18h30-23h15#","+00:00"]
["006245","M","39h00","TRUONG"," TAN CUONG","CHEF_RANG (CHEF DE R","39h00","11h45-15h#","18h30-23h15#","11h45-15h#","18h30-24h15#","11h45-15h#","18h30-24h15#","11h45-15h#","18h30-24h15#","R",null,"R",null,"11h45-16h#","18h30-23h15#","+00:00"]
["006346","M","39h00","BENATIA"," FATHI","CHEF_RANG (CHEF DE R","23h24","09h-17h18#",null,"09h-17h18#",null,"CP",null,"CP",null,"R",null,"R",null,"09h-17h18#",null,"-00:14"]
["009624","M","39h00","DAKHLI"," AHMED","CHEF_RANG (CHEF DE R","39h00",null,"15h-23h#",null,"15h-24h#","R",null,"R",null,null,"15h-00h30#","11h30-18h45#",null,"11h-18h45#",null,"+00:00"]
["009999","M","39h00","MU"," SONG LEANG","MDH (MAITRE D'HOTEL)","23h15","R",null,"CP",null,"CP",null,"11h45-15h#","18h30-24h#","11h45-15h#","18h30-24h#","11h45-15h#","18h30-24h#","R",null,"-00:23"]
["010220","M","35h00","TENDERO"," STEPHANE","DIR_EXPLOIT (DIRECTE","35h00","R",null,"10h-17h30#",null,"10h-17h30#",null,"10h-17h30#",null,"10h-17h30#",null,"10h-17h30#",null,"R",null,"+00:00"]
["015223","M","39h00","HADDAD"," SLAH","MDH (MAITRE D'HOTEL)","39h00","R",null,"R",null,"11h45-15h#","18h30-24h#","11h45-15h#","18h30-24h15#","11h45-15h#","18h30-24h15#","11h45-15h#","18h30-24h15#","11h45-15h30#","18h30-23h#","+00:00"]
["020729","M","39h00","LEVAVASSEUR"," J-PHILIPPE","DIR_ADJ (DIRECTEUR","24h00","CP",null,"CP",null,null,"14h-22h#",null,"14h-22h#","11h-20h30#",null,"R",null,"R",null,"+00:22"]
["020914","M","35h00","RATEAU"," PAULINE","APP_SALLE (APPRENTI","35h00","R",null,null,"16h30-24h#",null,"16h30-24h#",null,"16h30-24h#",null,"16h30-24h#",null,"16h30-24h#","R",null,"+00:00"]
["022349","M","39h00","VIVIER"," CLAUDE","MDH (MAITRE D'HOTEL)","39h00","R",null,"R",null,"08h-16h18#",null,"08h-16h18#",null,"08h-16h18#",null,"08h-16h18#",null,"08h-16h18#",null,"+00:00"]
["024313","M","39h00","ALLALI"," MOURAD","MDH (MAITRE D'HOTEL)","39h00","09h-17h18#",null,"09h-17h18#",null,"R",null,"R",null,"09h-17h18#",null,"08h-16h18#",null,"08h-16h18#",null,"+00:00"]
["024679","M","39h00","MOUZOUN"," ABDELLAH","MDH (MAITRE D'HOTEL)","39h00",null,"15h-23h#","R",null,"R",null,null,"15h-00h15#",null,"15h-00h15#",null,"15h-00h30#","11h30-17h#",null,"+00:00"]
["026640","M","39h00","COTARD"," YANN","DIR_ADJ (DIRECTEUR","39h00","R",null,"R",null,null,"18h30-02h48#",null,"18h30-02h48#",null,"18h30-02h48#",null,"16h-00h18#",null,"16h-00h18#","+00:00"]
["028742","M","39h00","ESTRADA ALBA"," YARITZA","MDH (MAITRE D'HOTEL)","39h00","R",null,"09h30-17h30#",null,"09h30-17h30#",null,"09h30-17h30#",null,"09h30-17h30#",null,"08h30-18h#",null,"R",null,"+00:00"]
["030456","M","39h00","CAZELES"," FRANCK","MDH (MAITRE D'HOTEL)","39h00","R",null,null,"18h-02h#",null,"18h-02h#",null,"18h-02h#",null,"18h-02h30#",null,"17h30-02h30#","R",null,"+00:00"]
["032560","M","39h00","MONEDIERE"," EMERIC","MDH (MAITRE D'HOTEL)","29h45",null,"18h-01h45#",null,"18h-02h#",null,"18h-02h#",null,"18h-02h#","R",null,"R",null,"CP",null,{"$f":"-1:29","v":{"$error":"#VALUE!"}}]
["038145","M","39h00","DENIS"," AUDREY","BARMA (BARMAN)","39h00","R",null,"R",null,"09h-17h18#",null,"09h-17h18#",null,"09h-17h18#",null,"08h30-16h48#",null,"08h30-16h48#",null,"+00:00"]
["038701","M","39h00","ANIAMBOSSOU"," JEAN LUC","CHEF_RANG (CHEF DE R","39h00","11h45-15h#","18h30-23h15#","R",null,"R",null,"11h45-15h#","18h30-24h15#","11h45-15h#","18h30-24h15#","11h45-15h30#","18h30-24h15#","11h45-15h30#","18h30-23h15#","+00:00"]
["050993","M","35h00","CHOPIN"," TIPHAINE","MDH (MAITRE D'HOTEL)","35h00","R",null,"R",null,null,"18h-02h#",null,"18h-02h#",null,"18h-02h#",null,"18h-02h#",null,"18h-23h30#","+00:00"]
["066666","M","39h00","FUSCA"," JOSEPH","MDH (MAITRE D'HOTEL)","39h00","R",null,null,"16h-00h18#",null,"16h-00h18#",null,"16h-00h18#",null,"16h-00h18#",null,"16h-00h18#","R",null,"+00:00"]
["101065","M","39h00","LIBOS"," SANDRINE","CHEF_RANG (CHEF DE R","39h00",null,"15h-23h30#",null,"15h-24h#",null,"15h-24h#","R",null,"R",null,null,"15h-24h30#","11h30-17h#",null,"+00:00"]
["109201","M","35h00","GIRODET"," DAMIEN","MDH_RES (MAITRE D'HO","35h00","R",null,"R",null,null,"19h-02h#",null,"18h-02h#",null,"18h-02h#",null,"18h-24h#",null,"14h30-23h#","+00:00"]
["110525","M","35h00","LAVENTURE"," KARINE","HOT_ACC (HOTESSE D'A","35h00","R",null,null,"16h-23h30#",null,"16h-23h30#",null,"16h-23h30#",null,"16h-23h30#",null,"16h-23h30#","R",null,"+00:00"]
["111015","M","35h00","GAMA"," SYLVIE","MDH_RES (MAITRE D'HO","08h00",null,"14h30-23h#","R",null,"R",null,"CP",null,"CP",null,"CP",null,"CP",null,"+00:36"]
["111018","M","35h00","BRUNNARIUS"," MARK JAMES","MDH_RES (MAITRE D'HO","35h00",null,"19h-01h30#",null,"19h-02h#",null,"14h30-23h#","R",null,"R",null,"08h-16h#",null,"08h-15h30#",null,"+00:00"]
["111125","M","35h00","AMIN"," RAHMAN","COM_DE_SALLE (COMMIS","35h00","R",null,"R",null,null,"18h30-24h#","11h45-15h#","18h30-24h#","11h45-15h#","18h30-24h#","11h45-15h#","18h30-24h#","11h45-15h#","18h30-23h#","+00:00"]
["112511","M","35h00","VILLEBENOIT"," THOMAS","CHEF_RANG (CHEF DE R","35h00",null,"18h-02h#",null,"18h-23h30#","R",null,"R",null,null,"18h-02h#",null,"18h-02h#",null,"18h-02h#","+00:00"]
["130103","M","35h00","LEPAULMIER"," ALEXANDRE","CHEF_RANG (CHEF DE R","35h00","09h30-17h#",null,"09h30-17h#",null,"R",null,"R",null,"09h30-17h#",null,"09h30-17h#",null,"09h30-17h#",null,"+00:00"]
["130118","M","35h00","FOURNIER"," ROMAIN","CHEF_RANG (CHEF DE R","35h00","11h45-15h#","18h30-23h30#","11h45-15h#","18h30-24h#","R",null,"R",null,"11h45-15h#","18h30-24h#",null,"18h30-24h#","11h45-15h#","18h30-23h30#","+00:00"]
["130429","M","39h00","AMEDEE"," LUDOVIC","DIR_DE_REST (DIRECTE","31h12","R",null,"R",null,"09h-17h18#",null,"09h-17h18#",null,"09h-17h18#",null,"09h-17h18#",null,"CP",null,"-00:07"]
["131909","M","35h00","SPRINGMANN"," BRIAN","MDH_RES (MAITRE D'HO","35h00",null,"18h-01h30#",null,"14h30-23h#","R",null,"R",null,null,"18h-24h#",null,"18h-02h#",null,"18h-01h30#","+00:00"]
["140109","M","35h00","FAIVRE"," VICTORINE","APP_SALLE (APPRENTI","35h00","09h30-17h#",null,"09h30-17h#",null,"09h30-17h#",null,"09h30-17h#",null,"09h30-17h#",null,"R",null,"R",null,"+00:00"]
["140315","M","35h00","LOPES DE SOUSA"," CHRISTOPHER","COM_DE_SALLE (COMMIS","35h00","09h-16h30#",null,"09h-16h30#",null,"R",null,"R",null,"11h45-15h#","18h30-23h15#","11h45-15h#","18h30-23h15#","11h30-19h#",null,"+00:00"]
["140409","M","35h00","GOGIEN"," KELLY","APP_SALLE (APPRENTI","35h00","R",null,null,"18h30-02h#",null,"18h30-02h#",null,"18h30-02h#",null,"18h30-02h#",null,"18h30-02h#","R",null,"+00:00"]
["140831","M","35h00","PAYS"," PAULINE","APP_SALLE (APPRENTI","35h00","R",null,"09h30-17h#",null,"09h30-17h#",null,"09h30-17h#",null,"09h30-17h#",null,"09h30-17h#",null,"R",null,"+00:00"]
["141025","M","15h00","TOUATI"," KARIM","COM_DE_SALLE (COMMIS","15h00","R",null,"R",null,"R",null,"R",null,null,"17h30-01h#",null,"16h30-01h#","R",null,"+00:00"]
["141171","M","18h00","DZIAMIRAVA"," ALENA","HOT_ACC (HOTESSE D'A","18h00",null,"18h30-23h#","R",null,"R",null,null,"18h30-22h#",null,"18h30-22h30#",null,"18h30-22h30#",null,"18h30-23h#","+00:00"]
["141206","M","25h00","SARCA"," SEBASTIAN","COM_DE_SALLE (COMMIS","24h45","12h-15h30#","18h45-21h45#","12h-15h30#","18h45-21h45#","12h-15h30#","18h45-21h45#","R",null,"R",null,null,"18h15-21h45#","12h15-15h30#","18h45-21h45#","-00:15"]
["141220","M","15h00","TALAKLI"," YUSUF","COM_DE_SALLE (COMMIS","15h00","R",null,"R",null,"R",null,"R",null,null,"17h-22h30#","11h30-18h#","18h-22h30#",null,null,"+00:00"]
["141409","M","35h00","GOMEZ"," AXEL","APP_SALLE (APPRENTI","35h00","R",null,"08h30-16h#",null,"08h30-16h#",null,"08h30-16h#",null,"08h30-16h#",null,"08h30-16h#",null,"R",null,"+00:00"]
["142608","M","35h00","DAVID"," MAXENCE","CHEF_RANG (CHEF DE R","35h00","R",null,"R",null,null,"16h30-24h#",null,"16h30-24h#",null,"16h30-24h#",null,"16h30-24h#","11h30-19h#",null,"+00:00"]
["143008","M","35h00","TALAZAC"," ALEXANDRE","APP_SALLE (APPRENTI","35h00","R",null,null,"18h30-02h#",null,"18h30-02h#",null,"18h30-02h#",null,"18h30-02h#",null,"18h30-02h#","R",null,"+00:00"]
["143108","M","35h00","GATTULLI"," THOMAS","APP_SALLE (APPRENTI","35h00","R",null,"09h30-17h#",null,"09h30-17h#",null,"09h30-17h#",null,"09h30-17h#",null,"09h30-17h#",null,"R",null,"+00:00"]
["150789","M","35h00","GRAEBER"," PIERRE","APP_SALLE (APPRENTI","35h00","R",null,null,"16h30-24h#",null,"16h30-24h#",null,"16h30-24h#",null,"16h30-24h#",null,"16h30-24h#","R",null,"+00:00"]
["171014","M","15h00","MARIE"," CHLOE","HOT_ACC (HOTESSE D'A","07h30","R",null,"R",null,"R",null,"R",null,"R",null,"CNP",null,"11h-19h#",null,"-00:17"]
["171214","M","25h00","SCHATZ"," ANNABELLE","HOT_ACC (HOTESSE D'A","25h00",null,"18h-22h30#","R",null,"R",null,null,"18h-23h30#",null,"17h30-00h30#",null,"18h30-00h30#",null,"18h-22h30#","+00:00"]
["210541","M","35h00","CHARASCH"," MATHIEU","MDH_RES (MAITRE D'HO","07h00",null," / 07h-RCL",{"$nulls":12},"-28:00"]
["211194","M","35h00","MORLAT"," JEAN BAPTISTE","APP_SALLE (APPRENTI","35h00","06h30-14h#",null,"06h30-14h#",null,"06h30-14h#",null,"06h30-14h#",null,"06h30-14h#",null,"R",null,"R",null,"+00:00"]
["235648","M","35h00","HAMOUDI"," AHMED","CHEF_RANG (CHEF DE R","35h00","R",null,null,"18h-02h#",null,"18h-23h30#",null,"18h-02h#",null,"18h-02h#",null,"18h-02h#","R",null,"+00:00"]
["241014","M","35h00","BOTAYA"," BRYAN","COM_DE_SALLE (COMMIS","35h00","12h-15h#","19h-23h30#","12h-15h#","19h-24h#","R",null,"R",null,"12h-15h#","19h-24h30#","12h-15h#","19h-24h#","12h-19h30#",null,"+00:00"]
["260813","M","35h00","FRESNEAU"," FLORENT","APP_SALLE (APPRENTI","28h00","R",null,"NAJ",null,null,"18h30-02h#",null,"18h30-02h#",null,"18h30-02h#",null,"18h30-02h#","R",null,"-00:06"]
["280814","M","35h00","BERDOUK"," BRAHIM","APP_SALLE (APPRENTI","34h30","FAL",null,"FAL",null,"FAL",null,"FAL",null,"FAL",null,"R",null,"R",null,"-00:30"]
["290314","M","35h00","MIHOC"," OLIVIU VASILE","COM_DE_SALLE (COMMIS","20h00","R",null,"R",null,"CP",null,"CP",null,null,"18h-02h#",null,"18h-02h#",null,"18h-23h30#",{"$f":"-4:15","v":{"$error":"#VALUE!"}}]
["309011","M","35h00","JOHIR"," RAYHAN","CHEF_RANG (CHEF DE R","00h00","CP",null,"CP",null,"R",null,"R",null,"CP",null,"CP",null,"CP",null,"-00:30"]
["319081","M","35h00","FOURNIER"," ANTONIN","CHEF_RANG (CHEF DE R","35h00","R",null,"R",null,null,"18h-02h#",null,"18h-02h#",null,"18h-02h#",null,"18h-02h#",null,"18h-23h30#","+00:00"]
["409016","M","39h00","FANGET"," BRICE","MDH (MAITRE D'HOTEL)","00h00","CIF",null,"CIF",null,"CIF",null,"CIF",null,"CIF",null,"R",null,"R",null,"-00:35"]
["501221","M","35h00","COCHARD"," YANNICK","DIR_DE_REST (DIRECTE","35h00",null,"15h-22h30#","R",null,"R",null,null,"15h-22h30#",null,"15h-22h30#",null,"15h-22h30#",null,"15h-22h30#","+00:00"]
["503302","M","35h00","LECADRE"," AYMERIC","STAGIAIRE (STAGIAIRE","35h00","09h30-17h#",null,"09h30-17h#",null,"07h-14h30#",null,"07h-14h30#",null,"09h30-17h#",null,"R",null,"R",null,"+00:00"]
["504021","M","25h00","LARABI"," KARIMA","HOT_ACC (HOTESSE D'A","25h00","11h-15h#",null,"11h-15h#",null,"09h30-16h30#",null,"09h30-16h30#",null,"10h-15h30#",null,"R",null,"R",null,"+00:00"]
["504061","M","24h30","OUASLI"," CHAFIA","HOT_ACC (HOTESSE D'A","00h00","R",null,"R",null,"R",null,"MAL",null,"MAL",null,"MAL",null,"R",null,"+00:00"]
["509123","M","39h00","BOREL"," NOEMIE","MDH_RES (MAITRE D'HO","39h00","R",null,"10h-18h30#",null,"10h-18h30#",null,"10h-18h30#",null,"07h30-17h#",null,null,"17h30-24h#","R",null,"+00:00"]
["510101","M","39h00","RAJAONARIVELO"," JEAN CLAUDE","MDH (MAITRE D'HOTEL)","39h00","R",null,null,"18h-02h#",null,"18h-02h#",null,"18h-02h#",null,"18h-02h30#",null,"17h30-02h30#","R",null,"+00:00"]
["603281","M","39h00","CABANAS"," JULIEN","BARMA (BARMAN)","39h00","R",null,"R",null,"10h-18h18#",null,"10h-18h18#",null,"10h-18h18#",null,"10h-18h18#",null,"10h-18h18#",null,"+00:00"]
["607043","M","39h00","ZAVAGNIN LOPEZ"," MARIA SOLEDAD","HOT_ACC (HOTESSE D'A","39h00","09h30-17h#",null,"09h30-17h#",null,"R",null,"R",null,"09h-17h#",null,"09h-18h#",null,"09h-18h30#",null,"+00:00"]
["609045","M","39h00","RODRIGUES"," JEROME","BARMA (BARMAN)","39h00",null,"14h30-23h#",null,"15h-24h#","R",null,"R",null,null,"16h-24h30#",null,"16h-24h30#",null,"17h-24h#","+00:00"]
["702131","M","39h00","LAPIATE"," CHRISTOPHE","MDH (MAITRE D'HOTEL)","07h00",null,"18h-01h30#","R",null,"R",null,"CP",null,"CP",null,"CP",null,"CP",null,{"$f":"-50:65","v":{"$error":"#VALUE!"}}]
["703131","M","39h00","GRAVAT"," ARNAUD","BARMA (BARMAN)","31h12","R",null,"CP",null,null,"16h-00h18#",null,"16h-00h18#",null,"16h-00h18#",null,"16h-00h18#","R",null,"-00:07"]
["706191","M","39h00","KANOUTE"," ABDRAMANE","CHEF_RANG (CHEF DE R","39h00",null,"18h-01h45#",null,"18h-02h#",null,"18h-02h#",null,"18h-02h#","R",null,"R",null,null,"16h-01h45#","+00:00"]
["710212","M","39h00","SURESHKUMAR"," PONNAMPALAM","CHEF_RANG (CHEF DE R","00h00","ATR",null,"ATR",null,"R",null,"R",null,"ATR",null,"ATR",null,"ATR",null,"-00:35"]
["801153","M","39h00","SANE"," NOAH","CHEF_RANG (CHEF DE R","39h00","R",null,"R",null,"11h45-15h#","18h30-24h15#","11h45-15h#","18h30-24h15#",null,"16h-00h30#","11h30-19h30#",null,"11h30-19h30#",null,"+00:00"]
["807012","M","39h00","BAHRI"," MOUNIB","MDH (MAITRE D'HOTEL)","39h00",null,"18h-02h#","R",null,"R",null,null,"18h-02h#",null,"18h-02h#",null,"17h30-02h#",null,"17h-02h#","+00:00"]
["808013","M","39h00","SHILONG"," CHEN","BARMA (BARMAN)","39h00",null,"16h-00h18#","R",null,"R",null,null,"16h-00h18#",null,"16h-00h18#",null,"16h-00h18#",null,"15h-23h18#","+00:00"]
["911095","M","35h00","KOS"," JULIE","HOT_ACC (HOTESSE D'A","00h00","CIF",null,"CIF",null,"R",null,"R",null,"CIF",null,"CIF",null,"CIF",null,"-00:30"]