{"text_format":"3","workbook":"xlsx","n_sheets":2,"sheets":["Matrice","test"],"not_rendered":{"macros":1},"read":"whole","date_system":"1900"}

{"sheet":"Matrice","index":0,"n_rows":18,"n_cols":12,"rows_kept":18,"merged":[[2,3,2,10]]}
[]
[]
[{"$nulls":3},"CATEGORIES DE POIDS MUAY THAÏ TATAMI"]
[{"$nulls":3},"POUSSINS","BENJAMINS","MINIMES.F","MINIMES.M","CADETTES","CADETS","JUNIORS.F","JUNIORS.M"]
["POUSSINS",1,13,"-18 kg","-23 kg","-28 kg","-28 kg"," -37 kg","-37 kg","-45 kg","-45 kg",{"$f":"HLOOKUP(test!$G$5,$D$4:$K18,ROW(L5)-3)","v":"-28 kg"}]
["BENJAMINS",2,13,"-23 kg","-28 kg","-32 kg","-32 kg"," -42 kg","-42 kg","-48 kg","-48 kg",{"$f":"HLOOKUP(test!$G$5,$D$4:$K19,ROW(L6)-3)","v":"-32 kg"}]
["MINIMES.F",3,13,"-28 kg","-32 kg","-37 kg","-37 kg"," -46 kg","-47 kg","-51 kg","-51 kg",{"$f":"HLOOKUP(test!$G$5,$D$4:$K20,ROW(L7)-3)","v":"-37 kg"}]
["MINIMES.M",4,13,"-32 kg","-37 kg","-42 kg","-42 kg","-50 kg","-52 kg","-54 kg","-54 kg",{"$f":"HLOOKUP(test!$G$5,$D$4:$K21,ROW(L8)-3)","v":"-42 kg"}]
["CADETTES",5,13,"-37 kg","-42 kg","-46 kg","-47 kg","-55 kg","-57 kg","-57 kg","-57 kg",{"$f":"HLOOKUP(test!$G$5,$D$4:$K22,ROW(L9)-3)","v":"-47 kg"}]
["CADETS",6,13,"-42 kg","-47 kg","-50 kg","-52 kg","-60 kg","-63 kg","-60 kg","-60 kg",{"$f":"HLOOKUP(test!$G$5,$D$4:$K23,ROW(L10)-3)","v":"-52 kg"}]
["JUNIORS.F",7,13,"-47 kg","-52 kg","-55 kg","-57 kg","-65 kg","-69 Kg","-63,5 kg","-63,5 kg",{"$f":"HLOOKUP(test!$G$5,$D$4:$K24,ROW(L11)-3)","v":"-57 kg"}]
["JUNIORS.M",8,13,"+47 kg","+52 kg","-60 kg","-63 kg","+65 kg","-74 kg","-67 kg","-67 kg",{"$f":"HLOOKUP(test!$G$5,$D$4:$K25,ROW(L12)-3)","v":"-63 kg"}]
[{"$nulls":5},"+60 kg","-69 kg",null,"+74 kg","-71 kg","-71 kg",{"$f":"HLOOKUP(test!$G$5,$D$4:$K26,ROW(L13)-3)","v":"-69 kg"}]
[{"$nulls":6},"+69 kg",null,null,"+71 kg","-75 kg",{"$f":"HLOOKUP(test!$G$5,$D$4:$K27,ROW(L14)-3)","v":"+69 kg"}]
[{"$nulls":10},"-81 kg",{"$f":"HLOOKUP(test!$G$5,$D$4:$K28,ROW(L15)-3)","v":0}]
[{"$nulls":10},"-86 kg",{"$f":"HLOOKUP(test!$G$5,$D$4:$K29,ROW(L16)-3)","v":0}]
[{"$nulls":10},"+86 kg",{"$f":"HLOOKUP(test!$G$5,$D$4:$K30,ROW(L17)-3)","v":0}]
[{"$nulls":11},{"$f":"HLOOKUP(test!$G$5,$D$4:$K31,ROW(L18)-3)","v":0}]

{"sheet":"test","index":1,"n_rows":6,"n_cols":9,"rows_kept":6,"merged":[[5,6,5,11]]}
[]
[]
[]
[]
["DATE :",null,null,"LIEU :",null,"Classe :","MINIMES.M","KGS :","-28 kg"]
[{"$nulls":6},"Je souhaite en choisissant la classe dans la cellule G5 obtenir la liste de poids de cette classe en I5"]