{"text_format":"3","workbook":"xlsx","n_sheets":3,"sheets":["Feuil1","Feuil2","A faire"],"read":"whole","date_system":"1900"}

{"sheet":"Feuil1","index":0,"n_rows":2425,"n_cols":28,"rows_kept":2425,"merged":[[0,1,0,4],[0,6,0,10],[0,11,0,14],[1,22,1,27],[1,30,1,36],[1,39,1,45],[1,48,1,54],[1,58,1,64]]}
[]
[{"$nulls":22},"SP1 Placé"]
["Date","P1","P2","P3","P4",null,"1er","2ème","3ème","4ème","5ème","SG","SP1","SP2","SP3",{"$nulls":5},"P1","Result","Cote","Mise","Cumul Mises","Gain Brut ","Cumul des gain","Résultat net"]
["2014-12-15",4,2,1,9,null,7,2,4,10,9,3.5,1.5,2.5,1.5,null,{"$f":"IF(L4=\"\",\"\",COUNTIF(B4:E4,G4))","v":0},{"$f":"IF(M4=\"\",\"\",COUNTIF(B4:E4,H4))","v":1},{"$f":"IF(N4=\"\",\"\",COUNTIF(B4:E4,I4))","v":1},null,{"$f":"IF(L4=\"\",\"\",COUNTIF(B4,G4))","v":0},{"$f":"IF(L4=\"\",\"\",IF(U4=0,\"P\",\"G\"))","v":"P"},{"$f":"IF(L4=\"\",\"\",IF(V4=\"P\",0,M4))","v":0},{"$f":"IF(V4=\"\",\"\",IF(OR(ISTEXT(X3),AND(AB3>0,V3=\"G\")),1,IF(Z3=0,X3*2,ABS(ROUNDUP(AB3*2,0)))))","v":1},{"$f":"IF(X4=\"\",\"\",SUM($X$4:X4))","v":1},{"$f":"IF(X4=\"\",\"\",W4*X4)","v":0},{"$f":"IF(X4=\"\",\"\",SUM($Z$4:Z4))","v":0},{"$f":"IF(X4=\"\",\"\",SUM($Z$4:Z4)-SUM($X$4:X4))","v":-1}]
["CAGNES SUR MER",8,9,2,10,null,14,9,1,12,7,16.4,4.4,2.8,2.6,null,{"$f":"IF(L5=\"\",\"\",COUNTIF(B5:E5,G5))","v":0},{"$f":"IF(M5=\"\",\"\",COUNTIF(B5:E5,H5))","v":1},{"$f":"IF(N5=\"\",\"\",COUNTIF(B5:E5,I5))","v":0},null,{"$f":"IF(L5=\"\",\"\",COUNTIF(B5,G5))","v":0},{"$f":"IF(L5=\"\",\"\",IF(U5=0,\"P\",\"G\"))","v":"P"},{"$f":"IF(L5=\"\",\"\",IF(V5=\"P\",0,M5))","v":0},{"$f":"IF(V5=\"\",\"\",IF(OR(ISTEXT(X4),AND(AB4>0,V4=\"G\")),1,IF(Z4=0,X4*2,ABS(ROUNDUP(AB4*2,0)))))","v":2},{"$f":"IF(X5=\"\",\"\",SUM($X$4:X5))","v":3},{"$f":"IF(X5=\"\",\"\",W5*X5)","v":0},{"$f":"IF(X5=\"\",\"\",SUM($Z$4:Z5))","v":0},{"$f":"IF(X5=\"\",\"\",SUM($Z$4:Z5)-SUM($X$4:X5))","v":-3}]
[null,4,15,5,3,null,16,6,5,14,7,45.5,11.4,11.5,3.9,null,0,0,1,null,0,"P",0,4,{"$f":"IF(X6=\"\",\"\",SUM($X$4:X6))","v":7},0,{"$f":"IF(X6=\"\",\"\",SUM($Z$4:Z6))","v":0},{"$f":"IF(X6=\"\",\"\",SUM($Z$4:Z6)-SUM($X$4:X6))","v":-7}]
[null,6,5,8,2,null,6,2,7,8,5,8.9,2.1,1.3,1.8,null,1,1,0,null,1,"G",2.1,8,{"$f":"IF(X7=\"\",\"\",SUM($X$4:X7))","v":15},16.8,{"$f":"IF(X7=\"\",\"\",SUM($Z$4:Z7))","v":16.8},{"$f":"IF(X7=\"\",\"\",SUM($Z$4:Z7)-SUM($X$4:X7))","v":1.8000000000000007}]
[null,2,1,3,5,null,2,5,6,7,1,4.1,1.7,10.2,4.9,null,1,1,0,null,1,"G",1.7,1,{"$f":"IF(X8=\"\",\"\",SUM($X$4:X8))","v":16},1.7,{"$f":"IF(X8=\"\",\"\",SUM($Z$4:Z8))","v":18.5},{"$f":"IF(X8=\"\",\"\",SUM($Z$4:Z8)-SUM($X$4:X8))","v":2.5}]
[null,9,11,4,3,null,2,3,11,4,12,15.5,4,3.6,4.5,null,0,1,1,null,0,"P",0,1,{"$f":"IF(X9=\"\",\"\",SUM($X$4:X9))","v":17},0,{"$f":"IF(X9=\"\",\"\",SUM($Z$4:Z9))","v":18.5},{"$f":"IF(X9=\"\",\"\",SUM($Z$4:Z9)-SUM($X$4:X9))","v":1.5}]
[null,9,6,3,5,null,7,5,6,3,2,14.1,4.5,2.5,2.2,null,0,1,1,null,0,"P",0,2,{"$f":"IF(X10=\"\",\"\",SUM($X$4:X10))","v":19},0,{"$f":"IF(X10=\"\",\"\",SUM($Z$4:Z10))","v":18.5},{"$f":"IF(X10=\"\",\"\",SUM($Z$4:Z10)-SUM($X$4:X10))","v":-0.5}]
[{"$nulls":16},"","","",null,"","","","",{"$f":"IF(X11=\"\",\"\",SUM($X$4:X11))","v":""},"",{"$f":"IF(X11=\"\",\"\",SUM($Z$4:Z11))","v":""},{"$f":"IF(X11=\"\",\"\",SUM($Z$4:Z11)-SUM($X$4:X11))","v":""}]
["2014-12-16",1,6,8,12,null,1,9,10,13,15,4.3,2.3,2.4,3.5,null,1,0,0,null,1,"G"]
["PAU",10,9,12,3,null,3,1,4,10,12,8,2.9,4.7,4.3,null,1,0,0,null,0,"P"]
[null,9,5,2,1,null,9,7,11,15,14,3.5,1.5,3.5,2.7,null,1,0,0,null,1,"G"]
[null,3,6,12,10,null,3,6,12,4,8,2.8,1.3,1.5,2,null,1,1,1,null,1,"G"]
[null,2,3,11,12,null,12,2,11,4,13,11.7,2.6,1.5,6.4,null,1,1,1,null,0,"P"]
[null,2,5,7,3,null,2,9,1,6,13,10.7,3.1,2.2,2.5,null,1,0,0,null,1,"G"]
[null,5,6,4,2,null,12,9,2,3,10,14.5,4.4,4.4,2.6,null,0,0,1,null,0,"P"]
[null,12,2,8,11,null,14,11,8,10,3,23.1,5,1.8,2.9,null,0,1,1,null,0,"P"]
[{"$nulls":16},"","","",null,"",""]
["2014-12-17",4,9,8,10,null,9,4,15,2,5,5.8,2.6,2,8.7,null,1,1,0,null,0,"P"]
["VINCENNES",9,14,15,4,null,14,10,9,12,1,7.1,2.6,7.1,1.5,null,1,0,1,null,0,"P"]
[null,3,4,2,7,null,3,4,8,5,7,5,2.1,3.7,13,null,1,1,0,null,1,"G"]
[null,6,16,14,18,null,14,2,7,8,13,11.4,4,3.3,1.6,null,1,0,0,null,0,"P"]
[null,7,11,9,6,null,6,10,4,5,7,36.6,5.6,1.7,4,null,1,0,0,null,0,"P"]
[null,8,9,7,4,null,3,8,4,6,10,10.2,2.7,3.6,1.6,null,0,1,1,null,0,"P"]
[null,14,15,11,9,null,6,15,12,14,1,24,5,1.3,3.7,null,0,1,0,null,0,"P"]
[null,8,7,5,4,null,7,8,5,4,2,6.9,1.4,1.1,1.4,null,1,1,1,null,0,"P"]
[{"$nulls":16},"","","",null,"",""]
["2014-12-18",3,5,16,13,null,9,14,11,5,8,8.5,3.2,6,3.6,null,0,0,0,null,0,"P"]
["CABOURG",8,12,15,14,null,8,15,12,5,14,3.5,1.3,1.8,2.1,null,1,1,1,null,1,"G"]
[null,10,11,6,7,null,10,8,3,4,11,5.4,1.7,3,4.8,null,1,0,0,null,1,"G"]
[null,7,3,11,5,null,14,13,3,6,9,6.2,1.9,3,1.6,null,0,0,1,null,0,"P"]
[null,2,6,11,12,null,16,4,3,11,14,2.8,1.6,3,4.6,null,0,0,0,null,0,"P"]
[null,4,14,17,3,null,12,10,8,17,15,19.5,6.6,2.1,7.4,null,0,0,0,null,0,"P"]
[null,12,7,13,4,null,12,8,7,4,13,3.7,2,2.2,4,null,1,0,1,null,1,"G"]
[null,13,14,5,11,null,11,5,13,2,7,8.2,3.2,2.6,2.4,null,1,1,1,null,0,"P"]
[{"$nulls":16},"","","",null,"",""]
["2014-12-19",12,4,10,14,null,2,12,13,10,11,11,3.2,9.6,1.5,null,0,1,0,null,0,"P"]
["VINCENNES",2,9,4,15,null,5,1,10,7,6,7.3,2,4.1,6.4,null,0,0,0,null,0,"P"]
[null,13,15,12,8,null,13,12,15,5,10,3.6,1.7,3.6,2.1,null,1,1,1,null,1,"G"]
[null,11,8,9,5,null,8,11,4,9,7,6.8,2,1.1,3.1,null,1,1,0,null,0,"P"]
[null,9,5,12,15,null,15,9,2,5,12,1.7,1.2,2.6,2.7,null,1,1,0,null,0,"P"]
[null,13,7,8,9,null,5,13,12,8,7,10.7,3.3,1.7,3.7,null,0,1,0,null,0,"P"]
[null,13,11,14,9,null,13,15,11,2,4,5.9,2.3,2.7,1.3,null,1,0,1,null,1,"G"]
[null,2,3,8,9,null,7,5,6,3,2,4.4,1.8,1.7,2.7,null,0,0,0,null,0,"P"]
[{"$nulls":16},"","","",null,"",""]
["2014-12-20",10,1,8,12,null,1,12,7,8,10,6,1.9,1.2,1.7,null,1,1,0,null,0,"P"]
["VINCENNES",10,12,6,9,null,10,9,7,8,4,1.7,1.2,1.5,1.3,null,1,1,0,null,1,"G"]
[null,7,12,5,4,null,11,5,3,6,10,6.3,2.1,1.7,4.5,null,0,1,0,null,0,"P"]
[null,4,1,9,16,null,18,12,1,4,9,10.5,3.8,2.8,3.3,null,0,0,1,null,0,"P"]
[null,7,8,4,5,null,8,1,3,2,4,1.6,1.1,4.9,2.3,null,1,0,0,null,0,"P"]
[null,10,1,11,4,null,10,12,11,1,8,3.4,1.7,1.8,1.3,null,1,0,1,null,1,"G"]
[null,9,10,5,6,null,1,6,10,2,7,3.4,2.2,2,2.1,null,0,1,1,null,0,"P"]
[null,11,16,8,2,null,2,6,1,10,16,3.5,1.8,2.1,2,null,1,0,0,null,0,"P"]
[{"$nulls":16},{"$f":"IF(L56=\"\",\"\",COUNTIF(B56:E56,G56))","v":""},{"$f":"IF(M56=\"\",\"\",COUNTIF(B56:E56,H56))","v":""},{"$f":"IF(N56=\"\",\"\",COUNTIF(B56:E56,I56))","v":""},null,"",""]
["2014-12-21",9,5,4,10,null,8,3,11,6,2,11.6,2.8,5.4,7.3,null,0,0,0,null,0,"P"]
["VINCENNES",11,8,6,9,null,6,8,7,16,10,3.9,1.7,2.2,3.4,null,1,1,0,null,0,"P"]
[null,5,3,7,10,null,5,10,6,8,2,4.7,1.3,1.2,1.6,null,1,1,0,null,1,"G"]
[null,1,5,6,15,null,9,17,8,1,7,19.9,6.6,4,11.2,null,0,0,0,null,0,"P"]
[null,12,1,8,13,null,12,11,3,8,10,9.7,3.4,3.6,11,null,1,0,0,null,1,"G"]
[null,8,9,17,11,null,5,1,7,4,18,13.4,4.3,6.3,4.3,null,0,0,0,null,0,"P"]
[null,11,9,5,13,null,11,15,9,2,6,2.7,2,7.4,2.1,null,1,0,1,null,1,"G"]
[null,16,12,7,14,null,1,3,16,12,4,31.7,7.6,6,2.3,null,0,0,1,null,0,"P"]
[{"$nulls":16},"","","",null,"",""]
["2014-12-22",4,7,3,5,null,4,5,10,7,2,5.6,2,1.5,3,null,{"$f":"IF(L66=\"\",\"\",COUNTIF(B66:E66,G66))","v":1},{"$f":"IF(M66=\"\",\"\",COUNTIF(B66:E66,H66))","v":1},{"$f":"IF(N66=\"\",\"\",COUNTIF(B66:E66,I66))","v":0},null,1,"G"]
["DEAUVILLE",2,9,15,10,null,5,6,2,1,9,14.2,4.9,3.1,1.6,null,0,0,1,null,0,"P"]
[null,1,9,3,6,null,4,12,11,1,6,12.5,5.3,4.4,8.6,null,0,0,0,null,0,"P"]
[null,12,8,11,10,null,2,9,10,13,7,8.4,2.4,2.3,3.2,null,0,0,1,null,{"$f":"IF(L69=\"\",\"\",COUNTIF(B69,G69))","v":0},{"$f":"IF(L69=\"\",\"\",IF(U69=0,\"P\",\"G\"))","v":"P"}]
[null,4,11,13,2,null,7,5,13,16,10,9.1,3.1,4.2,2.7,null,0,0,1,null,0,"P"]
[null,2,4,9,3,null,13,16,2,9,1,21.8,6.8,5.9,3.2,null,0,0,1,null,0,"P"]
[null,6,12,13,7,null,4,5,8,2,14,5.7,2.7,4.5,6.1,null,0,0,0,null,0,"P"]
[null,7,3,4,13,null,3,10,1,4,11,18.9,8.5,6,4.6,null,1,0,0,null,0,"P"]
[{"$nulls":16},"","","",null,"",""]
["2014-12-23",4,8,2,13,null,2,12,4,3,6,3.1,1.6,5.5,1.7,null,1,0,1,null,0,"P"]
["VINCENNES",8,9,7,4,null,6,1,5,16,12,5.8,1.7,4.3,2.4,null,0,0,0,null,0,"P"]
[null,4,9,8,6,null,9,4,6,10,1,4.5,1.7,1.3,1.8,null,1,1,1,null,0,"P"]
[null,8,11,13,10,null,9,12,8,7,2,46.7,8.3,2.7,2.4,null,0,0,1,null,0,"P"]
[null,9,11,4,10,null,8,10,9,2,6,6.7,2.1,1.8,2,null,0,1,1,null,0,"P"]
[null,10,5,7,11,null,11,7,8,5,3,2.3,1.5,4.4,3,null,1,1,0,null,0,"P"]
[null,13,6,4,1,null,13,5,1,15,2,4.7,2.1,6.7,16.7,null,1,0,1,null,1,"G"]
[null,6,9,3,7,null,9,3,6,5,8,2,1.1,2.3,1.9,null,1,1,1,null,0,"P"]
[{"$nulls":16},"","","",null,"",""]
["2014-12-24",1,5,4,2,null,5,2,1,4,3,8.4,2.6,1.6,null,null,1,1,1,null,0,"P"]
["CAGNES SUR MER",9,6,3,2,null,6,3,10,2,1,9.8,3.1,2.1,3.1,null,1,1,0,null,0,"P"]
[null,3,1,4,10,null,9,15,11,13,2,5.5,2.2,8,4.6,null,0,0,0,null,0,"P"]
[null,4,8,6,2,null,1,11,6,4,10,9.6,2.7,2.3,1.7,null,0,0,1,null,0,"P"]
[null,1,8,3,4,null,8,7,2,3,1,6.1,2.6,2.6,4.4,null,1,0,0,null,0,"P"]
[null,8,2,6,5,null,1,3,11,4,6,7.2,2.8,9.7,9.7,null,0,0,0,null,0,"P"]
[null,3,11,4,6,null,3,7,6,10,4,8.1,2.2,1.5,9,null,1,0,1,null,1,"G"]
[null,6,9,2,1,null,16,9,1,6,13,29,6.8,3,2.1,null,0,1,1,null,0,"P"]
[{"$nulls":16},"","","",null,"",""]
["2014-12-25",3,4,17,18,null,2,7,8,10,18,41.6,9.3,2.4,4.9,null,0,0,0,null,0,"P"]
["VINCENNES",9,15,14,17,null,14,16,8,15,11,11.9,3.4,5.7,4.6,null,1,0,0,null,0,"P"]
[null,8,3,6,4,null,2,4,6,7,null,3.5,2.1,2.1,2,null,0,1,1,null,0,"P"]
[null,5,8,3,7,null,7,15,6,12,9,5.7,1.7,1.3,2.5,null,1,0,0,null,0,"P"]
[null,3,7,13,11,null,15,6,14,3,13,17,4.3,2.4,29,null,0,0,0,null,0,"P"]
[null,5,9,7,3,null,4,8,9,7,1,6.4,2.2,3,3.2,null,0,0,1,null,0,"P"]
[null,10,12,11,7,null,6,3,12,2,9,9.6,2.8,2.8,2.7,null,0,0,1,null,0,"P"]
[null,2,11,4,6,null,11,13,12,15,3,8.2,2.9,2.7,3.3,null,1,0,0,null,0,"P"]
[{"$nulls":16},"","","",null,"",""]
["2014-12-26",16,4,8,15,null,14,16,4,9,7,12.3,4.2,3.4,2.3,null,0,1,1,null,0,"P"]
["VINCENNES",9,4,10,6,null,10,4,5,1,7,3.1,1.7,4,2.4,null,1,1,0,null,0,"P"]
[null,7,10,9,12,null,10,11,2,9,12,4.3,2,2.2,3.3,null,1,0,0,null,0,"P"]
[null,7,5,4,3,null,5,7,4,2,1,3.6,1.3,2.8,null,null,1,1,1,null,0,"P"]
[null,7,14,11,5,null,14,15,11,13,8,3.4,2.1,3.3,2,null,1,0,1,null,0,"P"]
[null,4,5,6,7,null,3,6,5,7,1,5.2,1.6,1.3,1.5,null,0,1,1,null,0,"P"]
[null,9,8,7,5,null,6,4,5,7,9,5,1.5,2.5,2.9,null,0,0,1,null,0,"P"]
[null,8,5,15,6,null,6,5,11,4,10,7.6,2.2,2.3,4.8,null,1,1,0,null,0,"P"]
[{"$nulls":16},"","","",null,"",""]
["2014-12-27",9,7,8,5,null,6,7,2,4,8,8.5,2.2,1.3,5.6,null,0,1,0,null,0,"P"]
["VINCENNES",8,15,7,1,null,12,8,4,11,14,23.3,6,1.5,7.4,null,0,1,0,null,0,"P"]
[null,1,7,2,5,null,17,3,7,15,5,12.2,3.3,4.7,2,null,0,0,1,null,0,"P"]
[null,15,7,18,2,null,10,5,15,18,12,40.9,7.5,3,3.1,null,0,0,1,null,0,"P"]
[null,2,10,8,14,null,17,3,4,8,10,15.5,4.2,4.6,2,null,0,0,0,null,0,"P"]
[null,3,4,12,11,null,9,3,1,11,2,10.5,2.7,1.9,3.5,null,0,1,0,null,0,"P"]
[null,6,8,11,9,null,12,6,11,9,5,7.2,2,2.2,2.5,null,0,1,1,null,0,"P"]
[null,13,14,9,16,null,15,11,2,9,4,19.4,4.5,2.9,22,null,0,0,0,null,0,"P"]
[{"$nulls":16},"","","",null,"",""]
["2014-12-28",10,11,2,5,null,10,5,2,11,8,1.8,1.4,4.3,2.8,null,1,1,1,null,1,"G"]
["VINCENNES",4,8,3,14,null,8,14,1,13,6,16.6,4,3.4,18,null,1,1,0,null,0,"P"]
[null,5,4,13,11,null,4,9,6,10,3,6.6,2.5,4.2,1.8,null,1,0,0,null,0,"P"]
[null,8,5,9,1,null,17,1,5,9,10,25.3,6.2,5.5,3.3,null,0,1,1,null,0,"P"]
[null,7,10,9,5,null,2,11,5,7,10,6.3,2.5,2.1,2.8,null,0,0,1,null,0,"P"]
[null,2,1,15,10,null,5,2,4,9,6,16.5,3.6,1.7,2.1,null,0,1,0,null,0,"P"]
[null,7,2,9,8,null,6,2,5,7,3,8.2,2.8,2.2,3.4,null,0,1,0,null,0,"P"]
[null,7,5,11,8,null,7,5,6,12,9,3.1,1.5,2.6,5.7,null,1,1,0,null,1,"G"]
[{"$nulls":16},"","","",null,"",""]
["2014-12-29",4,7,9,1,null,15,11,14,2,5,14.7,4.9,2.5,5.3,null,0,0,0,null,0,"P"]
["VINCENNES",9,13,12,10,null,13,12,9,11,8,3.7,1.7,2,1.5,null,{"$f":"IF(L130=\"\",\"\",COUNTIF(B130:E130,G130))","v":1},{"$f":"IF(M130=\"\",\"\",COUNTIF(B130:E130,H130))","v":1},{"$f":"IF(N130=\"\",\"\",COUNTIF(B130:E130,I130))","v":1},null,0,"P"]
[null,10,6,8,5,null,8,2,4,9,13,7.6,3.2,2.7,2.7,null,1,0,0,null,0,"P"]
[null,8,7,10,2,null,8,10,2,3,7,2.8,1.2,1.5,1.4,null,1,1,1,null,1,"G"]
[null,16,15,10,9,null,15,16,10,14,9,16.6,4.4,1.7,2.6,null,1,1,1,null,{"$f":"IF(L133=\"\",\"\",COUNTIF(B133,G133))","v":0},{"$f":"IF(L133=\"\",\"\",IF(U133=0,\"P\",\"G\"))","v":"P"}]
[null,9,12,7,4,null,8,7,1,5,12,12.8,4,2.6,5.6,null,0,1,0,null,0,"P"]
[null,4,7,14,12,null,1,10,6,8,9,68.7,16.9,3.5,5.1,null,0,0,0,null,0,"P"]
[null,12,13,9,7,null,13,14,12,9,4,3.6,1.6,1.7,2.1,null,1,0,1,null,0,"P"]
[{"$nulls":16},"","","",null,{"$f":"IF(L137=\"\",\"\",COUNTIF(B137:E137,G137))","v":""},{"$f":"IF(L137=\"\",\"\",IF(U137=0,\"P\",\"G\"))","v":""}]
["2014-12-30",16,14,12,8,null,15,7,10,14,1,31.6,6.7,2.1,4.1,null,0,0,0,null,0,"P"]
["VINCENNES",12,11,2,9,null,9,11,6,12,15,9.4,3,2,7.9,null,1,1,0,null,1,"G"]
[null,3,8,1,9,null,3,5,9,6,7,2.1,1.3,4.2,3.3,null,1,0,1,null,1,"G"]
[null,12,14,11,13,null,10,12,14,5,8,4.2,2.3,2,2.3,null,0,1,1,null,0,"P"]
[null,14,11,5,9,null,11,4,13,12,9,2.5,1.5,2.8,2.5,null,1,0,0,null,1,"G"]
[null,6,8,5,9,null,8,5,4,9,12,9.3,2.4,1.8,2.1,null,1,1,0,null,1,"G"]
[null,13,11,18,4,null,8,17,12,16,14,28.4,11.1,3.6,8.1,null,0,0,0,null,0,"P"]
[null,4,13,1,5,null,11,12,7,9,4,4.3,2.1,3.4,5.3,null,0,0,0,null,0,"P"]
[{"$nulls":16},"","","",null,"",""]
["2014-12-31",1,6,2,13,null,12,9,1,4,6,5.1,1.8,3.1,1.8,null,0,0,1,null,0,"P"]
["CAGNES SUR MER",6,1,4,5,null,7,2,4,3,1,16.2,3.2,2.5,1.2,null,0,0,1,null,0,"P"]
[null,8,5,9,16,null,14,7,6,12,8,12.9,3.7,4.3,2.9,null,0,0,0,null,0,"P"]
[null,1,2,9,10,null,8,2,3,6,1,5.3,2.2,2.6,4.7,null,0,1,0,null,0,"P"]
[null,7,6,3,11,null,7,6,1,4,3,4.3,1.7,2.4,4.5,null,1,1,0,null,1,"G"]
[null,3,1,6,2,null,3,15,6,2,10,9.1,2.3,2.9,2.4,null,1,0,1,null,1,"G"]
[null,7,4,9,2,null,4,7,11,2,9,4,1.9,1.8,6.2,null,1,1,0,null,1,"G"]
[{"$nulls":16},"","","",null,"",""]
["2015-01-01",15,4,8,5,null,10,15,14,4,3,5.3,3.3,1.5,4.3,null,0,1,0,null,0,"P"]
["VINCENNES",18,17,13,16,null,5,18,10,13,9,22.1,5.2,1.4,3.1,null,0,1,0,null,0,"P"]
[null,1,5,13,12,null,1,3,16,15,13,2.5,1.6,8.3,3.1,null,1,0,0,null,1,"G"]
[null,7,1,3,10,null,2,1,8,12,7,45,12.8,2.5,1.8,null,0,1,0,null,0,"P"]
[null,5,8,11,6,null,6,8,7,5,4,6.5,1.6,2.8,3.8,null,1,1,0,null,1,"G"]
[null,8,4,9,3,null,4,9,6,3,7,5.8,2,1.5,1.7,null,1,1,0,null,1,"G"]
[null,10,14,5,7,null,3,14,10,11,5,3.6,1.5,1.6,1.5,null,0,1,1,null,0,"P"]
[null,7,8,9,10,null,6,8,3,10,7,62.2,8.3,1.9,7,null,0,1,0,null,0,"P"]
[{"$nulls":16},"","","",null,"",""]
["2015-01-02",1,7,6,9,null,7,5,1,3,10,9.3,2.2,2.3,1.5,null,1,0,1,null,1,"G"]
["PAU",1,8,6,2,null,4,2,1,17,9,11.9,4.2,3.8,3.5,null,0,1,1,null,0,"P"]
[null,2,4,1,3,null,2,7,6,18,10,2.4,1.5,2.2,2.4,null,1,0,0,null,1,"G"]
[null,6,3,1,5,null,1,5,9,8,7,4.3,2.2,3.4,6.8,null,1,1,0,null,1,"G"]
[null,1,6,2,4,null,2,3,1,12,6,11,2.5,1.3,1.8,null,1,0,1,null,1,"G"]
[null,10,5,1,6,null,7,1,10,9,11,20.9,5,2,2,null,0,1,1,null,0,"P"]
[null,1,8,4,10,null,3,9,4,10,6,22,8.2,10,6.3,null,0,0,1,null,0,"P"]
[null,5,1,3,14,null,12,1,8,3,6,7.3,2.5,2.9,3.1,null,0,1,0,null,0,"P"]
[{"$nulls":16},"","","",null,"",""]
["2015-01-03",9,6,12,5,null,12,6,5,3,2,6.3,2,1.4,2.2,null,1,1,1,null,1,"G"]
["VINCENNES",10,11,7,9,null,10,11,8,3,6,2.4,1.2,1.6,2.4,null,1,1,0,null,1,"G"]
[null,5,9,12,14,null,10,13,5,14,3,63.1,7.3,1.5,2.7,null,0,0,1,null,0,"P"]
[null,9,11,7,18,null,2,11,13,1,9,10.3,2.9,2.4,7.1,null,0,1,0,null,0,"P"]
[null,12,11,7,4,null,12,9,4,15,11,11.7,3.3,2.2,8.8,null,1,0,1,null,1,"G"]
[null,15,9,5,8,null,16,6,11,12,15,9.7,2.4,6.4,3.3,null,0,0,0,null,0,"P"]
[null,6,8,5,7,null,8,1,5,6,4,1.9,1.1,6.4,2.2,null,1,0,1,null,1,"G"]
[null,14,8,13,10,null,12,14,3,10,5,4.7,2.5,1.7,14.1,null,0,1,0,null,0,"P"]
[{"$nulls":16},"","","",null,"",""]
["2015-01-04",5,4,2,8,null,9,4,5,8,3,5.5,1.9,2.7,1.6,null,0,1,1,null,0,"P"]
["VINCENNES",12,5,13,11,null,12,9,8,5,10,3,1.8,2.4,2.2,null,1,0,0,null,1,"G"]
[null,10,5,1,9,null,5,4,7,9,3,4.2,1.4,2.8,2.5,null,1,0,0,null,1,"G"]
[null,9,3,6,14,null,9,18,6,17,1,2.2,1.5,2.9,3.8,null,1,0,1,null,1,"G"]
[null,6,14,8,13,null,8,13,12,4,11,3.6,2.3,2.9,4.2,null,1,1,0,null,1,"G"]
[null,5,2,6,7,null,2,4,8,null,null,9.8,3.3,3.4,6.4,null,1,0,0,null,1,"G"]
[null,14,2,3,8,null,4,14,11,8,1,3.4,1.8,1.8,7,null,0,1,0,null,0,"P"]
[null,6,4,8,3,null,3,5,6,7,1,5.5,1.8,4.5,1.9,null,1,0,1,null,1,"G"]
[{"$nulls":16},"","","",null,"",""]
["2015-01-05",12,9,13,16,null,14,12,10,8,11,8.3,2.8,2.1,2.4,null,0,1,0,null,0,"P"]
["VINCENNES",18,9,2,17,null,3,13,6,9,16,8.2,2.8,2.6,11.9,null,0,0,0,null,0,"P"]
[null,3,6,10,5,null,10,6,3,5,1,1.6,1.1,1.2,1.4,null,1,1,1,null,1,"G"]
[null,5,4,8,9,null,5,11,10,9,7,2,1.2,2.5,2.3,null,{"$f":"IF(L194=\"\",\"\",COUNTIF(B194:E194,G194))","v":1},{"$f":"IF(M194=\"\",\"\",COUNTIF(B194:E194,H194))","v":0},{"$f":"IF(N194=\"\",\"\",COUNTIF(B194:E194,I194))","v":0},null,1,"G"]
[null,4,12,2,8,null,5,3,4,6,9,7.3,2.3,2,1.5,null,0,0,1,null,0,"P"]
[null,8,15,13,11,null,13,10,14,15,9,7.4,2.7,3.5,3.2,null,1,0,0,null,1,"G"]
[null,12,8,14,11,null,15,7,11,16,6,16.7,4.1,4.1,3.1,null,0,0,1,null,{"$f":"IF(L197=\"\",\"\",COUNTIF(B197:E197,G197))","v":0},{"$f":"IF(L197=\"\",\"\",IF(U197=0,\"P\",\"G\"))","v":"P"}]
[null,7,3,6,2,null,5,3,4,2,1,7.2,2.3,1.9,null,null,0,1,0,null,0,"P"]
[{"$nulls":16},"","","",null,"",""]
["2015-01-06",8,17,7,16,null,18,12,1,2,7,12.8,3.5,18.8,3.6,null,0,0,0,null,0,"P"]
["VINCENNES",7,11,8,5,null,11,8,6,10,2,2.6,1.7,2.6,4.2,null,1,1,0,null,1,"G"]
[null,18,6,1,11,null,6,4,5,16,9,7.2,2.5,7.7,3.3,null,1,0,0,null,1,"G"]
[null,11,5,2,4,null,12,14,5,15,6,3.1,2,3.9,2.5,null,0,0,1,null,0,"P"]
[null,13,12,15,16,null,12,6,15,4,9,4.5,2.2,2.4,1.8,null,1,0,1,null,1,"G"]
[null,3,4,10,1,null,11,13,9,12,8,2.3,1.9,2.7,22.5,null,0,0,0,null,0,"P"]
[null,8,7,5,6,null,5,3,7,6,null,2.2,1.3,2.2,3.3,null,1,0,1,null,1,"G"]
[null,9,1,2,5,null,1,7,9,3,10,11.3,2.8,2,2.3,null,1,0,1,null,1,"G"]
[{"$nulls":16},"","","",null,"",""]
["2015-01-07",7,2,16,17,null,7,1,8,13,14,4.8,2.2,5,1.6,null,1,0,0,null,1,"G"]
["CAGNES SUR MER",7,2,5,8,null,6,3,8,5,9,4.5,2,2.6,2.8,null,0,0,1,null,0,"P"]
[null,16,10,4,3,null,12,6,3,5,10,63.7,18.1,8,3.2,null,0,0,1,null,0,"P"]
[null,13,12,11,8,null,13,11,6,10,7,1.3,1.2,1.4,2,null,1,1,0,null,1,"G"]
[null,7,10,8,6,null,10,14,4,7,1,12.6,6.1,3.4,22,null,1,0,0,null,1,"G"]
[null,9,11,14,6,null,14,5,13,1,3,50.3,13,5.1,8.9,null,1,0,0,null,1,"G"]
[null,5,7,11,8,null,12,5,4,6,11,10.9,3.6,5.7,5.3,null,0,1,0,null,0,"P"]
[null,16,14,8,12,null,5,13,1,16,9,32.5,7.1,7.7,12.2,null,0,0,0,null,0,"P"]
[{"$nulls":16},"","","",null,"",""]
["2015-01-08",13,6,15,14,null,17,11,13,14,4,28.7,8.9,4.9,5.4,null,0,0,1,null,0,"P"]
["CAGNES SUR MER",7,3,6,8,null,7,1,4,6,3,2.9,1.6,1.6,4.9,null,1,0,0,null,1,"G"]
[null,10,6,8,9,null,3,5,4,2,null,3.3,2.6,3.5,3.3,null,0,0,0,null,0,"P"]
[null,9,7,5,12,null,12,5,4,2,10,3.2,1.8,2.7,13.4,null,1,1,0,null,1,"G"]
[null,12,6,9,7,null,10,2,4,8,3,10.5,2.5,2.4,1.9,null,0,0,0,null,0,"P"]
[null,11,9,2,7,null,13,9,11,15,7,23.7,4.2,2.2,1.5,null,0,1,1,null,0,"P"]
[null,13,7,14,11,null,14,7,3,11,10,6.2,2.1,1.7,2.8,null,1,1,0,null,1,"G"]
[null,8,13,9,1,null,13,8,9,1,11,6.2,2.2,1.5,4.2,null,1,1,1,null,1,"G"]
[{"$nulls":16},"","","",null,"",""]
["2015-01-09",11,9,15,6,null,8,4,12,15,16,13.5,4,12.5,1.7,null,0,0,0,null,0,"P"]
["VINCENNES",3,15,10,5,null,12,3,4,2,15,9,3.5,1.6,2.2,null,0,1,0,null,0,"P"]
[null,9,12,1,2,null,3,13,2,12,10,8.1,3.3,5.6,2.7,null,0,0,1,null,0,"P"]
[null,7,9,14,5,null,14,8,9,12,5,28.9,6.1,2.7,1.7,null,1,0,1,null,1,"G"]
[null,9,5,10,7,null,10,6,5,12,9,2.9,1.9,4.8,1.8,null,1,0,1,null,1,"G"]
[null,12,2,3,9,null,6,4,15,8,9,6.2,3.3,9.6,2.7,null,0,0,0,null,0,"P"]
[null,10,11,9,4,null,11,6,10,7,3,2.1,1.3,1.9,1.7,null,1,0,1,null,1,"G"]
[null,1,5,2,7,null,8,4,1,6,9,13.9,1.6,5.8,1.7,null,0,0,1,null,0,"P"]
[{"$nulls":16},"","","",null,"",""]
["2015-01-10",2,9,11,6,null,7,9,6,4,2,10.8,2.6,2.1,1.7,null,0,1,1,null,0,"P"]
["VINCENNES",6,16,7,9,null,17,8,10,15,13,18.3,7.2,7.2,4.3,null,0,0,0,null,0,"P"]
[null,6,15,7,11,null,6,9,2,14,1,8.9,2.8,4.1,2.7,null,1,0,0,null,1,"G"]
[null,14,17,12,16,null,14,12,17,16,9,9.6,2.2,1.2,2,null,1,1,1,null,1,"G"]
[null,9,8,4,6,null,3,6,7,2,4,6.4,3.4,2.8,3.4,null,0,1,0,null,0,"P"]
[null,14,13,6,9,null,15,13,10,12,5,25.5,4.8,2.8,2.5,null,0,1,0,null,0,"P"]
[null,13,12,11,7,null,10,13,2,14,6,13.3,4.1,1.8,4,null,0,1,0,null,0,"P"]
[null,5,3,4,6,null,4,3,2,1,7,4.3,2.6,1.8,null,null,1,1,0,null,1,"G"]
[{"$nulls":16},"","","",null,"",""]
["2015-01-11",10,9,8,3,null,9,10,11,5,6,3.6,1.5,1.3,1.9,null,1,1,0,null,1,"G"]
["VINCENNES",8,5,6,14,null,7,9,8,12,11,25.2,3.8,3.3,1.8,null,0,0,1,null,0,"P"]
[null,8,5,9,6,null,2,9,10,5,6,4,1.9,1.7,2.6,null,0,1,0,null,0,"P"]
[null,8,4,1,6,null,5,6,9,8,10,9.9,3.1,3.2,3.6,null,0,1,0,null,0,"P"]
[null,2,3,10,7,null,6,2,3,10,9,3.1,1.4,1.4,2.4,null,0,1,1,null,0,"P"]
[null,11,9,12,4,null,4,10,6,12,11,18.7,4.7,5.4,4.5,null,1,0,0,null,1,"G"]
[null,7,4,8,5,null,4,5,2,6,8,8.8,4.1,4,3.9,null,1,1,0,null,1,"G"]
[null,6,5,11,9,null,7,9,10,11,6,44,10.1,4,5.5,null,0,1,0,null,0,"P"]
[{"$nulls":16},"","","",null,"",""]
["2015-01-12",9,10,8,6,null,9,1,12,10,3,4.3,1.5,4.2,15.9,null,1,0,0,null,1,"G"]
["VINCENNES",14,7,17,16,null,10,7,16,2,15,5.4,2.5,3.1,3.2,null,0,1,1,null,0,"P"]
[null,8,4,5,10,null,10,6,7,1,9,2.3,1.3,2.5,3.3,null,1,0,0,null,1,"G"]
[null,7,9,13,11,null,18,17,14,10,15,4.4,2,2.1,8,null,0,0,0,null,0,"P"]
[null,10,8,9,11,null,11,9,8,10,5,4,1.7,1.7,1.3,null,{"$f":"IF(L258=\"\",\"\",COUNTIF(B258:E258,G258))","v":1},{"$f":"IF(M258=\"\",\"\",COUNTIF(B258:E258,H258))","v":1},{"$f":"IF(N258=\"\",\"\",COUNTIF(B258:E258,I258))","v":1},null,1,"G"]
[null,4,8,5,9,null,9,8,6,7,5,10.5,2.2,2.8,4.8,null,1,1,0,null,1,"G"]
[null,7,1,4,3,null,7,1,3,8,6,1.6,1.1,2.2,3.8,null,1,1,1,null,1,"G"]
[null,7,13,14,4,null,9,3,6,11,4,6.3,3.3,3.3,8.5,null,0,0,0,null,{"$f":"IF(L261=\"\",\"\",COUNTIF(B261:E261,G261))","v":0},{"$f":"IF(L261=\"\",\"\",IF(U261=0,\"P\",\"G\"))","v":"P"}]
[{"$nulls":16},"","","",null,"",""]
["2015-01-13",3,9,5,6,null,1,9,7,3,5,6.2,2.5,2.5,11.6,null,0,1,0,null,0,"P"]
["PAU",4,5,3,1,null,4,2,5,1,3,3.5,1.4,1.9,1.5,null,1,0,1,null,1,"G"]
[null,12,5,7,3,null,16,8,10,4,12,27.7,8,7.1,4.6,null,0,0,0,null,0,"P"]
[null,1,8,4,2,null,1,8,9,4,2,4.1,1.7,1.3,2.6,null,1,1,0,null,1,"G"]
[null,3,4,9,1,null,3,7,9,6,2,2.3,1.3,1.8,1.5,null,1,0,1,null,1,"G"]
[null,14,2,10,1,null,2,3,4,6,1,2.8,1.4,2.7,5.2,null,1,0,0,null,1,"G"]
[null,1,8,2,4,null,1,8,3,9,15,4.5,2.2,4,6.6,null,1,1,0,null,1,"G"]
[null,11,12,6,1,null,11,7,5,6,3,5.3,1.8,4.3,2.6,null,1,0,0,null,1,"G"]
[{"$nulls":16},"","","",null,"",""]
["2015-01-14",9,7,5,8,null,5,8,2,13,1,11,3.8,2.8,7.9,null,1,1,0,null,1,"G"]
["CAGNES SUR MER",0,0,0,0,null,4,11,9,2,5,7.9,2.3,2.1,2.5,null,0,0,0,null,0,"P"]
[null,9,8,2,4,null,8,7,2,3,9,10.8,1.8,5.4,1.1,null,1,0,1,null,1,"G"]
[null,0,0,0,0,null,1,4,6,3,7,4.3,2.4,10.6,3.7,null,0,0,0,null,0,"P"]
[null,2,8,5,9,null,2,5,3,8,9,18.5,4.6,1.9,2.8,null,1,1,0,null,1,"G"]
[null,1,7,3,9,null,9,2,1,12,8,15.6,3.9,1.6,2,null,1,0,1,null,1,"G"]
[null,9,3,5,2,null,7,6,1,5,12,40.6,9.6,4.7,1.7,null,0,0,0,null,0,"P"]
[{"$nulls":16},"","","",null,"",""]
["2015-01-15",9,15,16,8,null,16,10,15,9,8,4.7,1.8,2.8,1.5,null,1,0,1,null,1,"G"]
["VINCENNES",8,6,9,7,null,8,7,9,6,4,2.5,1.3,1.5,1.7,null,1,1,1,null,1,"G"]
[null,10,16,15,7,null,16,15,18,5,10,3.9,1.9,4.1,7.3,null,1,1,0,null,1,"G"]
[null,5,10,8,14,null,11,9,8,4,7,3.2,1.9,2.1,3.6,null,0,0,1,null,0,"P"]
[null,12,13,11,4,null,2,4,3,15,11,15.7,4.5,12.6,7,null,0,1,0,null,0,"P"]
[null,13,7,11,12,null,2,10,5,7,9,12.3,3.1,4.4,8.4,null,0,0,0,null,0,"P"]
[null,5,7,6,8,null,5,7,6,8,2,3.4,1.4,1.2,1.7,null,1,1,1,null,1,"G"]
[null,11,14,9,6,null,14,7,9,1,3,9.4,3.3,3.6,5.2,null,1,0,1,null,1,"G"]
[{"$nulls":16},"","","",null,"",""]
["2015-01-16",9,7,2,6,null,10,3,6,9,1,16.7,3.7,5.8,2.9,null,0,0,1,null,0,"P"]
["CAGNES SUR MER",13,1,4,6,null,1,5,13,3,16,8.3,2.7,3.7,4.8,null,1,0,1,null,1,"G"]
[null,2,8,6,7,null,6,3,2,5,8,6.2,2.3,1.8,2,null,1,0,1,null,1,"G"]
[null,3,13,5,7,null,3,5,2,13,12,12.4,3.8,2,2.5,null,1,1,0,null,1,"G"]
[null,1,13,2,4,null,13,8,11,1,6,7.7,2.5,2.7,4.1,null,1,0,0,null,1,"G"]
[null,7,9,8,10,null,1,10,13,11,3,5.8,2.2,3.2,10.4,null,0,1,0,null,0,"P"]
[null,1,2,6,7,null,8,1,4,16,10,7.3,3,5.1,2.8,null,0,1,0,null,0,"P"]
[null,7,3,16,15,null,12,3,13,16,11,29.9,8.2,3.7,6,null,0,1,0,null,0,"P"]
[{"$nulls":16},"","","",null,"",""]
["2015-01-17",16,10,7,8,null,4,9,5,7,13,59,17,6,5.6,null,0,0,0,null,0,"P"]
["VINCENNES",8,17,6,14,null,14,6,10,12,5,11.2,4.2,4,8,null,1,1,0,null,1,"G"]
[null,9,7,4,3,null,13,11,10,7,1,4.1,1.7,2.4,3.8,null,0,0,0,null,0,"P"]
[null,11,12,7,9,null,13,3,11,1,16,13.4,4.1,5.5,2.7,null,0,0,1,null,0,"P"]
[null,4,13,10,14,null,10,14,4,11,5,7.7,2.8,2.4,4.1,null,1,1,1,null,1,"G"]
[null,8,3,6,14,null,6,7,13,9,12,3.2,2.5,6.7,6,null,1,0,0,null,1,"G"]
[null,7,1,2,4,null,8,9,7,5,4,12,2.7,2,1.4,null,0,0,1,null,0,"P"]
[null,6,4,8,2,null,6,8,5,3,1,3.6,1.2,1.4,1.4,null,1,1,0,null,1,"G"]
[{"$nulls":16},"","","",null,"",""]
["2015-01-18",14,17,2,18,null,17,6,7,11,15,4.7,2.6,2.7,10.9,null,1,0,0,null,1,"G"]
["VINCENNES",8,7,10,5,null,7,1,10,8,2,3.9,1.8,4.7,2,null,1,0,1,null,1,"G"]
[null,7,6,12,4,null,12,9,10,4,3,2.9,1.7,7.4,2.4,null,1,0,0,null,1,"G"]
[null,18,17,3,8,null,18,17,16,7,10,3.6,1.4,1.4,2.6,null,1,1,0,null,1,"G"]
[null,14,7,5,8,null,9,7,6,14,2,40.1,7.2,2.4,3,null,0,1,0,null,0,"P"]
[null,5,8,10,14,null,5,10,4,8,6,7.8,2.6,2.9,8,null,1,1,0,null,1,"G"]
[null,5,4,8,7,null,7,8,6,4,2,9.1,1.5,1.1,1.6,null,1,1,0,null,1,"G"]
[null,6,7,8,5,null,9,2,7,6,4,1.8,1.3,3.6,2.3,null,0,0,1,null,0,"P"]
[{"$nulls":16},"","","",null,"",""]
["2015-01-19",5,12,3,2,null,8,16,3,7,2,5.3,1.8,6.6,2.5,null,0,0,1,null,0,"P"]
["CAGNES SUR MER",8,6,1,4,null,1,8,4,3,6,2.4,1.2,1.3,1.2,null,1,1,1,null,1,"G"]
[null,7,2,10,4,null,9,11,4,3,7,5.8,2.6,3.5,2.5,null,0,0,1,null,0,"P"]
[null,4,3,8,1,null,7,6,5,2,4,5.3,2.5,5.6,4.8,null,0,0,0,null,0,"P"]
[null,13,1,7,5,null,5,6,14,2,7,22.6,6.3,3.9,2.7,null,1,0,0,null,1,"G"]
[null,2,6,4,5,null,6,4,8,13,9,4.7,2.1,2.6,4,null,1,1,0,null,1,"G"]
[null,5,1,8,11,null,6,11,3,1,7,12,4.5,3.2,2.4,null,{"$f":"IF(L322=\"\",\"\",COUNTIF(B322:E322,G322))","v":0},{"$f":"IF(M322=\"\",\"\",COUNTIF(B322:E322,H322))","v":1},{"$f":"IF(N322=\"\",\"\",COUNTIF(B322:E322,I322))","v":0},null,0,"P"]
[{"$nulls":16},"","","",null,"",""]
["2015-01-20",4,5,9,8,null,6,5,3,4,8,24.6,10.1,1.5,2,null,0,1,0,null,0,"P"]
["CAGNES SUR MER",7,3,6,5,null,3,6,1,10,15,5.1,1.7,2.9,4.2,null,1,1,0,null,{"$f":"IF(L325=\"\",\"\",COUNTIF(B325:E325,G325))","v":1},{"$f":"IF(L325=\"\",\"\",IF(U325=0,\"P\",\"G\"))","v":"G"}]
[null,5,10,6,7,null,7,10,8,4,3,4.7,2,2.3,4.2,null,1,1,0,null,1,"G"]
[null,5,7,12,1,null,13,7,1,15,6,25.5,8.6,4,4.1,null,0,1,1,null,0,"P"]
[null,5,13,6,11,null,8,14,7,5,9,7.1,2.7,2.9,6.1,null,0,0,0,null,0,"P"]
[null,12,4,10,9,null,2,7,5,4,11,5.2,2.5,3.1,5.3,null,0,0,0,null,0,"P"]
[null,6,11,12,2,null,16,12,8,2,11,32.6,9.2,6.4,4.1,null,0,1,0,null,0,"P"]
[null,0,0,0,0,null,9,8,1,11,3,4.4,1.8,1.3,1.9,null,0,0,0,null,0,"P"]
[{"$nulls":20},"",""]
["2015-01-21",13,16,3,9,null,2,3,9,10,8,32.1,7.8,2.4,1.8,null,0,1,1,null,0,"P"]
["CAGNES SUR MER",3,2,8,0,null,7,6,5,8,1,3,1.4,2.1,1.4,null,0,0,0,null,0,"P"]
[null,4,1,3,11,null,5,11,1,8,9,3.5,1.5,1.9,1.6,null,0,1,1,null,0,"P"]
[null,4,5,8,1,null,3,8,1,2,5,15.1,4.1,1.7,4.5,null,0,1,1,null,0,"P"]
[null,10,4,9,11,null,8,2,7,5,9,7.8,2.6,5.2,4.8,null,0,0,0,null,0,"P"]
[null,11,14,16,15,null,10,9,15,11,14,4,2,4.5,3.4,null,0,0,1,null,0,"P"]
[null,3,2,13,1,null,14,13,10,8,1,10.5,3.2,2.6,21.4,null,0,1,0,null,0,"P"]
[null,3,13,12,15,null,11,6,7,12,4,7.6,2.4,2.6,3.7,null,0,0,0,null,0,"P"]
[{"$nulls":16},"","","",null,"",""]
["2015-01-22",17,18,2,11,null,11,9,17,10,5,3.7,1.4,3.9,2.4,null,1,0,1,null,1,"G"]
["VINCENNES",4,11,8,9,null,2,8,13,5,4,3.8,2.1,2,3.2,null,0,1,0,null,0,"P"]
[null,7,8,17,10,null,1,10,4,5,8,12.6,5.2,2.3,7.6,null,0,1,0,null,0,"P"]
[null,5,6,7,10,null,9,4,3,6,7,3.5,1.6,4.3,2.7,null,0,0,0,null,0,"P"]
[null,9,7,6,5,null,7,4,3,9,2,2.2,1.3,2.4,3.7,null,1,0,0,null,1,"G"]
[null,14,2,6,13,null,10,13,14,3,1,5.3,2.2,2.9,1.8,null,0,1,1,null,0,"P"]
[null,8,10,12,11,null,12,2,11,9,8,3.8,1.6,5.6,2,null,1,0,1,null,1,"G"]
[null,8,7,11,10,null,8,10,12,6,5,14.4,3.1,1.5,6.2,null,1,1,0,null,1,"G"]
[{"$nulls":16},"","","",null,"",""]
["2015-01-23",1,14,7,5,null,6,1,17,16,2,13,3.3,3.3,4.5,null,0,1,0,null,0,"P"]
["PAU",6,5,8,9,null,5,6,3,1,9,3.2,1.5,1.4,2,null,1,1,0,null,1,"G"]
[null,12,1,14,2,null,12,9,1,13,3,14.9,2.6,2.3,1.2,null,1,0,1,null,1,"G"]
[null,12,8,9,1,null,1,11,6,2,5,2.4,1.5,2.6,2.1,null,1,0,0,null,1,"G"]
[null,4,2,3,1,null,1,2,4,3,null,12.8,2.4,1.1,null,null,1,1,1,null,1,"G"]
[null,9,5,14,4,null,4,12,7,3,1,16.4,6.1,2.6,6.3,null,1,0,0,null,1,"G"]
[null,6,3,9,2,null,10,3,1,11,4,11.6,2.9,2.1,3,null,0,1,0,null,0,"P"]
[null,2,4,7,16,null,9,7,3,2,11,4.9,1.9,1.7,2.6,null,0,1,0,null,0,"P"]
[{"$nulls":16},"","","",null,"",""]
["2015-01-24",6,2,8,4,null,6,1,8,4,9,10.3,2.4,2.8,1.9,null,1,0,1,null,1,"G"]
["VINCENNES",17,18,16,1,null,18,16,17,6,13,6.5,2.2,2.6,2,null,1,1,1,null,1,"G"]
[null,5,6,8,7,null,2,8,7,6,4,12.7,4.1,2.1,2.2,null,0,1,1,null,0,"P"]
[null,15,7,4,1,null,6,7,1,15,10,3.4,1.7,3.1,6.5,null,0,1,1,null,0,"P"]
[null,14,9,12,13,null,4,7,14,2,5,10.6,4.5,2.9,4.5,null,0,0,1,null,0,"P"]
[null,18,14,16,8,null,13,5,17,18,11,2.6,1.5,2.6,2.4,null,0,0,0,null,0,"P"]
[null,3,8,4,10,null,8,3,6,4,9,2.7,1.4,2,4.2,null,1,1,0,null,1,"G"]
[null,1,9,4,7,null,2,3,15,4,12,4.8,2.1,7.1,5.3,null,0,0,0,null,0,"P"]
[null,9,7,11,4,{"$nulls":11},"","","",null,"",""]
[{"$nulls":16},"","","",null,"",""]
["2015-01-25",15,4,8,6,null,12,15,4,7,13,11.8,2.5,1.4,4.3,null,0,1,1,null,0,"P"]
["VINCENNES",4,2,9,13,null,4,13,15,8,14,2.3,1.5,2.1,2.9,null,1,1,0,null,1,"G"]
[null,3,12,2,1,null,6,11,1,12,5,4.6,2.3,8.7,3.2,null,0,0,1,null,0,"P"]
[null,9,3,8,4,null,9,3,13,16,4,1.9,1.3,2.3,8.2,null,1,1,0,null,1,"G"]
[null,5,4,7,6,null,7,10,3,4,5,3.3,1.2,1.4,2,null,1,0,0,null,1,"G"]
[null,6,16,18,2,null,15,3,17,10,6,2.4,1.4,8.8,3.8,null,0,0,0,null,0,"P"]
[null,9,8,1,15,null,1,9,2,8,12,1.6,1.4,1.4,4.6,null,1,1,0,null,1,"G"]
[null,2,9,1,4,null,4,5,11,13,3,25.8,6,7,5.4,null,1,0,0,null,1,"G"]
[{"$nulls":16},"","","",null,"",""]
["2015-01-26",11,6,13,3,null,9,15,6,13,14,2.2,1.7,8,2.4,null,0,0,1,null,0,"P"]
["VINCENNES",17,3,14,15,null,3,2,6,16,1,50.3,11.7,16.9,17.4,null,1,0,0,null,1,"G"]
[null,15,13,4,11,null,4,11,3,13,5,23.9,5.3,1.6,3.9,null,1,1,0,null,1,"G"]
[null,9,15,8,7,null,16,14,6,12,8,17.3,4.5,4.7,5,null,0,0,0,null,0,"P"]
[null,9,8,10,4,null,8,10,9,7,1,5.5,1.4,1.6,1.2,null,1,1,1,null,1,"G"]
[null,2,10,11,9,null,8,9,11,4,2,6.2,2.3,2,1.4,null,0,1,1,null,0,"P"]
[null,10,13,12,7,null,8,13,5,3,6,2.5,1.7,3,2.9,null,0,1,0,null,0,"P"]
[null,10,12,11,7,null,10,2,1,9,3,4.9,2,7,2.1,null,1,0,0,null,1,"G"]
[{"$nulls":16},{"$f":"IF(L387=\"\",\"\",COUNTIF(B387:E387,G387))","v":""},{"$f":"IF(M387=\"\",\"\",COUNTIF(B387:E387,H387))","v":""},{"$f":"IF(N387=\"\",\"\",COUNTIF(B387:E387,I387))","v":""},null,"",""]
["2015-01-27",4,3,8,1,null,4,7,8,5,3,1.7,1.2,1.6,1.3,null,1,0,1,null,1,"G"]
["VINCENNES",8,14,11,5,null,1,12,9,11,14,4.2,2,1.5,2.5,null,0,0,0,null,{"$f":"IF(L389=\"\",\"\",COUNTIF(B389:E389,G389))","v":0},{"$f":"IF(L389=\"\",\"\",IF(U389=0,\"P\",\"G\"))","v":"P"}]
[null,10,2,12,5,null,2,10,13,7,11,27.2,2.7,1.4,2,null,1,1,0,null,1,"G"]
[null,5,7,2,4,null,4,11,12,10,13,2.5,1.6,3,14.1,null,1,0,0,null,1,"G"]
[null,4,2,3,8,null,4,3,10,2,12,7.5,2.6,1.8,2.2,null,1,1,0,null,1,"G"]
[null,10,7,5,14,null,11,10,13,9,5,11.2,2.5,2.2,10.9,null,0,1,0,null,0,"P"]
[null,16,3,9,18,null,14,16,9,5,7,28.5,7.5,2.6,4.1,null,0,1,1,null,0,"P"]
[null,10,9,6,11,null,10,7,8,2,1,3.6,2,2.2,7.1,null,1,0,0,null,1,"G"]
[{"$nulls":16},"","","",null,"",""]
["2015-01-28",9,6,2,1,null,3,6,8,2,10,10.2,2.6,1.5,2.7,null,0,1,0,null,0,"P"]
["CAGNES SUR MER",16,4,13,8,null,4,12,15,3,17,11.2,3.9,9,6.8,null,1,0,0,null,1,"G"]
[null,9,8,6,4,null,4,7,5,8,9,6.9,2.4,5.1,1.6,null,1,0,0,null,1,"G"]
[null,4,8,2,7,null,6,4,12,2,1,13.5,3.5,1.6,2.2,null,0,1,0,null,0,"P"]
[null,3,6,2,12,null,6,8,10,14,1,2.3,1.3,2.2,1.9,null,1,0,0,null,1,"G"]
[null,1,14,9,7,null,5,7,11,4,3,26.5,9.6,7.3,2.5,null,0,1,0,null,0,"P"]
[null,3,17,1,7,null,6,4,8,7,14,5,2,4.2,17.8,null,0,0,0,null,0,"P"]
[null,9,8,7,6,null,14,8,9,1,15,16.4,5.3,2,2.4,null,0,1,1,null,0,"P"]
[{"$nulls":16},"","","",null,"",""]
["2015-01-29",12,13,11,14,null,11,10,4,14,6,4.7,2.1,2.1,4.2,null,1,0,0,null,1,"G"]
["VINCENNES",17,14,12,8,null,8,17,9,5,2,22.4,4.7,1.7,2.4,null,1,1,0,null,1,"G"]
[null,9,8,3,12,null,12,6,8,7,4,2.9,1.8,4,2.2,null,1,0,1,null,1,"G"]
[null,4,13,9,1,null,4,12,1,9,10,3,1.5,1.8,1.9,null,1,0,1,null,1,"G"]
[null,6,9,8,4,null,6,2,4,8,1,2.2,1.3,1.8,2.2,null,1,0,1,null,1,"G"]
[null,6,4,8,16,null,13,8,6,7,3,14.5,4.3,4.5,6.1,null,0,1,1,null,0,"P"]
[null,7,12,6,4,null,7,12,11,1,3,3.2,1.8,1.9,5.6,null,1,1,0,null,1,"G"]
[null,9,8,6,15,null,4,6,3,15,10,10,2.9,6.3,14.2,null,0,1,0,null,0,"P"]
[null,15,11,5,14,{"$nulls":11},"","","",null,"",""]
[{"$nulls":16},"","","",null,"",""]
["2015-01-30",7,10,5,16,null,12,3,6,2,11,10.7,3.3,9.4,2,null,0,0,0,null,0,"P"]
["PAU",1,2,3,5,null,1,5,3,6,4,1.3,1.1,4.2,null,null,1,1,1,null,1,"G"]
[null,2,8,7,4,null,7,3,1,6,2,2.8,1.2,2.2,4,null,1,0,0,null,1,"G"]
[null,5,4,1,3,null,4,2,1,6,7,11.5,4,2.7,null,null,1,0,1,null,1,"G"]
[null,4,1,3,6,null,3,4,2,1,null,5.6,2.2,1.6,3.4,null,1,1,0,null,1,"G"]
[null,4,8,1,14,null,8,4,6,3,13,8.3,2.6,1.9,1.8,null,1,1,0,null,1,"G"]
[null,2,5,3,9,null,9,3,2,5,1,6.6,1.8,1.6,1.7,null,1,1,1,null,1,"G"]
[null,1,6,12,5,null,10,16,12,2,1,17.5,5.3,5.5,3.6,null,0,0,1,null,0,"P"]
[{"$nulls":16},"","","",null,"",""]
["2015-01-31",6,11,9,7,null,11,4,7,6,5,5.5,2.3,3.9,3.6,null,1,0,1,null,1,"G"]
["VINCENNES",6,9,4,10,null,6,7,3,4,2,5.1,2.2,3.8,2.3,null,1,0,0,null,1,"G"]
[null,10,7,4,8,null,10,7,9,4,8,2.2,1.2,1.8,1.9,null,1,1,0,null,1,"G"]
[null,9,8,15,4,null,14,9,10,5,4,15.6,3.5,1.4,5.3,null,0,1,0,null,0,"P"]
[null,11,14,15,16,null,14,13,4,6,1,8.2,3.7,3,15,null,1,0,0,null,1,"G"]
[null,9,6,18,3,null,2,14,6,5,17,14.9,4.1,2.6,3.6,null,0,0,1,null,0,"P"]
[null,10,8,7,9,null,4,8,7,10,5,8.8,2.6,2.5,1.8,null,0,1,1,null,0,"P"]
[null,8,4,7,5,null,4,9,11,1,7,6.3,2,3.3,1.7,null,1,0,0,null,1,"G"]
[{"$nulls":16},"","","",null,"",""]
["2015-02-01",9,6,1,4,null,6,15,2,5,7,3.2,1.6,3.1,2.4,null,1,0,0,null,1,"G"]
["VINCENNES",8,5,2,6,null,6,5,8,2,3,2,1.1,1.1,1.1,null,1,1,1,null,1,"G"]
[null,8,6,5,3,null,6,8,5,13,10,5.3,1.7,1.8,2.1,null,1,1,1,null,1,"G"]
[null,17,14,15,10,null,14,12,5,6,10,3.4,1.6,13.3,10.1,null,1,0,0,null,1,"G"]
[null,7,8,6,9,null,8,7,6,2,4,1.7,1.2,1.3,2.2,null,1,1,1,null,1,"G"]
[null,11,3,8,13,null,10,11,8,9,5,9.3,2.1,1.9,3.3,null,0,1,1,null,0,"P"]
[null,12,7,11,10,null,7,11,6,10,3,16.3,2.8,1.6,4.1,null,1,1,0,null,1,"G"]
[null,12,4,7,10,null,9,5,3,1,11,34.1,9.4,2.6,5.6,null,0,0,0,null,0,"P"]
[{"$nulls":16},"","","",null,"",""]
["2015-02-02",13,10,11,6,null,10,6,9,3,11,3.4,2.3,3.2,15.2,null,1,1,0,null,1,"G"]
["VINCENNES",9,4,5,8,null,4,9,8,5,1,10.3,1.3,1.1,1.5,null,1,1,1,null,1,"G"]
[null,9,5,11,1,null,9,11,6,3,1,3.2,1.7,3.4,3.7,null,1,1,0,null,1,"G"]
[null,12,10,11,9,null,6,11,8,4,10,47,9,12.1,4,null,0,1,0,null,0,"P"]
[null,12,14,8,9,null,7,12,2,5,11,9.3,3.2,1.7,4.7,null,0,1,0,null,0,"P"]
[null,12,4,9,2,null,13,11,5,10,7,4.3,2.5,6.7,4.5,null,0,0,0,null,0,"P"]
[null,10,8,6,9,null,10,8,7,5,6,1.8,1.2,1.8,2.5,null,1,1,0,null,1,"G"]
[null,12,11,10,8,null,12,1,6,11,2,4,1.4,2.7,2.2,null,1,0,0,null,1,"G"]
[{"$nulls":16},{"$f":"IF(L451=\"\",\"\",COUNTIF(B451:E451,G451))","v":""},{"$f":"IF(M451=\"\",\"\",COUNTIF(B451:E451,H451))","v":""},{"$f":"IF(N451=\"\",\"\",COUNTIF(B451:E451,I451))","v":""},null,"",""]
["2015-02-03",5,9,8,7,null,5,3,12,1,6,2.3,1.2,2,2.7,null,1,0,0,null,1,"G"]
["CAGNES SUR MER",5,10,2,6,null,9,5,6,10,4,13.5,2.7,1.4,2.5,null,0,1,1,null,{"$f":"IF(L453=\"\",\"\",COUNTIF(B453:E453,G453))","v":0},{"$f":"IF(L453=\"\",\"\",IF(U453=0,\"P\",\"G\"))","v":"P"}]
[null,4,13,9,14,null,4,9,13,3,8,5.5,1.7,1.6,1.8,null,1,1,1,null,1,"G"]
[null,7,9,2,12,null,7,12,8,13,10,2.3,1.5,2.5,3.3,null,1,1,0,null,1,"G"]
[null,3,12,7,9,null,3,7,12,9,14,1.6,1.3,2.8,3.6,null,1,1,1,null,1,"G"]
[null,8,10,2,9,null,9,10,4,2,6,6.3,1.8,1.5,2.2,null,1,1,0,null,1,"G"]
[null,18,16,12,14,null,18,12,16,15,6,2.4,1.4,1.9,1.6,null,1,1,1,null,1,"G"]
[null,8,9,11,4,null,6,1,4,11,8,8.4,1.9,3.5,2.2,null,0,0,1,null,0,"P"]
[{"$nulls":16},"","","",null,"",""]
["2015-02-04",7,10,9,11,null,9,7,8,12,2,2.8,1.7,2.1,2.8,null,1,1,0,null,1,"G"]
["VINCENNES",4,5,13,3,null,5,4,12,2,6,2.8,1.7,1.5,2.3,null,1,1,0,null,1,"G"]
[null,3,2,7,10,null,11,13,12,8,7,4.1,1.8,2.9,4,null,0,0,0,null,0,"P"]
[null,7,3,4,8,null,11,3,8,9,6,10.5,2.8,1.9,5.7,null,0,1,1,null,0,"P"]
[null,7,4,10,6,null,6,13,7,4,12,19.8,4,3.1,1.6,null,1,0,1,null,1,"G"]
[null,13,8,11,10,null,5,7,11,4,3,9.1,3.8,3.3,10.6,null,0,0,1,null,0,"P"]
[null,2,6,3,5,null,7,6,3,5,1,7.4,2.3,1.2,null,null,0,1,1,null,0,"P"]
[null,8,10,3,6,null,8,13,9,7,6,4.1,1.9,3.2,2.4,null,1,0,0,null,1,"G"]
[{"$nulls":16},"","","",null,"",""]
["2015-02-05",6,14,15,12,null,14,6,17,15,16,3.8,1.9,1.7,2.6,null,1,1,0,null,1,"G"]
["VINCENNES",9,6,11,13,null,5,10,18,9,11,18.2,6.2,7.5,1.9,null,0,0,0,null,0,"P"]
[null,4,5,8,10,null,5,4,1,8,9,3.4,1.3,1.3,2.3,null,1,1,0,null,1,"G"]
[null,12,10,9,14,null,11,2,10,9,1,2.8,1.6,1.8,2.1,null,0,0,1,null,0,"P"]
[null,11,6,9,8,null,8,11,3,6,9,2.6,1.2,1.3,2.2,null,1,1,0,null,1,"G"]
[null,10,6,8,9,null,6,8,10,3,4,1.7,1.1,1.2,2,null,1,1,1,null,1,"G"]
[null,10,3,5,9,null,10,7,5,6,1,2.8,1.3,2,2.2,null,1,0,1,null,1,"G"]
[null,6,10,8,9,null,11,6,2,8,4,15,3.4,1.5,3.2,null,0,1,0,null,0,"P"]
[{"$nulls":16},"","","",null,"",""]
["2015-02-06",15,7,5,16,null,7,5,12,8,11,4.6,2,3.8,15.5,null,1,1,0,null,1,"G"]
["CAGNES SUR MER",13,12,11,9,null,2,4,11,10,12,2.7,1.8,5,10.5,null,0,0,1,null,0,"P"]
[null,13,8,14,12,null,6,15,8,11,13,31.3,6,7.2,2,null,0,0,1,null,0,"P"]
[null,14,7,5,8,null,11,12,13,1,7,25.3,4.5,3.3,2.7,null,0,0,0,null,0,"P"]
[null,8,2,3,10,null,9,7,4,10,3,7.3,2.6,4.3,14.7,null,0,0,0,null,0,"P"]
[null,7,9,11,2,null,12,7,3,1,10,7.6,2.9,1.7,10.1,null,0,1,0,null,0,"P"]
[null,7,6,5,2,null,7,1,9,8,3,1.7,1.3,2.5,9.9,null,1,0,0,null,1,"G"]
[null,3,4,1,6,null,6,3,10,7,9,3.8,2,1.5,5,null,1,1,0,null,1,"G"]
[]
["2015-02-07",10,5,8,11]
[null,6,11,13,10]
[null,9,3,4,10]
[null,14,6,1,2]
[null,7,12,15,13]
[null,10,4,7,3]
[null,5,10,9,4]
[null,13,7,8,9]
[]
["2015-02-08",9,3,2,4]
[null,16,11,3,5]
[null,6,7,3,1]
[null,6,9,4,5]
[null,9,8,5,2]
[null,2,9,6,3]
[null,9,6,10,15]
[null,6,7,5,3]
[]
["2015-02-09",7,6,3,8]
[null,8,12,13,5]
[null,14,13,6,10]
[null,10,11,9,8]
[null,3,15,10,16]
[null,6,12,5,10]
[null,6,5,4,7]
[null,7,5,4,9]
[]
["2015-02-10",12,11,7,5]
[null,6,8,9,5]
[null,6,5,1,7]
[null,11,10,9,8]
[null,5,4,15,8]
[null,8,12,14,15]
[null,9,1,6,12]
[null,11,8,12,7]
[]
["2015-02-11",5,10,11,1]
[null,1,3,4,5]
[null,6,8,1,2]
[null,2,5,4,3]
[null,2,4,6,3]
[null,6,8,2,10]
[null,6,4,2,10]
[null,1,3,7,4]
[]
["2015-02-12",5,3,9,4]
[null,3,11,14,7]
[null,4,8,9,11]
[null,6,4,2,8]
[null,6,8,10,3]
[null,7,8,5,9]
[null,5,10,9,4]
[null,2,8,4,3]
[]
["2015-02-13",3,1,2,4]
[null,3,9,5,4]
[null,6,2,4,1]
[null,1,3,4,6]
[null,4,7,3,5]
[null,2,6,1,12]
[null,4,6,9,8]
[null,12,2,14,4]
[]
["2015-02-14",7,2,6,5]
[null,2,7,3,9]
[null,14,13,5,1]
[null,6,4,2,1]
[null,9,6,3,1]
[null,7,6,2,1]
[null,6,3,7,8]
[null,9,5,4,7]
[]
["2015-02-15",11,8,1,9]
[null,6,10,15,11]
[null,11,5,9,1]
[null,17,1,7,10]
[null,11,10,6,7]
[null,13,11,10,8]
[null,10,9,16,6]
[null,9,4,3,2]
[]
["2015-02-16",14,13,3,9]
[null,17,11,7,9]
[null,4,7,9,3]
[null,7,5,6,4]
[null,9,8,5,7]
[null,3,6,2,9]
[null,14,13,11,12]
[null,10,9,8,11]
[]
["2015-02-17",13,6,3,5]
[null,11,9,8,10]
[null,18,4,14,13]
[null,8,12,10,7]
[null,10,9,15,11]
[null,3,8,5,7]
[null,10,3,6,9]
[null,6,8,11,9]
[]
["2015-02-18",3,5,1,8]
[null,7,3,4,1]
[null,4,6,5,1]
[null,12,5,4,9]
[null,3,4,6,2]
[null,8,5,7,1]
[null,1,13,9,11]
[null,4,3,11,9]
[]
["2015-02-19",4,2,8,5]
[null,7,8,9,4]
[null,7,4,11,9]
[null,7,13,15,14]
[null,10,6,11,4]
[null,2,1,7,8]
[null,4,11]
[null,8,7,3,5]
[]
["2015-02-20",15,12,1,5]
[null,10,11,5,6]
[null,7,6,10,3]
[null,4,3,2,6]
[null,9,4,7,3]
[null,7,8,12,11]
[null,8,5,6,7]
[null,14,13,16,12]
[]
["2015-02-21",2,7,3,5]
[null,7,1,3,6]
[null,7,8,1,2]
[null,1,2,6,3]
[null,2,5,8,1]
[null,4,1,5,2]
[null,3,12,5,1]
[null,6,10,1,4]
[]
["2015-02-22",2,6,4,7]
[null,9,3,11,7]
[null,14,5,7,10]
[null,11,15,17,10]
[null,7,5,4,2]
[null,12,11,9,13]
[null,2,8,10,12]
[null,7,9,2,12]
[]
["2015-02-23",5,6,8,7,null,12,2,7,3,16,9.4,3.5,7.6,11]
["MARSEILLE BORELY",2,7,5,9,null,9,4,8,1,11,8.8,3.2,7.4,3.4]
[null,6,8,5,2,null,10,9,2,12,5,20.7,3.1,1.6,3.3]
[null,9,8,6,10,null,2,13,4,6,14,13,3.8,2.2,5.3]
[null,4,11,9,10,null,1,8,11,13,3,4.5,2.3,2,4.2]
[null,5,8,6,15,null,4,7,10,9,3,8.1,1.5,2.1,2.5]
["Annulée",13,9,12,11,{"$nulls":6},0,0]
[]
["2015-02-24",3,8,4,2]
[null,2,1,14,6]
[null,1,4,10,2]
[null,2,4,3,8]
[null,2,3,1,13]
[null,1,6,4,8]
[null,7,5,1,11]
[]
["2015-02-25",14,16,8,12]
[null,7,9,13,1]
[null,15,16,5,7]
[null,16,6,1,5]
[null,9,11,14,10]
[null,9,10,14,12]
[null,18,8,17,14]
[null,7,5,6,3]
[]
["2015-02-26",16,5,14,10]
[null,16,8,11,15]
[null,2,10,1,9]
[null,12,13,5,4]
[null,12,13,9,10]
[null,8,10,11,2]
[null,9,10,8,4]
[null,16,14,11,12]
[]
["2015-02-27",13,1,2,3]
[null,3,5,6,2]
[null,7,11,3,6]
[null,2,9,3,4]
[null,2,5,4,1]
[null,2,4,5,1]
[null,7,10,3,1]
[null,4,8,3,1]
[]
["2015-02-28",14,4,8,6]
[null,10,8,11,2]
[null,8,5,7,10]
[null,6,8,7,15]
[null,9,6,2,11]
[null,2,8,9,6]
[null,7,6,9,10]
[null,9,6,5,8]
[]
["2015-03-01",1,6,2,3]
[null,10,1,7,11]
[null,5,1,3,2]
[null,3,5,1,6]
[null,9,1,8,6]
[null,4,6,3,1]
[null,2,4,5,3]
[null,3,1,8,2]
[]
["2015-03-02",3,1,6,11]
[null,6,3,2,5]
[null,1,6,2,3]
[null,1,12,4,2]
[null,1,2,3,4]
[null,5,1,3,6]
[null,4,5,6,10]
[null,1,8,2,6]
[]
["2015-03-03",1,2,3,4]
[null,10,8,5,4]
[null,3,2,1,4]
[null,2,5,9,7]
[null,2,5,6,4]
[null,5,7,6,1]
[null,2,3,1,6]
[null,13,7,4,9]
[]
["2015-03-04",5,2,12,6]
[null,5,7,11,3]
[null,9,16,5,14]
[null,10,14,12,11]
[null,5,3,4,1]
[null,16,13,8,3]
[null,2,5,12,3]
[null,7,6,1,5]
[]
["2015-03-05",9,6,15,14]
[null,"X"]
[null,8,11,7,5]
[null,"X"]
[null,2,1,3,8]
[null,1,12,4,7]
[null,1,8,5,2]
[null,2,5,6,3]
[]
["2015-03-06",3,2,4,1]
[null,7,2,3,4]
[null,3,1,10,5]
[null,5,1,2,6]
[null,2,4,1,3]
[null,5,4,1,9]
[null,3,9,10,5]
[null,3,1,11,8]
[]
["2015-03-07",7,4,6,1]
[null,5,6,4,1]
[null,1,7,2,9]
[null,1,10,9,4]
[null,7,1,17,10]
[null,2,3,9,5]
[null,4,7,12,2]
[null,9,13,3,4]
[]
["2015-03-08",4,2,5,1]
[null,3,7,9,2]
[null,9,7,8,5]
[null,1,4,2,3]
[null,7,9,3,5]
[null,3,1,4,7]
[null,4,2,3,1]
[null,9,3,2,1]
[]
["2015-03-09",10,1,7,3]
[null,2,6,4,9]
[null,4,2,13,1]
[null,9,3,2,6]
[null,9,7,2,5]
[null,2,3,4,6]
[null,7,5,8,1]
[null,7,1,3,6]
[]
["2015-03-10","X"]
[null,6,5,4,2]
[null,8,2,1,6]
[null,"X"]
[null,9,4,5,1]
[null,5,8,1,3]
[null,2,4,6,1]
[null,4,7,3,1]
[]
["2015-03-11",7,12,8,11]
[null,15,1,17,16]
[null,13,8,9,11]
[null,8,7,9,6]
[null,2,7,9,3]
[null,9,5,12,2]
[null,17,8,12,11]
[null,8,2,1,12]
[]
["2015-03-12",1,7,3,8]
[null,1,6,7,2]
[null,1,5,11,14]
[null,7,4,8,9]
[null,5,1,6,2]
[null,6,1,2,5]
[null,1,7,4,3]
[null,2,13,7,8]
[]
["2015-03-13",2,14,3,9]
[null,7,8,1,4]
[null,16,9,4,3]
[null,15,17,18,9]
[null,17,12,5,8]
[null,9,8,6,7]
[null,12,11,8,5]
[null,7,14,13,2]
[]
["2015-03-14","X","X"]
[null,5,3,2,1]
[null,2,7,5,3]
[null,1,6,3,2]
[null,1,6,2,3]
[null,2,4,1,5]
[null,8,7,9,5]
[null,4,5,7,9]
[]
["2015-03-15",8,3,5,7]
[null,9,1,3,4]
[null,1,3,11,2]
[null,3,5,2,6]
[null,5,1,4,9]
[null,8,6,4,7]
[null,5,2,9,3]
[null,9,5,1,2]
[]
["2015-03-16",4,2,8,3]
[null,3,6,4,1]
[null,3,1,2,6]
[null,3,1,2,6]
[null,12,13,8,7]
[null,2,8,5,11]
[null,2,1,7,13]
[null,8,6,7,2]
[]
["2015-03-17",4,6,8,1]
[null,6,8,3,4]
[null,6,1,5,14]
[null,7,4,10,1]
[null,3,11,14,4]
[null,9,7,3,4]
[null,13,7,10,3]
[null,5,9,3,4]
[]
["2015-03-18",15,8,17,18]
[null,16,13,5,18]
[null,10,18,14,12]
[null,6,10,5,9]
[null,8,11,7,4]
[null,12,13,14,7]
[null,4,11,13,8]
[null,4,6,8,9]
[]
["2015-03-19","X"]
[null,"X"]
[null,5,6,10,2]
[null,"X"]
[null,7,9,1,3]
[null,1,4,11,6]
[null,3,7,10,1]
[null,7,1,6,2]
[]
["2015-03-20","X"]
[null,2,13,5,1]
[null,1,3,9,8]
[null,1,3,13,17]
[null,4,9,1,2]
[null,9,15,1,10]
[null,8,9,5,10]
[null,4,3,1,9]
[]
["2015-03-21",3,8,9,7]
[null,10,8,14,4]
[null,4,8,9,10]
[null,17,6,10,13]
[null,18,14,16,9]
[null,10,11,12,9]
[null,11,6,5,3]
[null,15,4,8,10]
[]
["2015-03-22",3,1,9,6]
[null,5,6,2,4]
[null,7,1,8,9]
[null,3,8,2,1]
[null,1,2,6,7]
[null,5,1,6,7]
[null,5,6,4,3]
[null,3,4,1,2]
[]
["2015-03-23",9,10,1,4]
[null,7,2,5,6]
[null,1,2,4,9]
[null,3,2,5,4]
[null,5,3,2,8]
[null,1,2,3,5]
[null,6,4,2,3]
[null,2,7,11,8]
[]
["2015-03-24","X"]
[null,1,3,4,5]
[null,9,8,2,15]
[null,2,6,7,3]
[null,7,3,5,8]
[null,2,7,14,12]
[null,4,9,8,7]
[null,2,5,3,8]
[]
["2015-03-25",11,12,7,8]
[null,12,10,7,9]
[null,10,14,6,9]
[null,4,6,3,7]
[null,2,3,11,10]
[null,15,9,8,11]
[null,7,8,5,6]
[null,6,7,3,10]
[]
["2015-03-26",1,5,8,4]
[null,5,2,4,7]
[null,1,9,6,17]
[null,7,1,5,3]
[null,9,3,1,4]
[null,9,6,15,4]
[null,9,8,1,5]
[null,3,2,1,7]
[]
["2015-03-27",2,3,5,4]
[null,7,11,2,1]
[null,5,2,7,8]
[null,1,3,4,2]
[null,2,1,4,8]
[null,2,4,5,6]
[null,3,12,10,1]
[null,1,8,9,7]
[]
["2015-03-28"]
{"$rows_empty":8}
["2015-03-29"]
{"$rows_empty":8}
["2015-03-30",8,1,17,2]
[null,"X"]
[null,3,6,2,4]
[]
[null,4,7,13,14]
[null,2,5,11,8]
[null,8,12,2,1]
[null,1,3,8,7]
[]
["2015-03-31",2,1,3,4]
[null,1,4,2,5]
[null,7,6,4,5]
[null,4,6,2,3]
[null,2,1,9,4]
[null,2,4,1,3]
[null,1,3,2,4]
[null,1,5,11,2]
[]
["2015-04-01",2,11,9,6]
[null,15,18,8,17]
[null,2,3,13,10]
[null,5,15,14,2]
[null,16,13,14,10]
[null,14,9,11,13]
[null,5,9,6,4]
[null,11,12,3,1]
[]
["2015-04-02",9,4,6,2]
[null,1,9,8,3]
[null,13,2,3,5]
[null,8,9,5,6]
[null,8,9,1,4]
[null,5,8,7,4]
[null,5,2,1,12]
[null,1,5,2,4]
[]
["2015-04-03",1,2,5,6]
[null,1,2,6,7]
[null,5,1,7,2]
[null,"X"]
[null,2,1,4,3]
[null,5,4,9,10]
[null,3,4,1,10]
[null,6,5,3,11]
[]
["2015-04-04","X"]
[null,4,12,8,9]
[null,11,10,5,9]
[null,2,4,16,10]
[null,8,12,7,10]
[null,4,7,13,11]
[null,9,7,8,6]
[null,4,6,3,7]
[]
["2015-04-05",3,1,2,4]
[null,3,4,6,1]
[null,2,16,6,1]
[null,4,5,3,1]
[null,6,2,3,9]
[null,6,4,2,1]
[null,2,3,4,5]
[null,7,3,12,17]
[]
["2015-04-06",8,9,5,13]
[null,1,2,9,4]
[null,1,3,5,8]
[null,5,6,4,7]
[null,2,4,9,10]
[null,13,10,5,2]
[null,1,7,3,4]
[null,15,3,6,1]
[]
["2015-04-07",1,2,9,4]
[null,1,2,7,9]
[null,6,2,11,8]
[null,1,2,5,6]
[null,6,1,3,4]
[null,3,8,4,11]
[null,5,13,3,10]
[]
["2015-04-08",7,2,4,3]
[null,8,9,3,6]
[null,1,12,13,9]
[null,15,9,10,14]
[null,15,7,9,6]
[null,6,7,11,12]
[null,9,11,5,4]
[null,8,10,5,9]
[]
["2015-04-09","X"]
[null,1,3,2,4]
[null,4,12,6,2]
[null,"X"]
[null,1,2,4,8]
[null,1,4,7,20]
[null,6,5,1,4]
[null,1,10,15,3]
[]
["2015-04-10",10,7,5,1]
[null,3,1,6,4]
[null,4,1,5,2]
[null,1,9,2,4]
[null,2,1,3,9]
[null,4,2,7,9]
[null,2,9,3,5]
[]
["2015-04-11",5,8,9,12]
[null,6,7,13,9]
[null,9,6,5,12]
[null,8,1,7,5]
[null,12,13,11,8]
[null,9,18,6,10]
[null,10,11,9,6]
[null,8,10,13,4]
[]
["2015-04-12",2,1,3,5]
[null,6,4,2,5]
[null,2,4,6,5]
[null,2,9,3,8]
[null,6,8,3,7]
[null,8,7,1,2]
[null,3,5,2,4]
[null,7,6,5,2]
[]
["2015-04-13",5,2,9,8]
[null,7,3,10,4]
[null,5,6,1,7]
[null,2,4,1,7]
[null,2,1,3,4]
[null,1,2,5,3]
[null,15,16,10,5]
[null,4,3,5,18]
[]
["2015-04-14",1,3,5,2]
[null,3,1,4,5]
[null,3,2,5,8]
[null,3,8,4,2]
[null,4,5,1,2]
[null,2,3,4,1]
[null,2,14,9,5]
[null,1,4,12,13]
[]
["2015-04-15",11,7,15,16]
[null,7,8,6,5]
[null,8,4,3,7]
[null,14,13,6,3]
[null,15,18,7,16]
[null,16,15,14,8]
[null,16,15,12,7]
[null,2,14,1,11]
[]
["2015-04-16",3,2,1,7]
[null,"X"]
[null,8,5,3,16]
[null,"X"]
[null,4,2,5,1]
[null,1,8,5,6]
[null,1,5,3,8]
[null,3,7,2,8]
[]
["2015-04-17",6,3,7,4]
[null,4,1,8,9]
[null,2,7,17,5]
[null,2,1,3,4]
[null,2,5,1,3]
[null,6,7,1,9]
[null,2,5,1,4]
[null,5,6,3,4]
[]
["2015-04-18",6,3,7,1]
[null,6,5,11,13]
[null,6,4,1,7]
[null,3,1,8,9]
[null,7,4,11,1]
[null,16,5,9,7]
[null,2,11,6,12]
[null,2,5,7,1]
[]
["2015-04-19",5,7,3,2]
[null,2,1,3,5]
[null,3,8,1,2]
[null,3,2,1,4]
[null,4,3,9,1]
[null,6,1,5,7]
[null,5,3,1,7]
[null,5,7,2,8]
[]
["2015-04-20",6,5,16,9]
[null,4,2,5,1]
[null,5,7,4,6]
[null,8,2,5,4]
[null,1,4,6,7]
[null,3,5,1,2]
[null,4,1,5,2]
[null,6,9,2,1]
[]
["2015-04-21","X"]
[null,1,9,2,3]
[null,10,2,3,11]
[null,5,7,2,8]
[null,2,3,9,4]
[null,19,9,4,3]
[null,6,1,9,11]
[null,1,2,3,5]
[]
["2015-04-22",6,1,7,17]
[null,5,3,1,2]
[null,11,8,1,14]
[null,9,8,6,5]
[null,15,11,14,4]
[null,13,5,15,16]
[null,18,17,15,12]
[null,14,13,4,6]
[]
["2015-04-23",1,4,2,3]
[null,3,7,1,4]
[null,13,2,15,9]
[null,1,8,14,2]
[null,5,10,6,4]
[null,10,1,6,8]
[null,7,2,3,1]
[null,1,4,9,5]
[]
["2015-04-24",2,5,4,12]
[null,6,2,1,3]
[null,3,2,4,1]
[null,6,4,3,7]
[null,3,7,8,1]
[null,6,2,9,3]
[null,11,17,10,12]
[null,8,10,4,16]
[]
["2015-04-25",7,8,2,5]
[null,"X"]
[null,5,2,11,12]
[null,6,8,4,3]
[null,2,1,5,8]
[null,4,5,3,10]
[null,2,3,1,12]
[null,12,6,4,14]
[]
["2015-04-26",10,12,2]
[null,2,6,5,3]
[null,2,11,3,5]
[null,3,7,4,2]
[null,1,2,3,6]
[null,1,6,7,5]
[null,9,5,7,8]
[null,1,4,3,10]
[]
["2015-04-27",3,2,1,5]
[null,3,2,4,7]
[null,1,3,2]
[null,"X"]
[null,3,7,5,11]
[null,5,1,7,4]
[null,"X"]
[null,4,1,2,3]
[]
["2015-04-28",4,5,3,8]
[null,13,16,7,10]
[null,13,7,9,15]
[null,12,11,6,2]
[null,9,14,11,1]
[null,3,2,4,10]
[null,13,5,16,11]
[null,2,4,9,11]
[]
["2015-04-29",8,7,4,1]
[null,11,3,4,1]
[null,4,10,6,5]
[null,6,4,3,1]
[null,7,1,6,2]
[null,8,1,9,7]
[null,8,1,3,7]
[null,5,6,9,2]
[]
["2015-04-30",1,6,4,2]
[null,7,1,9]
[null,2,5,6,4]
[null,1,7,2,5]
[null,3,2,4,6]
[null,6,5,2,3]
[null,6,3,1,2]
[null,3,2,1,4]
[]
["2015-05-01",2,8,5,4]
[null,2,3,5,8]
[null,10,3,7,11]
[null,3,1,5,4]
[null,8,2,1,6]
[null,1,5,8,2]
[null,1,5,7,11]
[null,3,8,2,5]
[]
["2015-05-02",8,9,7,1]
[null,8,10,9,5]
[null,10,9,7,4]
[null,6,15,14,7]
[null,6,10,11,7]
[null,10,2,5,13]
[null,6,9,7,8]
[null,9,8,5,7]
[]
["2015-05-03",1,4,3,2]
[null,2,1,8,4]
[null,1,6,5,11]
[null,1,2,5,3]
[null,2,3,4,5]
[null,2,1,5,3]
[null,4,5,3,1]
[null,6,5,2,4]
[]
["2015-05-04",2,3,12,7]
[null,"X"]
[null,2,3,4,1]
[null,"X"]
[null,1,7,11,5]
[null,3,7,5,1]
[null,3,9,10,8]
[null,5,11,1,2]
[]
["2015-05-05",2,1,5,6]
[null,6,1,7,8]
[null,9,4,1,2]
[null,1,4,2,3]
[null,4,9,13,2]
[null,1,11,6,12]
[null,2,7,6,10]
[null,5,4,2,10]
[]
["2015-05-06",1,5,3,12]
[null,1,6,4,3]
[null,8,7,4,2]
[null,1,3,2,5]
[null,14,5,1,7]
[null,8,16,11,19]
[null,16,2,12,8]
[null,3,12,8,1]
[]
["2015-05-07",2,1,3]
[null,2,3,7,4]
[null,7,6,9,2]
[null,3,7,2,9]
[null,2,4,8,3]
[null,2,3,1,4]
[null,3,4,1,2]
[null,8,7,4,1]
[]
["2015-05-08",1,16,6,2]
[null,"X"]
[null,6,7,17,15]
[null,3,1,7,4]
[null,4,2,1,5]
[null,9,7,4,8]
[null,3,15,1,2]
[null,16,15,17,1]
[]
[]
["2015-05-09",9,8,12,1]
[null,9,15,3,11]
[null,9,3,6,7]
[null,9,13,2,1]
[null,7,4,1,3]
[null,2,11,10,1]
[null,15,13,9,16]
[null,4,7,14,12]
[]
["2015-05-10",1,3,5,4]
[null,5,1,2,3]
[null,1,3,5]
[null,18,9,13,15]
[null,5,6,8,19]
[null,2,11,8,1]
[null,9,3,2,5]
[null,7,5,1,2]
[]
["2015-05-11",9,4,14,3]
[null,5,4,2,1]
[null,3,2,1,4]
[null,1,3,9,5]
[null,12,1,6,15]
[null,5,1,6,4]
[null,5,14,7,4]
[null,2,1,6,3]
[]
["2015-05-12",9,7,6,5]
[null,7,2,3,5]
[null,12,9,11,4]
[null,13,10,7,11]
[null,12,7,1,10]
[null,7,6,4,5]
[null,13,10,11,7]
[null,7,1,5,3]
[]
["2015-05-13",12,11,10,14]
[null,14,9,8,15]
[null,14,12,13,10]
[null,8,2,12,6]
[null,4,6,3,5]
[null,15,8,14,9]
[null,3,9,4,10]
[null,7,3,10,9]
[]
["2015-05-14",4,2,5,1]
[null,2,4,1,6]
[null,15,6,3,12]
[null,8,5,4,6]
[null,8,7,5,9]
[null,12,7,3,6]
[null,1,2,6,3]
[null,2,1,8,5]
[]
["2015-05-15",3,1,2,6]
[null,4,3,8,1]
[null,2,5,3,4]
[null,8,5,2,3]
[null,4,1,2,3]
[null,7,5,4,14]
[null,4,1,2,11]
[null,9,2,8,6]
[]
["2015-05-16",3,5,6,4]
[null,7,8,5,6]
[null,11,2,8,12]
[null,7,2,1,11]
[null,8,9,4,12]
[null,5,2,7,9]
[null,3,11,4,8]
[null,4,7,6,2]
[]
["2015-05-17",3,1,5,13]
[null,6,7,8,1]
[null,4,1,6,3]
[null,10,2,9,1]
[null,6,1,7,2]
[null,7,10,3,8]
[null,1,3,4,6]
[null,4,5,10,11]
[]
["2015-05-18",5,1,14,10]
[null,1,8,5,7]
[null,2,3,5,1]
[null,2,6,7,3]
[null,1,3,7,5]
[null,3,1,4,6]
[null,5,1,4,8]
[null,6,4,5,9]
[]
["2015-05-19","X"]
[null,2,3,5,4]
[null,8,2,9,1]
[null,"X"]
[null,1,8,7,6]
[null,4,2,10,6]
[null,3,1,4,2]
[null,4,8,2,10]
[]
["2015-05-20",5,8,12,1]
[null,4,5,8,6]
[null,1,10,16,9]
[null,14,7,2,17]
[null,3,7,11,5]
[null,16,11,9,13]
[null,5,2,11,4]
[null,4,14,7,6]
[]
["2015-05-21","X"]
[null,4,1,2,3]
[null,5,3,2,6]
[null,14,9,6,4]
[null,2,9,5,1]
[null,1,3,6,4]
[null,1,2,6,10]
[null,12,1,7,14]
[]
["2015-05-22",3,6,1,8]
[null,1,4,2,3]
[null,3,2,5,1]
[null,2,3,5,6]
[null,8,7,1,5]
[null,1,6,8,4]
[null,2,7,6,1]
[null,4,3,7,1]
[]
["2015-05-23",7,6,5,3]
[null,11,13,6,15]
[null,15,14,6,7]
[null,16,12,11,13]
[null,14,4,6,5]
[null,1,2,4,9]
[null,3,2,9,14]
[null,3,1,7,13]
[]
["2015-05-24",9,4,6,2]
[null,1,5,2,4]
[null,13,5,7,4]
[null,8,7,9,6]
[null,1,3,5,4]
[null,1,5,6,7]
[null,10,2,11,8]
[null,4,6,7,9]
[]
["2015-05-25",1,4,3,2]
[null,14,12,3,1]
[null,1,5,11,8]
[null,1,11,10,4]
[null,7,10,8,9]
[null,9,6,4,7]
[null,6,10,8,16]
[null,7,10,4,3]
[]
["2015-05-26",8,5,6,9]
[null,4,5,9,1]
[null,8,2,4,7]
[null,13,4,9,1]
[null,2,9,7,1]
[null,3,9,11,12]
[null,11,9,8,16]
[null,7,1,4,3]
[]
["2015-05-27",9,14,1,8]
[null,"X"]
[null,6,1,7,5]
[null,"X"]
[null,6,10,9,1]
[null,4,2,3,6]
[null,4,5,1,2]
[null,1,11,12,7]
[]
["2015-05-28",7,4,3,6]
[null,6,5,2,1]
[null,5,11,4,14]
[null,5,9,10,4]
[null,2,4,7,3]
[null,7,3,6,1]
[null,1,3,8,2]
[null,9,3,8,4]
[]
["2015-05-29",2,1,4,3]
[null,4,3,6,8]
[null,2,10,5,1]
[null,1,2,7,5]
[null,4,1,7,3]
[null,3,5,12,4]
[null,18,9,2,13]
[null,13,2,7,14]
[]
["2015-05-30",1,2,5,3]
[null,4,3]
[null,5,3,7,12]
[null,3,8,1,6]
[null,11,2,7,1]
[null,1,5,6,2]
[null,4,3,9,12]
[null,3,2,10,5]
[]
["2015-05-31",8,6,2,5]
[null,1,6,9,8]
[null,8,2,1,5]
[null,4,2,8,3]
[null,7,3,1,2]
[null,5,2,3,1]
[null,3,5,1,4]
[null,6,4,7,2]
[]
["2015-06-01",1,11,3,6,null,8,13,3,16,9,18.8,4.7,6.2,2.1]
["AUTEUIL",3,4,5,2,null,6,5,3,8,4,29.4,4.7,1.6,1.6]
[null,3,9,5,1,null,8,14,6,4,11,7.3,2.3,7,1.8]
[null,7,6,4,1,null,2,7,4,1,6,4.7,2.5,1.8]
[null,6,3,1,7,null,1,2,5,7,4,2.6,1.4,1.7,6.3]
[null,3,7,6,1,null,9,7,3,1,6,21.4,3.8,1.3,1.9]
[null,3,2,7,1,null,3,9,2,7,8,6.9,2.1,5.5,1.3]
[null,6,4,1,5,null,12,16,2,13,1,4.4,2.2,5.7,2.3]
[]
["2015-06-02",3,1]
[null,3,4,2]
[null,3,9,6,1]
[null,1,3,2,4]
[null,2,4,6]
[null,6,12,14,1]
[null,3,6,11,8]
[null,12,4,6,8]
[]
["2015-06-03",10,11,8,6]
[null,12,3,4,5]
[null,16,15,7,2]
[null,10,12,15,17]
[null,13,7,10,5]
[null,16,14,6,12]
[null,15,3,2,7]
[null,13,3,9,6]
[]
["2015-06-04",7,8,5,10]
[null,4,11,7,3]
[null,7,12,13,9]
[null,14,1,10,4]
[null,9,5,2,7]
[null,8,7,13,10]
[null,8,6,1,3]
[null,9,11,8,10]
[]
["2015-06-05",3,7,8,13]
[null,2,6,3,1]
[null,7,2,6,5]
[null,2,1,4,6]
[null,3,11,6,7]
[null,2,3,7,5]
[null,4,7,12,6]
[null,3,15,1,18]
[]
["2015-06-06",4,11,12,1]
[null,5,13,9,11]
[null,8,6,9,13]
[null,5,6,13,10]
[null,11,10,9,7]
[null,3,11,5,14]
[null,5,4,3,10]
[null,9,15,13,14]
[]
["2015-06-07",1,2,5,4]
[null,5,1,7,3]
[null,4,5,1,7]
[null,1,2,4,6]
[null,4,7,11,2]
[null,7,4,1,5]
[null,1,2,3,6]
[null,2,7,11,6]
[]
["2015-06-08",6,7,5,8]
[null,1,3,4]
[null,7,6,5,4]
[null,4,7,1,3]
[null,3,1,2,4]
[null,1,2,8,3]
[null,9,6,3,5]
[null,8,5,6,10]
[]
["2015-06-09",1,5,2,4]
[null,2,1,3,4]
[null,6,9,2,3]
[null,2,1,4,6]
[null,3,8,6,1]
[null,2,3,7,6]
[null,9,5,7,1]
[null,4,1,2,7]
[]
["2015-06-10",4,1,8,2]
[null,6,3,4,9]
[null,2,1,3,7]
[null,1,2,9,3]
[null,1,5,6,7]
[null,3,5,4,1]
[null,1,2,5,15]
[null,2,4,7,1]
[]
["2015-06-11"]
[null,3,1,2,4]
[null,13,1,2,16]
[]
[null,5,6,2,9]
[null,7,4,2,3]
[null,10,5,8,9]
[null,4,7,8,2]
[]
["2015-06-12","X"]
[null,3,1,2,4]
[null,7,6,2,4]
[null,7,8,3,6]
[null,4,2,5,3]
[null,4,5,7,1]
[null,7,1,9,4]
[null,6,1,2,4]
[]
["2015-06-13",13,14,10,15]
[null,3,2,4,7]
[null,11,6,5,2]
[null,13,4,12,16]
[null,11,8,1,10]
[null,13,15,9,8]
[null,17,15,6,8]
[null,5,14,2,1]
[]
["2015-06-14",3,9,2,1]
[null,3,1,4,8]
[null,12,6,8,9]
[null,8,10,1,6]
[null,9,3,2,7]
[null,7,4,2,1]
[null,8,11,3,12]
[null,6,4,2,3]
[]
["2015-06-15",6,7,14,5]
[null,10,9,8,4]
[null,16,3,11,10]
[null,11,10,2,6]
[null,2,3,5,8]
[null,13,11,5,17]
[null,13,3,6,5]
[]
["2015-06-16",6,4,1,8]
[null,1,4,2,5]
[null,2,11,15,7]
[null,1,8,4,2]
[null,9,6,14,3]
[null,7,9,5,6]
[null,10,6,12,3]
[null,10,11,2,8]
[]
["2015-06-17",8,4,15,2]
[null,11,2,9,7]
[null,9,2,7,4]
[null,12,8,10,11]
[null,9,6,5,8]
[null,5,6,3,10]
[null,2,3,11,12]
[null,6,8,9,4]
[]
["2015-06-18"]
[null,1,3,2,4]
[]
[null,2,10,13,12]
[null,2,4,6,5]
[null,4,8,9,3]
[null,2,6,8,3]
[null,8,3,9,5]
[]
["2015-06-19","X"]
[null,"X"]
[null,5,3,6,2]
[null,5,4,1,7]
[null,4,2,5,7]
[null,6,4,2,5]
[null,5,10,7,4]
[null,1,13,4,2]
[]
["2015-06-20",1,2,5]
[null,7,8,4,6]
[null,2,4,12,9]
[null,4,6,3,1]
[null,7,4,8,5]
[null,4,10,3,2]
[null,5,2,6,3]
[null,6,10,12,1]
[]
["2015-06-21",5,2,7,13]
[null,12,9,5,10]
[null,9,5,2,3]
[null,16,7,13,12]
[null,12,15,16,10]
[null,9,11,14,15]
[null,13,14,12,6]
[null,13,11,14,7]
[]
["2015-06-22",3,8,7,4]
[null,2,5,1,8]
[null,1,6,2,5]
[null,2,4,8,3]
[null,5,8,2,1]
[null,2,7,6,1]
[null,4,3,8,2]
[null,1,7,14,11]
[]
["2015-06-23",5,1,2,3]
[null,7,3,5,4]
[null,4,5,15,1]
[null,6,3,2,4]
[null,3,7,1,5]
[null,2,7,10,5]
[null,17,6,15,9]
[null,16,6,2,7]
[]
["2015-06-24",5,2,3,1]
[null,9,2,7,8]
[null,4,1,6,3]
[null,3,2,5,1]
[null,9,10,6,7]
[null,3,8,1,6]
[null,5,1,3,4]
[null,5,14,19,10]
[]
["2015-06-25",8,6,11,7]
[null,12,10,13,11]
[null,7,11,1,4]
[null,9,4,8,7]
[null,5,1,2,4]
[null,6,9,7,8]
[null,9,1,8,11]
[null,15,14,16,12]
[]
["2015-06-26",1,3,2]
[null,5,3,7,8]
[]
[null,3,2,1,7]
[null,3,4,1,7]
[null,4,12,8,15]
[null,12,8,7,15]
[null,2,1,14,11]
[]
["2015-06-27",6,8,10,7]
[null,15,6,1,7]
[null,5,8,4,2]
[null,9,8,7,4]
[null,1,9,7,6]
[null,7,13,4,16]
[null,10,5,8,2]
[null,4,6,3,1]
[]
["2015-06-28",2,1,10,3]
[null,2,1,3,4]
[null,8,11,4,14]
[null,2,5,8,4]
[null,7,8,6,5]
[null,5,2,8,1]
[null,3,5,2,1]
[null,8,2,12,1]
[]
["2015-06-29",6,1,5,4,null,7,9,6,4,2,20.1,6.1,2.5,2]
["CHANTILLY",3,8,10,6,null,6,4,16,13,5,8.7,2.8,2,7.1]
[null,1,5,7,3,null,8,6,1,5,7,7.8,2.1,2.4,1.8]
[null,3,1,2,4,null,1,3,2,4,5,4,1.8,1.3]
[null,1,9,7,3,null,5,7,3,6,2,10.6,2.6,2.1,3.4]
[null,7,1,5,6,null,7,3,6,1,2,2,1.3,2.5]
[null,6,9,1,3,null,6,1,4,3,2,2.8,1.1,1.5,3]
[null,1,2,4,6,null,2,1,3,6,5,4.3,2,1.8]
[]
["2015-06-30",1,13,14,3,null,17,15,3,9,1,5.8,2.2,8,8.2]
["CLAIREFONTAINE",2,4,1,3,null,13,9,2,1,3,2.5,1.4,1.6,1.8]
[null,2,3,1,13,null,6,2,18,17,4,11.1,3.4,1.9,14.2]
[null,1,2,13,null,null,10,11,2,1,9,6.5,3,4.3,9.5]
[null,2,3,1,4,null,5,8,1,15,12,4,1.9,13.3,2.2]
[null,11,3,5,10,null,12,2,13,5,6,42.1,10.6,2.6,6.1]
[null,1,9,2,6,null,3,1,2,15,10,12.2,3.9,4.1,3.8]
[null,5,2,1,8,null,3,4,7,12,15,14,4,2.6,16.8]
[]
["2015-07-01",2,14,12,9,null,4,7,16,12,14,44.5,10.4,5.6,3.8]
["VICHY",15,8,7,2,null,15,13,8,12,4,8.5,2.7,3,1.5]
[null,11,13,12,16,null,11,12,1,16,2,3.1,1.5,1.8,4.4]
[null,16,18,12,11,null,18,4,16,17,10,2.1,1.5,9.7,2.4]
[null,5,7,3,6,null,7,3,1,6,4,2.9,2.1,2.4]
[null,14,4,7,17,null,15,2,10,5,14,8.7,2.1,19.9,3.3]
[null,15,5,3,16,null,5,7,10,6,12,3.6,1.9,5.2,2]
[]
["2015-07-02",4,6,5,1,null,10,8,9,13,2,6,2.4,2.3,7.9]
["ENGHIEN SOISY",3,16,4,7,null,15,8,4,1,7,134.3,20.6,2.5,1.9]
[null,12,13,17,9,null,9,17,3,7,8,6,2.1,4,4.1]
[null,6,7,8,9,null,7,3,9,5,2,10,3.1,7,3.2]
[null,6,11,4,5,null,10,4,5,8,2,4.7,2.8,2.4,2]
[null,7,9,5,4,null,7,5,9,4,8,1.7,1.3,1.8,1.5]
[null,10,4,13,14,null,10,7,13,5,12,3.2,1.5,2.2,1.7]
[null,12,8,3,10,null,3,10,13,12,1,4.4,2,5.2,7.5]
[]
["2015-07-03",9,5,6,1,null,3,5,7,4,6,4.7,1.6,1.8,1.6]
["DEAUVILLE",4,1,3,2,null,5,1,2,3,4,12.6,3.6,2.1]
[null,2,1,3,4,null,2,5,1,4,null,3.5,2.2,2.6]
[null,5,4,2,6,null,5,9,7,2,6,2.5,1.2,1.4,6.2]
[null,4,2,1,5,null,1,2,4,5,3,2,1.2,1.3]
[null,7,1,10,3,null,4,1,5,12,3,19.6,3.7,2,1.9]
[null,8,9,4,2,null,8,4,5,10,9,18.8,3.7,2.4,5.1]
[null,8,7,5,6,null,2,12,11,4,3,25.6,8,8.8,6.7]
[]
["2015-07-04",4,3,9,7,null,4,7,5,1,3,5.3,1.8,8,5.1]
["ENGHIEN SOISY",8,11,7,10,null,2,3,9,5,1,4,1.5,2.8,5.9]
[null,3,5,7,13,null,1,8,9,11,7,3.5,1.7,1.4,2.7]
[null,6,7,8,4,null,1,3,7,10,9,1.8,1.7,4.3,3.3]
[null,4,12,6,7,null,16,4,3,5,12,2.8,1.9,3.2,7.9]
[null,10,11,4,5,null,6,1,11,5,3,10.7,3.2,4.5,2.4]
[null,9,7,4,5,null,7,9,2,6,5,3.6,1.2,1.4,2.1]
[null,8,4,5,7,null,1,2,12,13,7,10.1,2.5,2,1.6]
[]
["2015-07-05",{"$nulls":5},4,7,6,1,8,2.9,1.4,3.2,1.9]
["MAISONS LAFFITTE",6,1,3,5,null,3,6,2,1,4,20.9,6.5,1.8]
[null,5,12,2,6,null,15,16,12,13,5,14.5,4.7,7.9,3]
[null,0,0,0,0,null,11,5,6,7,4,3.1,1.6,2,2]
[null,2,5,3,1,null,2,5,3,1,4,4.6,1.7,1.2]
[null,3,2,4,5,null,2,4,1,8,7,18.2,5.2,2.7,3.1]
[null,3,4,11,1,null,5,2,3,7,4,39.5,6,5,1.3]
[null,5,6,4,8,null,9,8,1,11,3,4.4,1.8,1.3,1.9]
[]
["2015-07-06",4,3,10,6,null,3,1,11,4,13,7.6,2.2,3.4,2.6]
["COMPIEGNE",3,1,4,5,null,1,5,4,6,3,3.8,2.2,5.1]
[null,6,8,10,1,null,3,5,7,4,1,17.3,5.1,2.3,5.8]
[null,5,1,7,8,null,4,7,5,1,2,5.9,1.5,1.3,1.4]
[null,4,7,5,13,null,4,11,6,2,3,5.3,2.4,9,3.2]
[null,3,7,2,11,null,13,1,7,4,6,8.3,3.6,2.7,3.5]
[null,8,4,5,14,null,6,12,17,2,13,9.6,7,8.2,4.7]
[null,1,3,5,4,null,2,5,7,3,8,3.7,1.4,1.2,3.8]
[]
["2015-07-07",8,9,2,7,null,10,9,7,11,1,6.8,3.5,4.6,3]
["CHATEAUBRIANT",7,10,8,12,null,10,7,5,4,9,7,1.6,1.2,2.4]
[null,16,6,5,18,null,15,16,6,3,5,27.3,4.4,1.6,1.7]
[null,2,8,16,3,null,2,7,6,15,14,2.9,2,2,4.8]
[null,9,5,3,1,null,9,1,13,14,16,9.5,3.1,2.5,3.2]
[null,13,7,5,9,null,10,13,7,11,8,11,2.7,2.6,3.6]
[null,4,5,11,9,null,4,10,11,8,3,1.6,1.2,1.8,1.4]
[null,15,8,1,3,null,1,11,15,10,14,6.6,2.2,5.6,1.2]
[]
["2015-07-08",9,6,10,11,null,5,12,4,1,10,17,4.8,15,5.3]
["ENGHIEN SOISY",2,7,11,13,null,2,1,6,11,12,3.1,1.5,5.1,7]
[null,12,9,11,7,null,2,6,10,12,3,6.3,2.1,2.4,1.4]
[null,14,12,13,4,null,6,8,7,12,11,21,5.2,3.2,3.3]
[null,13,11,14,10,null,13,2,9,16,3,2.5,1.6,1.9,3.2]
[null,9,4,8,6,null,9,11,12,13,4,1.7,1.2,2.5,7.7]
[null,1,5,8,6,null,5,4,11,13,14,3,1.9,2,2.4]
[null,14,8,6,9,null,9,3,14,7,8,9.8,2.9,2.1,2.1]
[]
["2015-07-09",4,2,1,3,null,2,3,4,1,null,3.4,1.6,1.6]
["CHANTILLY",5,1,6,2,null,1,5,2,3,6,1.8,1.1,1.2]
[null,8,1,5,9,null,9,3,4,8,2,23.7,7.7,6.6,6.9]
[null,8,1,2,4,null,6,4,3,1,8,1.7,1.1,2.3,4.5]
[null,1,4,3,7,null,6,2,1,7,3,16.9,4.4,8,1.6]
[null,4,2,1,8,null,4,2,8,9,1,4.3,1.8,1.3,3.1]
[null,2,6,1,14,null,11,14,1,6,13,7.2,2.1,2.5,1.7]
[null,1,7,8,2,null,6,8,4,3,1,6.1,1.7,4.3,1.8]
[]
["2015-07-10",2,1,4,5,null,3,4,1,2,5,2.1,1.2,2.2]
["CHATEAUBRIANT",8,9,1,2,null,5,9,8,3,1,6.1,1.4,1.3,1.2]
[null,5,3,10,2,null,2,1,8,7,3,7.9,2.6,1.7,1.9]
[null,2,3,1,5,null,1,5,2,3,8,10,2.5,1.5,1.1]
[null,5,2,7,11,null,3,4,10,7,1,3.1,1.3,9.3,4.2]
[null,4,5,3,6,null,4,2,6,1,7,2.7,1.5,1.4,2.5]
[null,4,1,8,10,null,7,6,9,4,1,4.9,2.3,2.1,3]
[null,3,6,9,8,null,3,6,11,8,1,5.4,2.2,2,3.1]
[]
["2015-07-11",7,10,8,9,null,10,9,8,2,4,2,1.2,1.2,1.3]
["ENGHIEN SOISY",8,7,3,10,null,8,9,10,1,6,1.5,1.2,1.3,2]
[null,7,3,13,6,null,5,6,1,10,11,1.9,1.6,2.7,8.2]
[null,5,6,2,3,null,6,2,11,9,10,7.2,2.1,1.3,12.3]
[null,4,11,12,8,null,3,4,8,13,1,5.9,2.5,3.8,2.3]
[null,1,6,5,7,null,8,7,6,3,4,2.6,1.4,5.2,1.5]
[null,12,9,10,6,null,11,7,10,5,12,28.6,4.6,3,3.4]
[null,8,2,1,13,null,12,10,11,2,6,20.9,6,5.1,14.1]
[]
["2015-07-12",4,6,1,7,null,4,7,6,1,2,2.4,1.5,2.1]
["CHANTILLY",1,2,7,5,null,1,2,4,7,8,4,1.3,1.1,2.5]
[null,1,9,5,3,null,2,6,7,5,12,8.2,3.1,2.8,1.8]
[null,5,4,6,8,null,4,2,1,6,8,1.9,1.2,2.2,2.6]
[null,9,7,4,6,null,5,3,4,1,6,6.6,3.3,2.7,2.9]
[null,1,5,7,4,null,5,6,3,8,4,2,1.1,4.1,5.1]
[null,2,1,5,11,null,1,8,10,2,5,6.6,2.2,4.8,1.7]
[null,14,4,10,2,null,4,13,14,17,6,4.1,1.9,2.4,2.7]
[]
["2015-07-13",6,14,2,11,null,14,9,6,5,12,7.5,2,3.4,2.6]
["MAISONS LAFFITTE",0,0,0,0,null,9,5,4,6,7,4.4,1.7,1.4,1.4]
[null,2,4,5,1,null,1,4,3,5,2,6.4,2.2,1.5]
[null,3,8,4,1,null,5,4,12,11,7,4.6,2.4,6.4,6.4]
[null,2,7,5,6,null,3,1,2,6,4,3,1.8,7.8]
[null,1,5,7,4,null,5,4,1,6,9,14.7,3.8,2,1.6]
[null,3,1,4,8,null,4,1,12,3,13,7.1,2,1.4,4]
[null,6,1,4,3,null,5,3,1,6,2,3.9,2.5,4]
[]
["2015-07-14",3,5,1,4,null,3,1,2,4,5,6.3,3,2.3]
["LONGCHAMP",12,16,5,1,null,8,15,6,5,3,8.6,2.9,2.8,12.7]
[null,2,7,1,5,null,2,1,5,4,8,2,1.1,1.3,1.2]
[null,1,10,12,3,null,9,1,5,2,14,6.5,2.1,2.7,1.9]
[null,6,7,1,5,null,4,1,2,5,7,44.4,6.3,1.3]
[null,4,5,3,2,null,5,3,2,4,1,6.6,2.8,1.4]
[null,2,3,7,8,null,4,3,2,6,1,9.3,2.6,1.8,1.3]
[null,2,6,5,7]
[]
["2015-07-15",15,10,1,6,null,10,15,4,14,6,4.1,1.5,1.3,2.1]
["LISIEUX",14,10,13,17,null,18,14,3,6,5,4.6,1.7,1.6,2.2]
[null,11,1,3,7,null,3,9,1,12,8,6.2,3.3,5,4]
[null,12,8,2,1,null,1,4,12,10,8,2.6,1.7,8,1.6]
[null,10,9,6,11,null,6,10,7,11,5,2.2,1.3,1.3,1.4]
[null,12,13,11,9,null,11,4,2,9,6,5.9,1.7,3.2,4.5]
[null,13,9,6,3,null,6,10,13,4,2,17.6,4.5,3,2.7]
[null,10,16,9,13,null,12,6,13,16,5,42.8,14,5.5,4.2]
[]
["2015-07-16",5,2,3,4,null,1,2,5,6,3,9,4,1.6]
["COMPIEGNE",1,9,2,7,null,1,8,7,9,3,2.4,1.2,3,4]
[null,1,9,2,11,null,3,2,12,1,10,6.7,2,4.6,3.6]
[null,8,6,7,3,null,6,1,2,8,10,1.8,1.2,2.5,7.7]
[null,7,9,8,5,null,2,13,4,3,10,7,3.1,8.2,3.5]
[null,4,8,6,1,null,5,9,6,4,3,7.3,2.8,1.5,1.4]
[null,2,1,8,3,null,1,2,8,3,6,2.4,1.2,1.3,1.4]
[null,7,1,5,2,null,5,8,1,7,4,7.9,2.3,1.4,1.5]
[]
["2015-07-17",5,12,7,13,null,12,6,4,5,11,8.5,2.6,2.7,2.2]
["MAISONS LAFFITTE",2,5,3,1,null,6,2,1,7,4,3.9,2.3,1.6]
[null,4,3,1,0,null,9,5,7,2,3,3.3,1.3,1.2,1.5]
[null,4,2,1,3,null,4,5,2,6,1,2.1,1.7,2.8]
[null,8,9,6,7,null,10,9,8,7,6,9.2,2.3,1.8,2.4]
[null,2,8,6,3,null,2,7,1,6,3,4.4,1.4,3.3,1.4]
[null,5,11,9,6,null,9,6,5,4,11,6.9,2.2,1.5,1.8]
[null,1,3,9,6,null,4,2,10,5,14,23.9,7.7,15,3.7]
[]
["2015-07-18",11,7,9,3,null,2,7,11,5,1,7.1,2.1,1.9,1.7]
["ENGHIEN SOISY",7,10,9,2,null,6,10,3,2,1,3.7,1.6,2.2,2.1]
[null,8,10,11,7,null,10,7,4,1,8,1.4,1.2,1.6,2.6]
[null,7,4,16,8,null,11,9,4,13,15,10.5,3.6,3.1,3]
[null,7,9,2,6,null,2,6,9,7,10,1.5,1.2,4.6,2.6]
[null,11,9,12,8,null,11,4,3,8,12,9.1,2,1.7,3.1]
[null,6,4,9,8,null,6,4,9,8,2,4,2.9,1.8,3.7]
[null,2,6,7,9,null,12,11,6,8,7,2.9,1.7,2.5,2.1]
[]
["2015-07-19",0,0,0,0,null,5,1,3,2,4,7,1.8,1.1]
["MAISONS LAFFITTE",6,1,2,3,null,3,5,2,6,1,6.4,3.3,12.1]
[null,1,12,2,11,null,6,8,11,18,12,12,3.6,7.3,3.9]
[null,0,0,0,0,null,2,10,11,7,5,9.6,1.8,1.2,1.8]
[null,3,4,2,5,null,2,3,5,1,6,5.3,2.8,1.9]
[null,4,7,1,10,null,1,8,3,10,6,2.9,1.3,1.8,1.7]
[null,5,2,4,6,null,2,4,1,3,5,3.5,1.6,2.4]
[null,3,2,8,6,null,9,10,2,3,5,20.1,5.2,1.9,3]
[]
["2015-07-20",5,1,2,3,null,8,5,6,2,1,2.5,1.2,1.4,2.6]
["VICHY",2,9,16,14,null,13,9,2,7,6,24.9,7.5,1.8,6.8]
[null,7,1,8,3,null,1,4,7,6,2,7.1,3,2.1,3]
[null,11,6,8,2,null,7,16,1,19,6,33.5,9.1,6.5,2.3]
[null,1,4,2,7,null,2,7,1,3,4,3.3,1.3,2.4]
[null,2,9,4,7,null,10,2,8,5,4,9.9,2.5,1.2,3.8]
[null,4,5,11,1,null,4,12,11,1,6,4.9,2,5.5,1.6]
[null,5,4,11,6,null,11,4,2,13,9,10.6,3.1,4.9,4.1]
[]
["2015-07-21",5,3,7,6,null,2,5,7,6,8,3.9,1.1,1.1,1.7]
["VICHY",4,5,8,1,null,3,10,8,9,7,5.7,2.1,2.6,6.5]
[null,3,14,16,11,null,8,4,14,1,3,6.3,1.8,2.8,7]
[null,5,6,2,7,null,5,7,6,3,2,5.6,3.6,11.2]
[null,8,3,5,7,null,4,7,9,8,6,9.4,2.7,1.8,2]
[null,6,4,1,9,null,1,10,2,6,4,2.4,1.6,3.9,13.2]
[null,8,3,7,5,null,7,5,12,11,3,8.2,3.3,1.6,3.6]
[null,7,9,2,8,null,2,9,8,6,5,8.1,2.4,1.9,3.4]
[]
["2015-07-22",16,7,2,3,null,7,12,5,16,1,5.5,2.3,2,3]
["ENGHIEN SOISY",5,15,6,7,null,6,12,9,3,14,6.1,2.2,5.1,3.4]
[null,13,9,5,14,null,15,5,4,14,16,2.3,1.4,2.7,2.9]
[null,9,8,7,6,null,11,6,8,2,7,5.4,1.9,2.5,1.4]
[null,11,10,5,7,null,5,11,12,14,3,4.2,2.5,1.9,9]
[null,9,5,11,2,null,2,10,5,3,9,1.8,1.3,1.9,1.2]
[null,9,12,6,5,null,11,9,5,12,4,9.5,1.9,1.5,2.8]
[null,10,3,2,4,null,10,8,2,9,4,1.6,1.3,2,3.3]
[]
["2015-07-23",0,0,0,0,null,3,1,5,2,6,3.6,1.2,1.1]
["VICHY",0,0,0,0,null,3,5,4,1,2,1.6,1.1,1.2]
[null,0,0,0,0,null,4,5,14,15,6,10.6,3.4,8.9,1.8]
[null,0,0,0,0,null,5,9,3,8,2,4.5,1.6,2.8,5]
[null,0,0,0,0,null,4,2,1,3,6,4.4,1.8,1.7]
[null,0,0,0,0,null,2,1,7,12,10,28.6,6.6,1.9,3.1]
[null,0,0,0,0,null,11,5,9,1,4,4.4,1.9,1.8,2.9]
[null,0,0,0,0,null,7,1,4,3,10,10.4,2.7,2,2.8]
[]
["2015-07-24",9,1,2,7,null,4,1,9,7,5,3.5,1.5,1.6,2.1]
["VICHY",3,1,7,4,null,6,5,10,7,4,6.8,2.2,2.2,2.9]
[null,8,4,9,5,null,7,2,12,4,8,3.6,1.6,4.4,3.3]
[null,2,3,4,5,null,4,5,7,1,2,8.1,2.7,7.3,3]
[null,4,5,10,9,null,7,3,6,10,9,10.5,3.8,5,2]
[null,9,5,8,2,null,9,2,1,7,5,3.1,1.9,1.8,2.8]
[null,1,7,5,6,null,17,7,1,13,9,66.1,11,1.9,2.3]
[null,3,5,2,6,null,2,5,7,3,6,3.9,1.9,2.2]
[]
["2015-07-25",5,3,4,1,null,3,1,5,2,6,23.8,4.4,1.4,1.6]
["ENGHIEN SOISY",4,13,1,11,null,4,7,6,3,10,6.4,2.7,6.2,5.3]
[null,3,8,13,2,null,2,8,3,6,4,10.5,2.3,2.3,1.2]
[null,13,14,2,11,null,14,8,3,5,7,10.2,3,3.4,3.8]
[null,5,10,8,6,null,5,12,10,2,8,3,1.6,3,2.1]
[null,9,3,4,6,null,7,8,4,12,13,17.4,6.2,7.2,8.4]
[null,7,6,2,3,null,2,6,3,7,5,2.4,1.6,2.6]
[null,2,9,8,10,null,7,10,4,8,1,14.6,3.3,1.6,2.4]
[]
["2015-07-26",2,1,4,3,null,1,2,3,4,5,1.7,1.1,1.3]
["MAISONS LAFFITTE",6,2,3,4,null,6,2,3,9,8,1.4,1.1,1.3,1.2]
[null,1,5,3,4,null,8,2,5,6,7,20.7,6,10.1,2.4]
[null,10,1,9,4,null,1,7,10,2,4,14.3,4.6,5,2.2]
[null,6,8,4,3,null,1,5,2,6,7,5.5,2.4,3,3.8]
[null,3,7,10,6,null,1,6,2,4,5,3.5,1.9,3,4.8]
[null,2,8,5,7,null,2,4,7,8,1,7.6,2.2,2.2,2]
[null,4,1,6,8,null,4,10,2,8,7,4.7,2.5,5.7,2.3]
[]
["2015-07-27",3,5,4,2,null,5,2,4,6,3,2.8,1.2,1.7,1.9]
["CLAIREFONTAINE",7,6,11,3,null,14,5,9,11,7,8.8,2.2,2.3,2.7]
[null,0,0,0,0,null,4,3,1,6,10,14.1,3.6,3,1.8]
[null,6,7,1,4,null,10,4,1,7,9,4.9,2.3,5.7,3.8]
[null,0,0,0,0,null,16,15,6,14,10,3.4,2.2,2,8.2]
[null,6,9,4,8,null,9,5,8,4,7,2.9,1.3,2.4,1.6]
[null,3,2,5,1,null,1,5,4,13,11,3.8,2.3,3.2,10]
[null,5,7,18,3,null,8,7,15,5,13,11.8,3.6,2.9,16.2]
[]
["2015-07-28",1,2,3,4,null,1,3,2,5,4,1.8,1.1,1.1]
["CHANTILLY",3,1,7,5,null,3,7,5,2,1,2.6,1.2,1.8,2]
[null,1,6,2,9,null,4,10,2,15,1,8.6,2.3,4.2,5.8]
[null,4,1,3,6,null,4,3,6,2,1,7.8,2.7,1.6]
[null,12,8,3,7,null,8,12,7,2,14,2.9,1.3,1.6,3.3]
[null,6,7,4,3,null,1,3,2,4,5,2.6,1.5,1.4]
[null,1,6,5,3,null,1,6,3,4,11,4.2,2,3.8,1.3]
[null,7,3,10,16,null,3,4,18,11,2,4.8,1.8,4.9,8.9]
[]
["2015-07-29",13,14,5,15,null,6,1,12,7,5,39.1,9,3.8,3.8]
["ENGHIEN SOISY",9,3,7,11,null,11,1,10,7,14,31.7,8,8.6,7.3]
[null,6,8,11,2,null,5,2,8,13,6,10.9,3.7,2.6,2.3]
[null,5,7,8,6,null,8,5,7,2,3,3.2,1.3,1.4,1.2]
[null,2,8,10,1,null,10,9,6,11,7,3.5,1.6,1.5,2.5]
[null,12,4,10,9,null,6,12,10,2,5,7.4,1.3,1.2,1.8]
[null,8,11,10,9,null,10,3,6,11,1,2.9,1.5,3,5.7]
[null,8,5,7,2,null,2,7,8,5,9,14,2.1,1.5,1.2]
[]
["2015-07-30",0,0,0,0,null,6,9,1,4,5,4.2,1.3,1.5,1.3]
["DEAUVILLE",5,1,6,2,null,3,6,4,2,5,6.4,3,3]
[null,12,7,11,1,null,12,6,8,13,1,17.5,4.8,6.2,1.6]
[null,0,0,0,0,null,9,6,3,5,8,5.6,1.9,1.5,2.5]
[null,5,1,8,6,null,3,2,7,1,5,20.5,4.9,4.9,2.1]
[null,7,2,5,9,null,6,3,8,7,5,10.2,3.6,4,1.6]
[null,1,3,5,9,null,3,9,11,2,6,2.2,1.2,2,1.6]
[null,6,1,9,8,null,11,8,6,4,10,13.9,3.4,1.7,3.6]
[]
["2015-07-31",5,7,1,9,null,2,14,8,16,9,7.8,2.1,1.7,4.5]
["CLAIREFONTAINE",2,7,4,1,null,1,5,8,10,4,3.3,2.1,2,5.3]
[null,8,9,3,7,null,8,7,5,6,11,4.9,1.7,2.5,18]
[null,1,3,13,2,null,1,3,7,13,9,1.8,1.3,1.7,4.5]
[null,3,2,6,8,null,6,3,2,1,11,7.5,1.6,2.2,1.4]
[null,1,2,5,6,null,1,6,2,7,8,1.9,1.1,1.5,1.4]
[null,2,1,12,6,null,3,4,11,5,6,8.4,3,2.5,2.4]
[null,4,7,12,6,null,1,5,3,15,11,4.5,1.8,3.1,2.8]
[]
["2015-08-01",1,2,5,3,null,1,2,5,4,3,1.4,1.1,1.3]
["DEAUVILLE",5,4,1,2,null,5,1,6,7,3,1.6,1.1,1.4]
[null,5,1,12,9,null,10,11,12,7,1,14.4,4,6,5.1]
[null,1,7,6,3,null,7,3,5,6,8,2.2,1.3,1.4,2.1]
[null,2,1,3,6,null,6,2,4,3,1,34.6,9,2.9]
[null,1,3,6,5,null,3,4,5,1,6,5.6,1.9,4.3,1.7]
[null,13,10,5,6,null,10,5,9,3,8,5.4,2.3,3.3,4.6]
[null,12,15,13,10,null,6,15,14,11,4,12.2,4.4,4,8.8]
[]
["2015-08-02",1,3,5,2,null,1,3,6,5,2,1.7,1.1,1.2,1.8]
["DEAUVILLE",5,1,3,2,null,3,8,4,5,1,4.8,2.1,6.3,5.2]
[null,5,1,6,7,null,5,12,15,3,7,4.8,2.2,6.1,7.2]
[null,5,3,6,1,null,6,1,2,3,4,8.6,3.1,3.9]
[null,7,6,2,1,null,5,7,6,3,2,4.3,1.4,1.1,1.4]
[null,2,1,4,3,null,3,2,1,4,5,3.4,1.6,1.5]
[null,2,3,5,6,null,6,5,3,1,2,6.5,1.5,1.8,1.2]
[null,11,15,7,3,null,15,11,4,2,10,21.4,5.2,4.3,4.9]
[]
["2015-08-03",9,3,8,4,null,6,9,14,15,1,10.1,3,2.2,5.7]
["CLAIREFONTAINE",1,2,9,8,null,12,10,2,4,8,12,2.7,4,1.4]
[null,5,2,7,1,null,7,5,1,2,6,3.6,2.8,3.4]
[null,1,11,7,5,null,7,1,4,3,5,7,1.9,3.2,1.7]
[null,2,3,5,7,null,2,5,3,8,7,5.8,2,2.7,2.5]
[null,1,2,3,4,null,6,1,10,3,5,10.5,3.1,1.8,8.4]
[null,7,2,9,4,null,7,14,13,2,8,3.6,1.8,23,2.8]
[null,2,6,5,9,null,6,1,8,5,2,11.9,3.2,1.8,10]
[]
["2015-08-04",2,3,6,4,null,2,6,3,4,7,3.3,1.1,1.1,1.4]
["DEAUVILLE",3,6,1,5,null,1,3,6,2,5,4.7,1.9,1.4]
[null,6,11,3,5,null,14,6,5,8,7,17.2,4.3,3.9,1.6]
[null,2,8,3,5,null,8,2,5,4,7,2.1,1.3,1.6,1.6]
[null,4,5,9,3,null,9,4,3,5,12,4.4,2.3,3.7,2.2]
[null,3,8,6,10,null,7,5,6,1,8,9.8,5.4,3.8,3.5]
[null,6,12,9,10,null,7,1,2,6,4,26.9,7.3,4.8,3.1]
[null,15,1,3,2,null,9,8,11,2,10,36.6,7.5,3.2,2]
[]
["2015-08-05",3,8,10,6,null,6,8,1,7,3,5.6,1.6,1.4,4.7]
["SAINT MALO",12,1,3,11,null,1,3,2,4,7,3.1,2.1,6,8.5]
[null,9,10,6,13,null,9,5,7,12,4,4.3,1.8,2.1,6.3]
[null,10,3,2,12,null,9,3,5,7,10,2,1.7,3.3,5.1]
[null,7,13,1,16,null,8,1,13,2,9,8.6,2,1.2,1.8]
[null,8,15,5,14,null,5,11,8,1,15,6.4,2,1.8,4.3]
[null,7,2,6,3,null,3,6,7,4,null,17.3,7.4,3]
[null,9,7,5,13,null,3,9,5,11,7,23.8,3.2,1.5,9.3]
[]
["2015-08-06",10,8,11,9,null,6,11,7,9,2,36.5,5,1.3,2.5]
["ENGHIEN SOISY",8,7,5,3,null,6,8,7,5,10,2.3,1.2,1.3,1.4]
[null,12,10,4,13,null,1,13,12,3,2,17.8,4.2,2.4,2]
[null,9,5,10,7,null,2,1,6,10,5,4.1,2,3.1,4]
[null,2,9,12,1,null,12,7,10,3,9,1.9,1.3,2.2,5.8]
[null,11,12,9,7,null,6,11,12,3,9,13.2,2.8,2.3,2.7]
[null,11,10,5,9,null,1,6,9,11,10,8.2,2.4,1.5,1.4]
[null,3,7,8,2,null,3,11,12,2,10,7.9,2,2.7,3.7]
[]
["2015-08-07",0,0,0,0,null,15,3,8,1,5,7.7,2.8,6.1,4.3]
["DEAUVILLE",8,2,15,9,null,3,6,5,12,8,3,1.7,4.1,8.5]
[null,7,10,6,8,null,11,2,6,13,1,16.9,5.9,5,5.1]
[null,0,0,0,0,null,1,3,4,2,5,12,3,2,1.8]
[null,7,1,5,6,null,1,3,5,2,6,3.6,2.3,2]
[null,5,14,6,10,null,1,9,11,4,15,13.2,5.3,2.4,3.6]
[null,11,1,3,12,null,1,5,6,12,7,5.7,2.8,14.1,21.8]
[null,12,7,3,5,null,9,12,8,5,10,20.2,7.1,1.8,4]
[]
["2015-08-08",1,4,8,2,null,2,1,3,8,4,3.5,2.5,1.4,2.8]
["CLAIREFONTAINE",3,2,9,6,null,2,11,4,8,3,9.7,4.9,2.1,1.3]
[null,10,15,2,6,null,6,14,10,16,8,5.4,1.7,3.2,2.2]
[null,4,7,10,5,null,11,4,2,5,3,6.3,2.3,1.8,1.2]
[null,3,1,2,13,null,4,6,3,12,1,16.2,5.3,2,2]
[null,4,2,3,6,null,6,5,11,8,1,13.4,4.8,4.2,15.9]
[null,1,8,13,4,null,16,1,5,7,10,13.3,5.4,1.7,4.6]
[null,3,1,2,4,null,2,4,3,1,8,4.9,1.5,1.7,1.2]
[]
["2015-08-09",1,4,3,6,null,1,2,3,4,6,2.1,1.3,3.1]
["DEAUVILLE",6,3,2,4,null,6,2,4,3,5,2.5,1.3,1.2,4]
[null,2,4,1,7,null,8,16,11,7,4,10.2,4.1,4.3,7.4]
[null,7,5,1,4,null,5,4,2,8,7,6.7,2,2.3,2]
[null,2,5,9,6,null,10,9,3,1,2,1.9,1.2,1.6,2.6]
[null,2,10,4,13,null,6,10,4,1,2,10.6,3,2.4,5.4]
[null,9,15,12,2,null,13,10,9,14,4,56.4,11.3,4.4,2.6]
[null,1,8,14,3,null,4,10,6,3,13,6.9,2.9,4.3,3.5]
[]
["2015-08-10",1,5,9,2,null,5,7,2,1,6,4,2,2.7,2.4]
["CLAIREFONTAINE",8,9,6,4,null,7,1,10,17,11,16.9,5.3,1.6,4.8]
[null,8,10,5,1,null,10,11,3,1,6,5.6,2.1,8.4,2.3]
[null,4,5,3,2,null,2,3,5,9,12,9.1,3,2,2.5]
[null,1,6,8,5,null,1,12,6,2,5,8.5,2.5,4,1.7]
[null,1,3,2,9,null,4,1,8,9,6,4.1,1.4,1.1,3.5]
[null,7,4,5,9,null,8,1,3,2,9,6.4,1.8,2.8,3.8]
[null,9,8,2,3,null,1,4,2,5,8,14.6,4.2,4.3,1.9]
[]
["2015-08-11",9,5,4,6,null,3,8,1,2,9,4.1,2.2,6,3.5]
["DEAUVILLE",6,3,5,2,null,2,3,5,1,6,5.5,2,1.3]
[null,7,4,6,3,null,3,8,7,9,4,6.8,1.9,3.8,1.2]
[null,10,6,8,3,null,11,1,4,13,7,14.7,5.1,2.2,5]
[null,10,7,8,11,null,7,2,3,10,4,8.9,3.3,4,12.1]
[null,13,7,8,12,null,4,1,7,8,2,12.3,4,3.1,4.1]
[null,9,7,1,4,null,7,9,10,4,3,8.6,3.2,3.8,2]
[null,6,11,5,17,null,18,14,8,1,4,30,8.1,8.9,3.1]
[]
["2015-08-12",8,5,10,9,null,8,5,2,4,6,8.3,1.8,1.2,5]
["ENGHIEN SOISY",4,6,7,10,null,1,6,4,10,9,6.4,1.3,1.2,1.2]
[null,8,13,9,5,null,13,8,7,12,10,1.7,1.2,1.4,2]
[null,4,6,2,1,null,1,5,3,6,9,44.8,5.9,4,1.6]
[null,7,6,14,15,null,2,10,11,16,13,35.6,12,6,34]
[null,6,3,11,9,null,3,6,10,11,7,3.2,1.8,2.5,12.6]
[null,9,4,15,8,null,5,8,9,12,15,55.3,7,3.6,2]
[null,7,6,4,9,null,8,3,7,9,2,2.9,1.6,2.4,1.5]
[]
["2015-08-13",4,5,2,3,null,5,4,2,1,3,1.9,1.1,1.3]
["CLAIREFONTAINE",4,9,7,5,null,12,4,3,7,9,4.3,1.8,1.5,5.2]
[null,4,10,1,15,null,1,5,8,4,13,10.3,4.2,3.4,15.2]
[null,1,10,5,12,null,12,10,7,5,8,22.5,5.5,1.8,3.2]
[null,12,2,3,6,null,12,1,6,7,4,3.1,1.8,7.6,5.3]
[null,8,1,9,4,null,1,9,2,8,4,3.7,1.6,1.3,2.1]
[null,2,7,3,10,null,2,7,17,6,10,6.1,1.8,1.4,5.7]
[null,4,7,2,1,null,13,4,1,9,8,8.8,2.4,1.5,2.6]
[]
["2015-08-14",0,0,0,0,null,1,2,4,3,6,3.3,1.6,1.1]
["DEAUVILLE",1,3,5,4,null,1,7,5,6,4,2.1,1.7,3.1]
[null,6,3,0,0,null,8,6,5,3,4,4.6,2.2,5,8.6]
[null,1,8,3,5,null,8,1,5,6,7,3.8,1.5,1.9,1.8]
[null,5,3,4,10,null,5,10,1,8,2,3.6,1.7,3,1.8]
[null,7,3,1,5,null,3,1,7,6,5,3.6,1.4,1.2,2.5]
[null,7,2,1,6,null,5,1,7,4,6,5.5,1.9,4.3,3.8]
[null,6,9,15,8,null,7,5,2,1,15,4,1.9,5,3.1]
[]
["2015-08-15",4,9,7,6,null,9,2,5,6,3,7.1,1.8,1.5,2.3]
["DEAUVILLE",1,5,6,7,null,6,11,5,4,7,4.2,1.6,2.8,1.5]
[null,3,6,4,2,null,2,3,6,4,5,1.8,1.3,1.8]
[null,1,12,13,15,null,16,1,15,3,8,4.1,2.2,5,4.3]
[null,1,2,8,3,null,3,8,7,6,2,4,1.6,1.5,3.1]
[null,2,11,4,7,null,2,7,11,3,4,4.1,1.5,1.9,1.2]
[null,9,8,4,7,null,4,8,5,1,7,1.6,1.1,1.6,1.9]
[null,1,3,2,6,null,11,9,4,7,3,4.8,2.5,2.9,2.8]
[]
["2015-08-16",1,3,5,4,null,5,3,2,7,4,9,2,1.5,2.8]
["DEAUVILLE",6,2,3,5,null,6,5,3,2,4,11.8,4.6,5.4]
[null,2,11,4,7,null,2,3,14,15,8,21.5,7.7,3.9,4.4]
[null,1,7,5,3,null,1,2,3,4,7,3.8,1.6,1.5,1.7]
[null,3,9,4,7,null,7,9,6,5,1,5.5,1.5,1.1,3.3]
[null,1,8,3,2,null,3,9,1,7,4,7,1.5,3.2,1.2]
[null,5,9,16,7,null,11,8,12,15,7,24.3,6.2,3.2,4.6]
[null,8,9,7,10,null,1,6,3,7,9,7.3,2.9,2.8,3.5]
[]
["2015-08-17",0,0,0,0,null,10,2,1,15,5,13.5,3.5,2.3,3]
["CHATEAUBRIANT",1,2,5,3,null,1,2,3,4,5,1.4,1.1,1.4]
[null,6,1,2,8,null,10,6,8,1,12,4.7,1.5,1.8,2.7]
[null,3,5,2,1,null,2,3,1,5,6,4.2,1.9,1.2,1.7]
[null,1,8,5,12,null,4,5,13,2,6,5.1,2.3,2.1,12.5]
[null,8,12,14,3,null,11,13,9,1,15,29.1,9,6.6,4.5]
[null,3,4,2,6,null,4,2,1,5,8,6.3,1.6,1.3,1.7]
[null,1,5,2,3,null,1,3,7,2,6,7.6,3.8,3.8]
[]
["2015-08-18",2,6,4,1,null,5,2,1,3,6,5.7,1.5,1.1]
["DEAUVILLE",1,2,4,3,null,3,1,4,2,5,4.1,1.7,1.2]
[null,1,2,7,5,null,3,5,2,13,15,4.4,1.6,6.2,4]
[null,1,5,6,2,null,3,4,5,1,2,5.9,3.1,2.9]
[null,5,6,2,1,null,3,4,2,6,5,4.7,3.5,5.2]
[null,2,7,5,11,null,4,10,7,5,6,6.3,3,12.1,3.4]
[null,4,3,7,1,null,3,4,8,6,1,2.6,1.3,1.4,4.6]
[null,15,1,5,4,null,2,3,6,10,11,11,3.6,2.9,1.9]
[]
["2015-08-19",9,10,11,16,null,11,15,18,10,1,8.6,3.2,7.5,8.3]
["VINCENNES",8,6,9,10,null,3,10,8,9,2,4.8,1.7,1.3,1.7]
[null,13,8,9,12,null,2,12,4,10,3,6.6,2.6,2.1,2.3]
[null,9,5,6,4,null,12,3,4,5,10,4.6,1.8,2.4,4.4]
[null,10,8,2,14,null,5,10,13,12,6,4.2,1.6,1.4,1.8]
[null,7,6,2,5,null,7,5,4,1,2,1.7,1.2,2.6]
[null,5,4,12,10,null,5,9,18,16,3,15.2,5.2,4.7,4.2]
[null,1,2,5,8,null,8,6,2,7,1,1.8,1.2,2,3.1]
[]
["2015-08-20",1,2,4,3,null,4,1,2,8,3,5.8,1.2,1.1,1.2]
["DEAUVILLE",1,3,4,2,null,1,5,2,3,4,2.5,1.2,2.7]
[null,4,3,6,11,null,12,6,13,4,16,13,4.7,2.3,5.3]
[null,9,5,3,2,null,9,7,1,6,8,1.8,1.1,7,2.8]
[null,2,6,8,10,null,2,4,7,5,3,17.7,6.5,4.1,5.7]
[null,5,8,2,3,null,1,4,8,5,7,6.3,3.3,1.7,2.2]
[null,5,3,4,1,null,3,2,5,7,6,9.2,8.1,8.6]
[null,1,7,5,10,null,7,2,8,1,4,5.7,1.9,3.3,9.4]
[]
["2015-08-21",5,4,6,1,null,1,4,6,2,5,1.5,1.1,1.1,1.1]
["CLAIREFONTAINE",1,3,8,4,null,3,1,2,6,8,4.7,1.5,1.3,3.9]
[null,4,3,6,2,null,2,5,3,6,4,3.7,1.8,3.4]
[null,7,1,9,16,null,10,13,5,8,12,6.9,3.6,2.1,2.4]
[null,6,4,2,5,null,1,6,3,2,7,4.7,2.2,1.3]
[null,1,4,2,10,null,1,5,16,10,11,3.7,1.8,13.4,5.2]
[null,2,6,7,9,null,11,5,9,1,3,75.9,9.5,5.2,2.9]
[null,6,2,8,14,null,11,17,8,14,6,10.9,3.8,6.2,4.1]
[]
["2015-08-22",7,6,5,8,null,6,7,4,5,1,5.1,2.1,2.1,3.2]
["DEAUVILLE",0,0,0,0,null,5,3,9,6,2,3.9,1.8,2.2,4.8]
[null,0,0,0,0,null,7,9,10,1,4,9.7,3,4.5,2]
[null,9,8,2,3,null,9,8,10,6,5,7.7,2.3,1.5,2.4]
[null,2,5,3,0,null,3,1,4,5,2,4.4,2.1,2.6]
[null,2,4,9,6,null,4,3,6,8,7,25.4,3.5,2.3,1.6]
[null,7,3,8,9,null,5,12,9,15,7,12,3.4,1.7,2.2]
[null,5,9,6,7,null,1,6,9,5,3,9,3.6,1.8,2.8]
[]
["2015-08-23",3,6,2,8,null,4,2,1,5,8,2.6,1.5,1.9,1.6]
["DEAUVILLE",2,1,3,4,null,3,5,2,1,4,13.1,4.5,8.6]
[null,7,1,5,13,null,16,14,5,2,9,21.4,8,15.8,7.1]
[null,5,3,1,4,null,2,1,5,4,3,1.7,1.1,1.5]
[null,1,8,10,2,null,5,10,1,9,3,36.1,8.6,3,2.1]
[null,5,2,6,4,null,2,4,1,5,6,2.2,1.4,3.5]
[null,1,4,3,2,null,1,6,7,3,9,8.2,2.7,1.6,2]
[null,3,7,8,5,null,10,1,12,8,2,21.6,5.5,2.7,2.6]
[]
["2015-08-24",3,13,1,2,null,3,13,7,10,6,2.7,1.6,1.9,2.6]
["VINCENNES",16,12,9,13,null,12,9,13,8,17,4.6,2,4.3,2.1]
[null,4,3,5,7,null,3,1,9,4,5,6.8,1.9,2.5,1.2]
[null,10,14,12,15,null,13,5,11,1,12,23.6,5.4,2.2,5.4]
[null,7,5,10,8,null,7,10,9,8,5,2.5,1.5,1.4,1.8]
[null,8,11,10,3,null,8,7,9,6,5,9.7,5.1,8.6,2.6]
[null,13,1,5,8,null,13,8,12,9,1,3,1.5,3.1,2.9]
[null,9,8,7,4,null,7,3,9,8,6,10.2,2.4,2.5,1.4]
[]
["2015-08-25",0,0,0,0,null,7,8,4,6,1,27.4,3.9,1.7,1.2]
["CLAIREFONTAINE",1,6,11,2,null,7,9,2,5,6,9.1,2.7,4.7,2.6]
[null,3,9,1,8,null,10,9,13,4,6,12,3.8,2.2,3.6]
[null,11,6,9,10,null,1,4,6,10,5,3.9,2,2.8,2.1]
[null,2,1,10,16,null,7,3,6,5,9,9.4,3.2,13.4,6.6]
[null,7,1,5,4,null,7,2,5,4,6,16,2.4,1.2,1.6]
[null,7,5,8,2,null,7,3,8,15,10,5.2,1.7,3.3,1.7]
[null,6,7,3,16,null,6,1,4,11,15,25.3,9,4.3,4.1]
[]
["2015-08-26",2,13,4,6,null,4,3,5,7,14,7.5,2.5,5.3,6.1]
["DEAUVILLE",7,5,1,3,null,2,7,6,1,5,14.5,5.2,2.2]
[null,2,7,12,1,null,9,2,6,4,11,11.4,3.3,3.4,3.1]
[null,3,6,1,9,null,5,3,2,9,6,8.2,1.8,1.2,1.3]
[null,1,7,2,6,null,1,2,5,3,6,3.6,1.6,1.6,2.2]
[null,1,3,4,6,null,6,9,11,1,5,5.5,1.8,2.1,5.6]
[null,6,1,10,9,null,2,12,7,1,9,4.1,2.2,7,3.2]
[null,2,5,6,7,null,14,10,15,13,9,10.5,2.6,4.2,2.8]
[]
["2015-08-27",4,2,3,5,null,3,1,7,5,2,11.4,2.9,1.8,4.3]
["CLAIREFONTAINE",10,5,9,4,null,10,9,5,8,7,2.6,1.2,1.8,2]
[null,6,3,10,9,null,6,13,12,10,3,4,1.8,2.3,4.4]
[null,2,4,6,1,null,16,1,13,10,14,88.4,20.5,4.6,14.6]
[null,3,6,1,2,null,6,3,7,4,2,4.3,2.3,1.8]
[null,8,3,4,2,null,9,15,4,14,3,22.3,8,4.5,3]
[null,4,2,7,1,null,5,4,2,7,6,6.9,2.3,1.3,1.4]
[null,5,9,10,3,null,7,4,2,8,3,11.3,3.2,7.2,13]
[]
["2015-08-28",5,1,3,7,null,1,9,7,2,6,7.2,2.7,9.4,2.6]
["MARSEILLE BORELY",1,7,3,8,null,9,7,4,5,3,12.2,3.9,3.9,1.5]
[null,2,8,1,5,null,15,7,1,8,13,20.8,7.1,16.8,3.8]
[null,4,2,9,1,null,4,2,13,1,8,8.4,2.1,2.1,6.6]
[null,3,1,4,2,null,3,4,1,2,null,1.6,1.1,2.3]
[null,1,2,5,6,null,1,5,7,8,6,3.8,1.1,2,1.9]
[null,1,6,5,3,null,5,1,4,8,7,7.5,1.9,1.3,2.5]
[null,2,5,1,4,null,4,2,5,3,1,6.9,1.5,1.1]
[]
["2015-08-29",6,2,3,8,null,7,9,8,3,5,5.3,2.3,2.6,2.3]
["VINCENNES",9,7,8,6,null,6,4,2,7,9,2.9,1.7,3.1,8.3]
[null,7,6,9,3,null,6,1,9,4,7,2.1,1.2,1.8,1.8]
[null,14,17,12,11,null,14,7,15,12,5,4.3,1.6,2.2,3.2]
[null,12,7,5,10,null,12,10,1,7,11,1.6,1.2,2.8,5.6]
[null,13,7,11,10,null,7,13,10,8,6,14.4,3.2,1.6,3.6]
[null,12,13,11,6,null,15,6,17,14,2,9.2,2.3,10.9,2.3]
[null,6,4,7,12,null,7,13,14,12,9,6.4,2.8,4,7.5]
[]
["2015-08-30",4,1,9,2,null,1,3,6,8,5,1.6,1.1,2.2,3.6]
["DEAUVILLE",4,9,7,1,null,1,7,5,2,10,3.2,1.8,1.9,4.4]
[null,6,14,4,5,null,8,1,11,7,6,9.6,3.1,5.3,4.7]
[null,5,2,3,8,null,3,5,8,6,2,3.9,1.2,2.1,2.2]
[null,1,3,2,5,null,4,5,1,2,7,11.1,5.2,1.7]
[null,3,1,2,5,null,6,1,2,5,4,4.8,1.8,3.5,7.6]
[null,3,9,8,12,null,14,16,6,1,11,21.4,7.6,6.7,3.7]
[null,12,3,7,13,null,2,10,1,9,14,7.7,4.4,4,4]
[]
["2015-08-31",6,3,1,4,null,1,6,5,2,3,3.6,1.9,2.4]
["LONGCHAMP",7,2,3,1,null,1,6,16,4,7,21.7,5,7,4.3]
[null,10,6,4,9,null,10,4,9,2,6,3,1.4,1.4,2.3]
[null,3,4,6,1,null,1,4,6,3,5,4.3,2.8,2.8]
[null,1,7,8,2,null,7,1,3,4,8,6.8,1.8,1.3,1.9]
[null,12,4,3,5,null,5,10,13,11,1,4.3,2,3,6]
[null,7,1,9,3,null,1,11,6,5,7,6.7,2.2,1.8,2.8]
[null,5,13,9,7,null,1,7,4,10,13,19.7,6,3.7,3.8]
[]
["2015-09-01",7,10,1,4,null,3,6,9,10,4,10.5,2.7,3.8,7.4]
["NANCY",3,8,1,10,null,10,11,14,6,2,12.7,3.1,6.5,4.4]
[null,5,3,2,8,null,6,1,9,14,8,12,4,7.2,3.2]
[null,5,3,6,8,null,13,1,4,10,6,5.6,1.8,2.2,3.6]
[null,12,1,2,3,null,3,7,8,13,14,5.3,2,3.5,5.1]
[null,3,4,5,2,null,3,4,5,2,6,1.4,1.1,1.9]
[null,1,9,8,10,null,7,12,14,9,1,6.9,3.9,10.6,3]
[null,3,4,5,2,null,4,1,2,5,3,2,1.1,1.5,2.5]
[]
["2015-09-02",12,17,13,18,null,7,16,13,12,2,24,5.2,2.7,1.9]
["CAGNES SUR MER",9,8,4,10,null,10,8,2,6,7,3.7,1.8,1.8,4]
[null,10,2,9,13,null,5,13,11,3,10,3.4,1.7,2.6,2.5]
[null,3,9,4,7,null,3,6,5,7,4,5.8,1.7,2.5,1.8]
[null,8,3,11,12,null,10,4,3,12,9,4.1,2.5,2.1,2.4]
[null,10,13,7,2,null,10,3,9,1,8,5,2.1,1.6,2.1]
[null,8,11,10,9,null,4,8,9,5,11,26.2,4.1,2.1,1.9]
[null,12,7,5,3,null,12,2,8,14,3,8.9,3,5.4,4.6]
[]
["2015-09-03",0,0,0,0,null,7,6,1,4,3,10.6,4.7,1.9]
["LONGCHAMP",0,0,0,0,null,1,5,2,3,6,13.7,3,1.2]
[null,1,3,4,2,null,3,2,1,4,5,2.2,1.4,2]
[null,2,17,12,9,null,9,4,14,3,15,14.5,4.6,3.6,3.6]
[null,6,1,7,5,null,6,8,3,1,7,5.1,2.3,6.2,4]
[null,4,8,7,6,null,8,5,4,2,6,3.3,1.4,2,1.6]
[null,2,1,5,3,null,5,7,2,4,6,9.2,3.8,5.5]
[null,7,3,6,10,null,9,7,5,3,6,9.1,1.9,1.1,2.3]
[]
["2015-09-04",3,9,2,6,null,2,6,3,9,4,2.8,1.6,2.2,1.9]
["AUTEUIL",1,4,6,2,null,4,2,7,6,8,6,2.9,3.4,15.5]
[null,8,9,6,3,null,2,6,9,10,12,25,4.6,1.6,2]
[null,2,3,7,5,null,3,2,7,4,6,9.2,3.2,1.4]
[null,3,4,1,5,null,10,3,5,11,2,14.1,2.8,1.3,2.4]
[null,6,1,7,3,null,1,5,11,6,7,4.2,2.1,4.3,5]
[null,5,6,9,2,null,10,6,1,9,3,8.4,2.7,1.8,2.6]
[null,1,6,3,4,null,6,1,4,5,3,2.1,1.2,2,3.2]
[]
["2015-09-05",11,9,6,7,null,4,11,2,10,6,4.2,1.7,1.5,2.7]
["VINCENNES",10,8,9,5,null,1,10,8,3,4,6.8,2.3,1.5,3]
[null,7,10,3,6,null,3,13,10,1,12,2.5,1.5,3.4,2.7]
[null,4,11,13,8,null,4,11,13,15,3,2.6,1.4,1.7,1.5]
[null,10,9,6,5,null,10,4,9,8,5,2.7,1.2,1.5,1.3]
[null,14,6,16,1,null,6,5,13,15,7,2.3,1.3,2.4,5.5]
[null,15,8,9,12,null,8,6,3,14,1,13.1,3.7,5.1,5.6]
[null,3,1,7,2,null,5,3,7,6,1,7.3,2.2,1.9,1.6]
[]
["2015-09-06",6,5,8,4,null,7,8,4,5,2,27.5,8.1,3.4,2.3]
["LONGCHAMP",3,6,4,2,null,2,3,6,1,4,3.7,1.8,1.4]
[null,16,5,2,15,null,13,11,1,3,14,8.2,2.8,7.4,1.9]
[null,6,5,3,2,null,5,1,2,3,4,7,3.6,1.9]
[null,9,6,3,4,null,7,9,2,4,1,7.5,2.6,2.6,3.1]
[null,2,8,3,1,null,8,2,3,4,7,16.8,3.8,1.2,2.7]
[null,3,4,9,11,null,6,9,3,5,11,8.2,3.5,3.2,2.1]
[null,1,3,4,8,null,16,10,13,8,15,29.9,10.7,4.7,6.9]
[]
["2015-09-07",10,2,5,11,null,6,2,9,7,10,9.9,3.1,3.3,1.8]
["CRAON",1,4,7,6,null,3,7,1,6,4,2.9,1.7,1.4]
[null,6,4,3,8,null,7,4,5,3,8,13.9,2.8,1.1,4.4]
[null,2,7,4,6,null,7,3,9,5,4,10.6,2.3,2.6,14]
[null,1,8,9,4,null,1,9,8,12,3,2.1,1.3,1.8,1.9]
[null,4,1,9,3,null,6,1,5,7,9,3.2,1.2,1.5,2.6]
[null,1,5,3,8,null,4,2,8,3,1,3.2,1.2,1.3,1.8]
[null,13,4,2,12,null,9,13,1,4,3,21.8,5,1.8,2.1]
[]
["2015-09-08",13,9,5,11,null,13,9,4,11,5,2.4,1.2,2.8,5.3]
["TOULOUSE",3,2,5,4,null,5,4,3,1,2,3.4,1.7,1.3]
[null,6,10,16,13,null,6,8,5,13,16,2.2,1.5,2.7,1.7]
[null,10,6,1,4,null,4,12,13,2,1,28,6.9,5.9,23.1]
[null,12,9,8,2,null,12,3,9,13,5,1.6,1.2,2.1,1.9]
[null,3,7,6,2,null,2,5,4,6,3,38.7,9.2,10.9,2.4]
[null,1,3,12,13,null,13,4,5,9,1,10.2,3.1,2.4,4]
[null,10,6,9,8,null,9,8,5,10,6,1.6,1.1,1.6,1.6]
[]
["2015-09-09",12,10,13,8,null,10,9,12,8,13,13.8,4.2,10.1,2.9]
["LE LION D'ANGERS",5,2,4,3,null,2,1,4,5,3,1.4,1.2,2.4]
[null,6,2,1,0,null,6,2,5,9,1,3.8,1.2,1.9,1.7]
[null,3,4,1,5,null,8,11,7,5,3,23.4,8.4,3.1,3.6]
[null,1,3,2,7,null,7,4,2,3,1,6.2,4.2,3.4]
[null,7,1,13,3,null,7,12,1,11,13,4.9,1.8,5.2,3.2]
[null,10,2,4,9,null,6,9,4,8,10,14.1,3.3,2.5,2.3]
[null,5,8,2,1,null,2,6,3,7,1,5.8,1.7,1.2,1.5]
[]
["2015-09-10",2,9,1,5]
[null,4,2,3,1]
[null,8,1,7,2]
[null,1,2,7,5]
[null,6,4,2,1]
[null,1,2,6,8]
[null,5,3,1,6]
[null,2,10,4,3]

{"sheet":"Feuil2","index":1,"n_rows":31,"n_cols":7,"rows_kept":31,"merged":[[3,0,3,3]]}
["Ecart moy","????",null,null,"Mise de base",{"v":1,"d":"1 €"}]
["ecart max","????"]
[]
["Montante"]
["Placé","Gagnant","Gagnant","Placé","Placé","placé"]
[1,1,1,1,1,2,5]
[4,2,1,2,2,5,10]
[7,3,1,5,4,20,15]
[10,4,2,12,8,50,20]
[13,5,2,24,16,null,25]
[16,6,2,null,32,null,30]
[null,null,4,null,64,null,"Ecart 7 jeu perdu et attendre le 1er jeu gagnant pour rejouer"]
[null,null,4,null,128]
[null,null,4]
[null,null,8]
[null,null,8,{"$nulls":3},"Prenons l' exemple du jeu des 4 chevaux « placés» à l’écart 1,"]
[null,null,8]
[null,null,16,{"$nulls":3},"Vous ne jouez pas le 1er cheval de la liste - s’il perd alors vous jouez le second cheval en \"placé\" en misant votre mise de base.  - Si le l er cheval gagne (\"gagnant\" ou \"placé\") vous ne jouez plus à ce jeu durant cette journée et rendez-vous au lendemain"]
[null,null,16]
[null,null,16,{"$nulls":3},"Si ce second cheval perd, vous jouez le 3ème cheval en misant votre mise de base.   Enfin si ce 3ème cheval perd vous jouez le 4ème cheval toujours en misant toujours votre mise de base. - Toujours arrêt au premier jeu gagné. "]
[]
[]
[]
[null,"A faire:","Avec arrêt"]
[null,null,"Sans arrêt"]
[null,null,"Ecart"]
[null,null,"En fonction du nb de partants"]
[null,null,"bilan sur le nb de part"]
[null,null,"bilan sans A"]
[null,null,"bilan AA"]
[null,null,"Bilan écart"]

{"sheet":"A faire","index":2,"n_rows":21,"n_cols":67,"rows_kept":21,"merged":[[0,1,0,4],[0,6,0,10],[0,11,0,14],[1,18,1,23],[1,26,1,32],[1,35,1,41],[1,44,1,50],[1,54,1,60]]}
[{"$nulls":55},"SI(BF4=\"\";\"\";SI(BG4<>0;\"\";SI(OU(ESTTEXTE(BH3);ET(BL3>0;BF3=\"G\"));1;SI(BJ3=0;BH3*2;1))))",{"$nulls":7},1,4,7,10]
[{"$nulls":18},"SP1 Placé",{"$nulls":7},"SP2 Placé",{"$nulls":8},"SP3 Placé",{"$nulls":8},"P1 Gagnant sans arrêt montante X2",{"$nulls":9},"P1 Gagnant avec arrêt montante X2"]
["Date","P1","P2","P3","P4",null,"1er","2ème","3ème","4ème","5ème","SG","SP1","SP2","SP3",null,"P1","Result","Cote","Mise","Cumul Mises","Gain Brut ","Cumul des gain","Résultat net",null,"P2","Result","Cote","Mise","Cumul Mises","Gain Brut ","Cumul des gain","Résultat net",null,"P3","Result","Cote","Mise","Cumul Mises","Gain Brut ","Cumul des gain","Résultat net",null,null,"Result","Cote","Mise","Cumul Mises","Gain Brut ","Cumul des gain","Résultat net",null,null,"Result","Cote","Mise","Cumul Mises","Gain Brut ","Cumul des gain","Résultat net",null,null,"Mise","Brut","net"]
["2014-12-15",4,2,1,9,null,7,2,4,10,9,3.5,1.5,2.5,1.5,null,{"$f":"IF(L4=\"\",\"\",COUNTIF(B4,G4))","v":0},{"$f":"IF(L4=\"\",\"\",IF(Q4=0,\"P\",\"G\"))","v":"P"},{"$f":"U44","v":0},{"$f":"IF(R4=\"\",\"\",IF(OR(ISTEXT(T3),AND(X3>0,R3=\"G\")),1,IF(V3=0,T3*2,ABS(ROUNDUP(X3*2,0)))))","v":1},{"$f":"IF(T4=\"\",\"\",SUM($T$4:T4))","v":1},{"$f":"IF(T4=\"\",\"\",S4*T4)","v":0},{"$f":"IF(T4=\"\",\"\",SUM($V$4:V4))","v":0},{"$f":"IF(T4=\"\",\"\",SUM($V$4:V4)-SUM($T$4:T4))","v":-1},null,{"$f":"IF(L4=\"\",\"\",COUNTIF(C4,H4))","v":1},{"$f":"IF(N4=\"\",\"\",IF(Z4=0,\"P\",\"G\"))","v":"G"},{"$f":"IF(L4=\"\",\"\",IF(AA4=\"P\",0,N4))","v":2.5},{"$f":"IF(AA4=\"\",\"\",IF(OR(ISTEXT(AC3),AND(AG3>0,AA3=\"G\")),1,IF(AE3=0,AC3*2,ABS(ROUNDUP(AG3*2,0)))))","v":1},{"$f":"IF(AC4=\"\",\"\",SUM($AC$4:AC4))","v":1},{"$f":"IF(AC4=\"\",\"\",AB4*AC4)","v":2.5},{"$f":"IF(AC4=\"\",\"\",SUM($AE$4:AE4))","v":2.5},{"$f":"IF(AC4=\"\",\"\",SUM($AE$4:AE4)-SUM($AC$4:AC4))","v":1.5},null,null,{"$f":"IF(L4=\"\",\"\",IF(#REF!=0,\"P\",\"G\"))","v":{"$error":"#REF!"}},{"$f":"IF(L4=\"\",\"\",IF(AJ4=\"P\",0,O4))","v":{"$error":"#REF!"}},{"$f":"IF(AJ4=\"\",\"\",IF(OR(ISTEXT(AL3),AND(AP3>0,AJ3=\"G\")),1,IF(AN3=0,AL3*2,ABS(ROUNDUP(AP3*2,0)))))","v":{"$error":"#REF!"}},{"$f":"IF(AL4=\"\",\"\",SUM($AL$4:AL4))","v":{"$error":"#REF!"}},{"$f":"IF(AL4=\"\",\"\",AK4*AL4)","v":{"$error":"#REF!"}},{"$f":"IF(AL4=\"\",\"\",SUM($AN$4:AN4))","v":{"$error":"#REF!"}},{"$f":"IF(AL4=\"\",\"\",SUM($AN$4:AN4)-SUM($AL$4:AL4))","v":{"$error":"#REF!"}},null,{"$f":"IF(L4=\"\",\"\",COUNTIF(B4,G4))","v":0},{"$f":"IF(L4=\"\",\"\",IF(AR4=0,\"P\",\"G\"))","v":"P"},{"$f":"IF(L4=\"\",\"\",IF(AS4=\"P\",0,L4))","v":0},{"$f":"IF(AS4=\"\",\"\",IF(OR(ISTEXT(AU3),AND(AY3>0,AS3=\"G\")),1,IF(AW3=0,AU3*2,1)))","v":1},{"$f":"IF(AU4=\"\",\"\",SUM($AU$4:AU4))","v":1},{"$f":"IF(AU4=\"\",\"\",AT4*AU4)","v":0},{"$f":"IF(AU4=\"\",\"\",SUM($AW$4:AW4))","v":0},{"$f":"IF(AU4=\"\",\"\",SUM($AW$4:AW4)-SUM($AU$4:AU4))","v":-1},null,{"$f":"IF(L4=\"\",\"\",COUNTIF(B4,G4))","v":0},{"$f":"IF(Q4=\"\",\"\",IF(BA4=0,\"P\",\"G\"))","v":"P"},{"$f":"IF(L4=\"\",\"\",IF(BB4=\"P\",0,L4))","v":0},{"$f":"IF(BB4=\"\",\"\",IF(BC4<>0,\"\",IF(OR(ISTEXT(BD3),AND(BH3>0,BB3=\"G\")),1,IF(BF3=0,BD3*2,1))))","v":1},{"$f":"IF(BD4=\"\",\"\",SUM($BD$4:BD4))","v":1},{"$f":"IF(BD4=\"\",\"\",BC4*BD4)","v":0},{"$f":"IF(BD4=\"\",\"\",SUM($BF$4:BF4))","v":0},{"$f":"IF(BD4=\"\",\"\",SUM($BF$4:BF4)-SUM($BD$4:BD4))","v":-1},null,null,1,{"$f":"IF(BK4=\"\",\"\",IF(BK4=\"\",\"\",BC4*BK4))","v":0},{"$f":"IF(BK4=\"\",\"\",SUM($BL$4:BL4)-SUM($BK$4:BK4))","v":-1},null,1]
["CAGNES SUR MER",8,9,2,10,null,14,9,1,12,7,16.4,4.4,2.8,2.6,null,{"$f":"IF(L5=\"\",\"\",COUNTIF(B5,G5))","v":0},{"$f":"IF(L5=\"\",\"\",IF(Q5=0,\"P\",\"G\"))","v":"P"},{"$f":"IF(L5=\"\",\"\",IF(R5=\"P\",0,M5))","v":0},{"$f":"IF(R5=\"\",\"\",IF(OR(ISTEXT(T4),AND(X4>0,R4=\"G\")),1,IF(V4=0,T4*2,ABS(ROUNDUP(X4*2,0)))))","v":2},{"$f":"IF(T5=\"\",\"\",SUM($T$4:T5))","v":3},{"$f":"IF(T5=\"\",\"\",S5*T5)","v":0},{"$f":"IF(T5=\"\",\"\",SUM($V$4:V5))","v":0},{"$f":"IF(T5=\"\",\"\",SUM($V$4:V5)-SUM($T$4:T5))","v":-3},null,{"$f":"IF(L5=\"\",\"\",COUNTIF(C5,H5))","v":1},{"$f":"IF(N5=\"\",\"\",IF(Z5=0,\"P\",\"G\"))","v":"G"},{"$f":"IF(L5=\"\",\"\",IF(AA5=\"P\",0,N5))","v":2.8},{"$f":"IF(AA5=\"\",\"\",IF(OR(ISTEXT(AC4),AND(AG4>0,AA4=\"G\")),1,IF(AE4=0,AC4*2,ABS(ROUNDUP(AG4*2,0)))))","v":1},{"$f":"IF(AC5=\"\",\"\",SUM($AC$4:AC5))","v":2},{"$f":"IF(AC5=\"\",\"\",AB5*AC5)","v":2.8},{"$f":"IF(AC5=\"\",\"\",SUM($AE$4:AE5))","v":5.3},{"$f":"IF(AC5=\"\",\"\",SUM($AE$4:AE5)-SUM($AC$4:AC5))","v":3.3},null,null,{"$f":"IF(L5=\"\",\"\",IF(#REF!=0,\"P\",\"G\"))","v":{"$error":"#REF!"}},{"$f":"IF(L5=\"\",\"\",IF(AJ5=\"P\",0,O5))","v":{"$error":"#REF!"}},{"$f":"IF(AJ5=\"\",\"\",IF(OR(ISTEXT(AL4),AND(AP4>0,AJ4=\"G\")),1,IF(AN4=0,AL4*2,ABS(ROUNDUP(AP4*2,0)))))","v":{"$error":"#REF!"}},{"$f":"IF(AL5=\"\",\"\",SUM($AL$4:AL5))","v":{"$error":"#REF!"}},{"$f":"IF(AL5=\"\",\"\",AK5*AL5)","v":{"$error":"#REF!"}},{"$f":"IF(AL5=\"\",\"\",SUM($AN$4:AN5))","v":{"$error":"#REF!"}},{"$f":"IF(AL5=\"\",\"\",SUM($AN$4:AN5)-SUM($AL$4:AL5))","v":{"$error":"#REF!"}},null,{"$f":"IF(L5=\"\",\"\",COUNTIF(B5,G5))","v":0},{"$f":"IF(L5=\"\",\"\",IF(AR5=0,\"P\",\"G\"))","v":"P"},{"$f":"IF(L5=\"\",\"\",IF(AS5=\"P\",0,L5))","v":0},{"$f":"IF(AS5=\"\",\"\",IF(OR(ISTEXT(AU4),AND(AY4>0,AS4=\"G\")),1,IF(AW4=0,AU4*2,1)))","v":2},{"$f":"IF(AU5=\"\",\"\",SUM($AU$4:AU5))","v":3},0,{"$f":"IF(AU5=\"\",\"\",SUM($AW$4:AW5))","v":0},{"$f":"IF(AU5=\"\",\"\",SUM($AW$4:AW5)-SUM($AU$4:AU5))","v":-3},null,{"$f":"IF(L5=\"\",\"\",COUNTIF(B5,G5))","v":0},{"$f":"IF(Q5=\"\",\"\",IF(BA5=0,\"P\",\"G\"))","v":"P"},{"$f":"IF(L5=\"\",\"\",IF(BB5=\"P\",0,L5))","v":0},{"$f":"IF(BB5=\"\",\"\",IF(BC4<>0,\"\",IF(OR(ISTEXT(BD4),AND(BH4>0,BB4=\"G\")),1,IF(BF4=0,BD4*2,1))))","v":2},{"$f":"IF(BD5=\"\",\"\",SUM($BD$4:BD5))","v":3},{"$f":"IF(BD5=\"\",\"\",BC5*BD5)","v":0},{"$f":"IF(BD5=\"\",\"\",SUM($BF$4:BF5))","v":0},{"$f":"IF(BD5=\"\",\"\",SUM($BF$4:BF5)-SUM($BD$4:BD5))","v":-3},null,null,{"$f":"IF(BB5=\"\",\"\",IF(AND(BM4>0,BB4=\"G\"),$BL$1,IF(BB4=\"P\",$BM$1,1)))","v":4},{"$f":"IF(BK5=\"\",\"\",IF(BK5=\"\",\"\",BC5*BK5))","v":0},{"$f":"IF(BK5=\"\",\"\",SUM($BL$4:BL5)-SUM($BK$4:BK5))","v":-5},null,{"$f":"IF(BB5=\"\",\"\",IF(AND(BM4>0,BB4=\"G\"),$BL$1,IF(BB4=\"G\",1,$BM$1)))","v":4}]
[null,4,15,5,3,null,16,6,5,14,7,45.5,11.4,11.5,3.9,null,{"$f":"IF(L6=\"\",\"\",COUNTIF(B6,G6))","v":0},{"$f":"IF(L6=\"\",\"\",IF(Q6=0,\"P\",\"G\"))","v":"P"},{"$f":"IF(L6=\"\",\"\",IF(R6=\"P\",0,M6))","v":0},4,{"$f":"IF(T6=\"\",\"\",SUM($T$4:T6))","v":7},0,{"$f":"IF(T6=\"\",\"\",SUM($V$4:V6))","v":0},{"$f":"IF(T6=\"\",\"\",SUM($V$4:V6)-SUM($T$4:T6))","v":-7},null,{"$f":"IF(L6=\"\",\"\",COUNTIF(C6,H6))","v":0},{"$f":"IF(N6=\"\",\"\",IF(Z6=0,\"P\",\"G\"))","v":"P"},{"$f":"IF(L6=\"\",\"\",IF(AA6=\"P\",0,N6))","v":0},1,{"$f":"IF(AC6=\"\",\"\",SUM($AC$4:AC6))","v":3},0,{"$f":"IF(AC6=\"\",\"\",SUM($AE$4:AE6))","v":5.3},{"$f":"IF(AC6=\"\",\"\",SUM($AE$4:AE6)-SUM($AC$4:AC6))","v":2.3},null,null,{"$f":"IF(L6=\"\",\"\",IF(#REF!=0,\"P\",\"G\"))","v":{"$error":"#REF!"}},{"$f":"IF(L6=\"\",\"\",IF(AJ6=\"P\",0,O6))","v":{"$error":"#REF!"}},{"$error":"#REF!"},{"$f":"IF(AL6=\"\",\"\",SUM($AL$4:AL6))","v":{"$error":"#REF!"}},{"$error":"#REF!"},{"$f":"IF(AL6=\"\",\"\",SUM($AN$4:AN6))","v":{"$error":"#REF!"}},{"$f":"IF(AL6=\"\",\"\",SUM($AN$4:AN6)-SUM($AL$4:AL6))","v":{"$error":"#REF!"}},null,{"$f":"IF(L6=\"\",\"\",COUNTIF(B6,G6))","v":0},{"$f":"IF(L6=\"\",\"\",IF(AR6=0,\"P\",\"G\"))","v":"P"},{"$f":"IF(L6=\"\",\"\",IF(AS6=\"P\",0,L6))","v":0},4,{"$f":"IF(AU6=\"\",\"\",SUM($AU$4:AU6))","v":7},0,{"$f":"IF(AU6=\"\",\"\",SUM($AW$4:AW6))","v":0},{"$f":"IF(AU6=\"\",\"\",SUM($AW$4:AW6)-SUM($AU$4:AU6))","v":-7},null,{"$f":"IF(L6=\"\",\"\",COUNTIF(B6,G6))","v":0},"P",{"$f":"IF(L6=\"\",\"\",IF(BB6=\"P\",0,L6))","v":0},4,{"$f":"IF(BD6=\"\",\"\",SUM($BD$4:BD6))","v":7},0,{"$f":"IF(BD6=\"\",\"\",SUM($BF$4:BF6))","v":0},{"$f":"IF(BD6=\"\",\"\",SUM($BF$4:BF6)-SUM($BD$4:BD6))","v":-7},null,null,{"$f":"IF(BB6=\"\",\"\",IF(AND(BM5>0,BB5=\"G\"),$BL$1,IF(BB5=\"P\",$BM$1,1)))","v":4},0,{"$f":"IF(BK6=\"\",\"\",SUM($BL$4:BL6)-SUM($BK$4:BK6))","v":-9},null,{"$f":"IF(BB6=\"\",\"\",IF(AND(BM5>0,BB5=\"G\"),$BL$1,IF(BB5=\"G\",1,$BM$1)))","v":4}]
[null,6,5,8,2,null,6,2,7,8,5,8.9,2.1,1.3,1.8,null,{"$f":"IF(L7=\"\",\"\",COUNTIF(B7,G7))","v":1},{"$f":"IF(L7=\"\",\"\",IF(Q7=0,\"P\",\"G\"))","v":"G"},{"$f":"IF(L7=\"\",\"\",IF(R7=\"P\",0,M7))","v":2.1},8,{"$f":"IF(T7=\"\",\"\",SUM($T$4:T7))","v":15},16.8,{"$f":"IF(T7=\"\",\"\",SUM($V$4:V7))","v":16.8},{"$f":"IF(T7=\"\",\"\",SUM($V$4:V7)-SUM($T$4:T7))","v":1.8000000000000007},null,{"$f":"IF(L7=\"\",\"\",COUNTIF(C7,H7))","v":0},{"$f":"IF(N7=\"\",\"\",IF(Z7=0,\"P\",\"G\"))","v":"P"},{"$f":"IF(L7=\"\",\"\",IF(AA7=\"P\",0,N7))","v":0},2,{"$f":"IF(AC7=\"\",\"\",SUM($AC$4:AC7))","v":5},0,{"$f":"IF(AC7=\"\",\"\",SUM($AE$4:AE7))","v":5.3},{"$f":"IF(AC7=\"\",\"\",SUM($AE$4:AE7)-SUM($AC$4:AC7))","v":0.2999999999999998},null,null,{"$f":"IF(L7=\"\",\"\",IF(#REF!=0,\"P\",\"G\"))","v":{"$error":"#REF!"}},{"$f":"IF(L7=\"\",\"\",IF(AJ7=\"P\",0,O7))","v":{"$error":"#REF!"}},{"$error":"#REF!"},{"$f":"IF(AL7=\"\",\"\",SUM($AL$4:AL7))","v":{"$error":"#REF!"}},{"$error":"#REF!"},{"$f":"IF(AL7=\"\",\"\",SUM($AN$4:AN7))","v":{"$error":"#REF!"}},{"$f":"IF(AL7=\"\",\"\",SUM($AN$4:AN7)-SUM($AL$4:AL7))","v":{"$error":"#REF!"}},null,{"$f":"IF(L7=\"\",\"\",COUNTIF(B7,G7))","v":1},{"$f":"IF(L7=\"\",\"\",IF(AR7=0,\"P\",\"G\"))","v":"G"},{"$f":"IF(L7=\"\",\"\",IF(AS7=\"P\",0,L7))","v":8.9},8,{"$f":"IF(AU7=\"\",\"\",SUM($AU$4:AU7))","v":15},71.2,{"$f":"IF(AU7=\"\",\"\",SUM($AW$4:AW7))","v":71.2},{"$f":"IF(AU7=\"\",\"\",SUM($AW$4:AW7)-SUM($AU$4:AU7))","v":56.2},null,{"$f":"IF(L7=\"\",\"\",COUNTIF(B7,G7))","v":1},"G",{"$f":"IF(L7=\"\",\"\",IF(BB7=\"P\",0,L7))","v":8.9},8,{"$f":"IF(BD7=\"\",\"\",SUM($BD$4:BD7))","v":15},71.2,{"$f":"IF(BD7=\"\",\"\",SUM($BF$4:BF7))","v":71.2},{"$f":"IF(BD7=\"\",\"\",SUM($BF$4:BF7)-SUM($BD$4:BD7))","v":56.2},null,null,{"$f":"IF(BB7=\"\",\"\",IF(AND(BM6>0,BB6=\"G\"),$BL$1,IF(BB6=\"P\",$BM$1,1)))","v":4},35.6,{"$f":"IF(BK7=\"\",\"\",SUM($BL$4:BL7)-SUM($BK$4:BK7))","v":22.6}]
[null,2,1,3,5,null,2,5,6,7,1,4.1,1.7,10.2,4.9,null,{"$f":"IF(L8=\"\",\"\",COUNTIF(B8,G8))","v":1},{"$f":"IF(L8=\"\",\"\",IF(Q8=0,\"P\",\"G\"))","v":"G"},{"$f":"IF(L8=\"\",\"\",IF(R8=\"P\",0,M8))","v":1.7},1,{"$f":"IF(T8=\"\",\"\",SUM($T$4:T8))","v":16},1.7,{"$f":"IF(T8=\"\",\"\",SUM($V$4:V8))","v":18.5},{"$f":"IF(T8=\"\",\"\",SUM($V$4:V8)-SUM($T$4:T8))","v":2.5},null,{"$f":"IF(L8=\"\",\"\",COUNTIF(C8,H8))","v":0},{"$f":"IF(N8=\"\",\"\",IF(Z8=0,\"P\",\"G\"))","v":"P"},{"$f":"IF(L8=\"\",\"\",IF(AA8=\"P\",0,N8))","v":0},4,{"$f":"IF(AC8=\"\",\"\",SUM($AC$4:AC8))","v":9},0,{"$f":"IF(AC8=\"\",\"\",SUM($AE$4:AE8))","v":5.3},{"$f":"IF(AC8=\"\",\"\",SUM($AE$4:AE8)-SUM($AC$4:AC8))","v":-3.7},null,null,{"$f":"IF(L8=\"\",\"\",IF(#REF!=0,\"P\",\"G\"))","v":{"$error":"#REF!"}},{"$f":"IF(L8=\"\",\"\",IF(AJ8=\"P\",0,O8))","v":{"$error":"#REF!"}},{"$error":"#REF!"},{"$f":"IF(AL8=\"\",\"\",SUM($AL$4:AL8))","v":{"$error":"#REF!"}},{"$error":"#REF!"},{"$f":"IF(AL8=\"\",\"\",SUM($AN$4:AN8))","v":{"$error":"#REF!"}},{"$f":"IF(AL8=\"\",\"\",SUM($AN$4:AN8)-SUM($AL$4:AL8))","v":{"$error":"#REF!"}},null,{"$f":"IF(L8=\"\",\"\",COUNTIF(B8,G8))","v":1},{"$f":"IF(L8=\"\",\"\",IF(AR8=0,\"P\",\"G\"))","v":"G"},{"$f":"IF(L8=\"\",\"\",IF(AS8=\"P\",0,L8))","v":4.1},1,{"$f":"IF(AU8=\"\",\"\",SUM($AU$4:AU8))","v":16},4.1,{"$f":"IF(AU8=\"\",\"\",SUM($AW$4:AW8))","v":75.3},{"$f":"IF(AU8=\"\",\"\",SUM($AW$4:AW8)-SUM($AU$4:AU8))","v":59.3},null,{"$f":"IF(L8=\"\",\"\",COUNTIF(B8,G8))","v":1},"G",{"$f":"IF(L8=\"\",\"\",IF(BB8=\"P\",0,L8))","v":4.1},"",{"$f":"IF(BD8=\"\",\"\",SUM($BD$4:BD8))","v":""},"",{"$f":"IF(BD8=\"\",\"\",SUM($BF$4:BF8))","v":""},{"$f":"IF(BD8=\"\",\"\",SUM($BF$4:BF8)-SUM($BD$4:BD8))","v":""},null,null,1,4.1,{"$f":"IF(BK8=\"\",\"\",SUM($BL$4:BL8)-SUM($BK$4:BK8))","v":25.700000000000003}]
[null,9,11,4,3,null,2,3,11,4,12,15.5,4,3.6,4.5,null,{"$f":"IF(L9=\"\",\"\",COUNTIF(B9,G9))","v":0},{"$f":"IF(L9=\"\",\"\",IF(Q9=0,\"P\",\"G\"))","v":"P"},{"$f":"IF(L9=\"\",\"\",IF(R9=\"P\",0,M9))","v":0},1,{"$f":"IF(T9=\"\",\"\",SUM($T$4:T9))","v":17},0,{"$f":"IF(T9=\"\",\"\",SUM($V$4:V9))","v":18.5},{"$f":"IF(T9=\"\",\"\",SUM($V$4:V9)-SUM($T$4:T9))","v":1.5},null,{"$f":"IF(L9=\"\",\"\",COUNTIF(C9,H9))","v":0},{"$f":"IF(N9=\"\",\"\",IF(Z9=0,\"P\",\"G\"))","v":"P"},{"$f":"IF(L9=\"\",\"\",IF(AA9=\"P\",0,N9))","v":0},8,{"$f":"IF(AC9=\"\",\"\",SUM($AC$4:AC9))","v":17},0,{"$f":"IF(AC9=\"\",\"\",SUM($AE$4:AE9))","v":5.3},{"$f":"IF(AC9=\"\",\"\",SUM($AE$4:AE9)-SUM($AC$4:AC9))","v":-11.7},null,null,{"$f":"IF(L9=\"\",\"\",IF(#REF!=0,\"P\",\"G\"))","v":{"$error":"#REF!"}},{"$f":"IF(L9=\"\",\"\",IF(AJ9=\"P\",0,O9))","v":{"$error":"#REF!"}},{"$error":"#REF!"},{"$f":"IF(AL9=\"\",\"\",SUM($AL$4:AL9))","v":{"$error":"#REF!"}},{"$error":"#REF!"},{"$f":"IF(AL9=\"\",\"\",SUM($AN$4:AN9))","v":{"$error":"#REF!"}},{"$f":"IF(AL9=\"\",\"\",SUM($AN$4:AN9)-SUM($AL$4:AL9))","v":{"$error":"#REF!"}},null,{"$f":"IF(L9=\"\",\"\",COUNTIF(B9,G9))","v":0},{"$f":"IF(L9=\"\",\"\",IF(AR9=0,\"P\",\"G\"))","v":"P"},{"$f":"IF(L9=\"\",\"\",IF(AS9=\"P\",0,L9))","v":0},1,{"$f":"IF(AU9=\"\",\"\",SUM($AU$4:AU9))","v":17},0,{"$f":"IF(AU9=\"\",\"\",SUM($AW$4:AW9))","v":75.3},{"$f":"IF(AU9=\"\",\"\",SUM($AW$4:AW9)-SUM($AU$4:AU9))","v":58.3},null,{"$f":"IF(L9=\"\",\"\",COUNTIF(B9,G9))","v":0},"P",{"$f":"IF(L9=\"\",\"\",IF(BB9=\"P\",0,L9))","v":0},"",{"$f":"IF(BD9=\"\",\"\",SUM($BD$4:BD9))","v":""},"",{"$f":"IF(BD9=\"\",\"\",SUM($BF$4:BF9))","v":""},{"$f":"IF(BD9=\"\",\"\",SUM($BF$4:BF9)-SUM($BD$4:BD9))","v":""},null,null,1,0,{"$f":"IF(BK9=\"\",\"\",SUM($BL$4:BL9)-SUM($BK$4:BK9))","v":24.700000000000003}]
[null,9,6,3,5,null,7,5,6,3,2,14.1,4.5,2.5,2.2,null,{"$f":"IF(L10=\"\",\"\",COUNTIF(B10,G10))","v":0},{"$f":"IF(L10=\"\",\"\",IF(Q10=0,\"P\",\"G\"))","v":"P"},{"$f":"IF(L10=\"\",\"\",IF(R10=\"P\",0,M10))","v":0},2,{"$f":"IF(T10=\"\",\"\",SUM($T$4:T10))","v":19},0,{"$f":"IF(T10=\"\",\"\",SUM($V$4:V10))","v":18.5},{"$f":"IF(T10=\"\",\"\",SUM($V$4:V10)-SUM($T$4:T10))","v":-0.5},null,{"$f":"IF(L10=\"\",\"\",COUNTIF(C10,H10))","v":0},{"$f":"IF(N10=\"\",\"\",IF(Z10=0,\"P\",\"G\"))","v":"P"},{"$f":"IF(L10=\"\",\"\",IF(AA10=\"P\",0,N10))","v":0},16,{"$f":"IF(AC10=\"\",\"\",SUM($AC$4:AC10))","v":33},0,{"$f":"IF(AC10=\"\",\"\",SUM($AE$4:AE10))","v":5.3},{"$f":"IF(AC10=\"\",\"\",SUM($AE$4:AE10)-SUM($AC$4:AC10))","v":-27.7},null,null,{"$f":"IF(L10=\"\",\"\",IF(#REF!=0,\"P\",\"G\"))","v":{"$error":"#REF!"}},{"$f":"IF(L10=\"\",\"\",IF(AJ10=\"P\",0,O10))","v":{"$error":"#REF!"}},{"$error":"#REF!"},{"$f":"IF(AL10=\"\",\"\",SUM($AL$4:AL10))","v":{"$error":"#REF!"}},{"$error":"#REF!"},{"$f":"IF(AL10=\"\",\"\",SUM($AN$4:AN10))","v":{"$error":"#REF!"}},{"$f":"IF(AL10=\"\",\"\",SUM($AN$4:AN10)-SUM($AL$4:AL10))","v":{"$error":"#REF!"}},null,{"$f":"IF(L10=\"\",\"\",COUNTIF(B10,G10))","v":0},{"$f":"IF(L10=\"\",\"\",IF(AR10=0,\"P\",\"G\"))","v":"P"},{"$f":"IF(L10=\"\",\"\",IF(AS10=\"P\",0,L10))","v":0},2,{"$f":"IF(AU10=\"\",\"\",SUM($AU$4:AU10))","v":19},0,{"$f":"IF(AU10=\"\",\"\",SUM($AW$4:AW10))","v":75.3},{"$f":"IF(AU10=\"\",\"\",SUM($AW$4:AW10)-SUM($AU$4:AU10))","v":56.3},null,{"$f":"IF(L10=\"\",\"\",COUNTIF(B10,G10))","v":0},"P",{"$f":"IF(L10=\"\",\"\",IF(BB10=\"P\",0,L10))","v":0},{"$f":"IF(BB10=\"\",\"\",IF(BC9<>0,\"\",IF(OR(ISTEXT(BD9),AND(BH9>0,BB9=\"G\")),1,IF(BF9=0,BD9*2,1))))","v":1},{"$f":"IF(BD10=\"\",\"\",SUM($BD$4:BD10))","v":16},0,{"$f":"IF(BD10=\"\",\"\",SUM($BF$4:BF10))","v":71.2},{"$f":"IF(BD10=\"\",\"\",SUM($BF$4:BF10)-SUM($BD$4:BD10))","v":55.2},null,null,4,0,{"$f":"IF(BK10=\"\",\"\",SUM($BL$4:BL10)-SUM($BK$4:BK10))","v":20.700000000000003}]
[{"$nulls":16},{"$f":"IF(L11=\"\",\"\",COUNTIF(B11,G11))","v":""},{"$f":"IF(L11=\"\",\"\",IF(Q11=0,\"P\",\"G\"))","v":""},{"$f":"IF(L11=\"\",\"\",IF(R11=\"P\",0,M11))","v":""},"",{"$f":"IF(T11=\"\",\"\",SUM($T$4:T11))","v":""},"",{"$f":"IF(T11=\"\",\"\",SUM($V$4:V11))","v":""},{"$f":"IF(T11=\"\",\"\",SUM($V$4:V11)-SUM($T$4:T11))","v":""},null,{"$f":"IF(L11=\"\",\"\",COUNTIF(C11,H11))","v":""},{"$f":"IF(N11=\"\",\"\",IF(Z11=0,\"P\",\"G\"))","v":""},{"$f":"IF(L11=\"\",\"\",IF(AA11=\"P\",0,N11))","v":""},"",{"$f":"IF(AC11=\"\",\"\",SUM($AC$4:AC11))","v":""},"",{"$f":"IF(AC11=\"\",\"\",SUM($AE$4:AE11))","v":""},{"$f":"IF(AC11=\"\",\"\",SUM($AE$4:AE11)-SUM($AC$4:AC11))","v":""},null,null,{"$f":"IF(L11=\"\",\"\",IF(#REF!=0,\"P\",\"G\"))","v":""},{"$f":"IF(L11=\"\",\"\",IF(AJ11=\"P\",0,O11))","v":""},"",{"$f":"IF(AL11=\"\",\"\",SUM($AL$4:AL11))","v":""},"",{"$f":"IF(AL11=\"\",\"\",SUM($AN$4:AN11))","v":""},{"$f":"IF(AL11=\"\",\"\",SUM($AN$4:AN11)-SUM($AL$4:AL11))","v":""},null,{"$f":"IF(L11=\"\",\"\",COUNTIF(B11,G11))","v":""},{"$f":"IF(L11=\"\",\"\",IF(AR11=0,\"P\",\"G\"))","v":""},{"$f":"IF(L11=\"\",\"\",IF(AS11=\"P\",0,L11))","v":""},"",{"$f":"IF(AU11=\"\",\"\",SUM($AU$4:AU11))","v":""},"",{"$f":"IF(AU11=\"\",\"\",SUM($AW$4:AW11))","v":""},{"$f":"IF(AU11=\"\",\"\",SUM($AW$4:AW11)-SUM($AU$4:AU11))","v":""},null,{"$f":"IF(L11=\"\",\"\",COUNTIF(B11,G11))","v":""},"",{"$f":"IF(L11=\"\",\"\",IF(BB11=\"P\",0,L11))","v":""},"",{"$f":"IF(BD11=\"\",\"\",SUM($BD$4:BD11))","v":""},"",{"$f":"IF(BD11=\"\",\"\",SUM($BF$4:BF11))","v":""},{"$f":"IF(BD11=\"\",\"\",SUM($BF$4:BF11)-SUM($BD$4:BD11))","v":""},null,null,"","",{"$f":"IF(BK11=\"\",\"\",SUM($BL$4:BL11)-SUM($BK$4:BK11))","v":""}]
["2014-12-16",1,6,8,12,null,1,9,10,13,15,4.3,2.3,2.4,3.5,null,{"$f":"IF(L12=\"\",\"\",COUNTIF(B12,G12))","v":1},{"$f":"IF(L12=\"\",\"\",IF(Q12=0,\"P\",\"G\"))","v":"G"},{"$f":"IF(L12=\"\",\"\",IF(R12=\"P\",0,M12))","v":2.3},1,{"$f":"IF(T12=\"\",\"\",SUM($T$4:T12))","v":20},2.3,{"$f":"IF(T12=\"\",\"\",SUM($V$4:V12))","v":20.8},{"$f":"IF(T12=\"\",\"\",SUM($V$4:V12)-SUM($T$4:T12))","v":0.8000000000000007},{"$nulls":11},{"$f":"IF(L12=\"\",\"\",IF(#REF!=0,\"P\",\"G\"))","v":{"$error":"#REF!"}},{"$f":"IF(L12=\"\",\"\",IF(AJ12=\"P\",0,O12))","v":{"$error":"#REF!"}},{"$error":"#REF!"},{"$f":"IF(AL12=\"\",\"\",SUM($AL$4:AL12))","v":{"$error":"#REF!"}},{"$error":"#REF!"},{"$f":"IF(AL12=\"\",\"\",SUM($AN$4:AN12))","v":{"$error":"#REF!"}},{"$f":"IF(AL12=\"\",\"\",SUM($AN$4:AN12)-SUM($AL$4:AL12))","v":{"$error":"#REF!"}},null,{"$f":"IF(L12=\"\",\"\",COUNTIF(B12,G12))","v":1},{"$f":"IF(L12=\"\",\"\",IF(AR12=0,\"P\",\"G\"))","v":"G"},{"$f":"IF(L12=\"\",\"\",IF(AS12=\"P\",0,L12))","v":4.3},1,{"$f":"IF(AU12=\"\",\"\",SUM($AU$4:AU12))","v":20},4.3,{"$f":"IF(AU12=\"\",\"\",SUM($AW$4:AW12))","v":79.6},{"$f":"IF(AU12=\"\",\"\",SUM($AW$4:AW12)-SUM($AU$4:AU12))","v":59.599999999999994},null,{"$f":"IF(L12=\"\",\"\",COUNTIF(B12,G12))","v":1},"G",{"$f":"IF(L12=\"\",\"\",IF(BB12=\"P\",0,L12))","v":4.3},"",{"$f":"IF(BD12=\"\",\"\",SUM($BD$4:BD12))","v":""},"",{"$f":"IF(BD12=\"\",\"\",SUM($BF$4:BF12))","v":""},{"$f":"IF(BD12=\"\",\"\",SUM($BF$4:BF12)-SUM($BD$4:BD12))","v":""},null,null,1,4.3,{"$f":"IF(BK12=\"\",\"\",SUM($BL$4:BL12)-SUM($BK$4:BK12))","v":24}]
["PAU",10,9,12,3,null,3,1,4,10,12,8,2.9,4.7,4.3,null,{"$f":"IF(L13=\"\",\"\",COUNTIF(B13,G13))","v":0},{"$f":"IF(L13=\"\",\"\",IF(Q13=0,\"P\",\"G\"))","v":"P"},{"$f":"IF(L13=\"\",\"\",IF(R13=\"P\",0,M13))","v":0},1,{"$f":"IF(T13=\"\",\"\",SUM($T$4:T13))","v":21},0,{"$f":"IF(T13=\"\",\"\",SUM($V$4:V13))","v":20.8},{"$f":"IF(T13=\"\",\"\",SUM($V$4:V13)-SUM($T$4:T13))","v":-0.1999999999999993},{"$nulls":11},{"$f":"IF(L13=\"\",\"\",IF(#REF!=0,\"P\",\"G\"))","v":{"$error":"#REF!"}},{"$f":"IF(L13=\"\",\"\",IF(AJ13=\"P\",0,O13))","v":{"$error":"#REF!"}},{"$error":"#REF!"},{"$f":"IF(AL13=\"\",\"\",SUM($AL$4:AL13))","v":{"$error":"#REF!"}},{"$error":"#REF!"},{"$f":"IF(AL13=\"\",\"\",SUM($AN$4:AN13))","v":{"$error":"#REF!"}},{"$f":"IF(AL13=\"\",\"\",SUM($AN$4:AN13)-SUM($AL$4:AL13))","v":{"$error":"#REF!"}},null,{"$f":"IF(L13=\"\",\"\",COUNTIF(B13,G13))","v":0},{"$f":"IF(L13=\"\",\"\",IF(AR13=0,\"P\",\"G\"))","v":"P"},{"$f":"IF(L13=\"\",\"\",IF(AS13=\"P\",0,L13))","v":0},1,{"$f":"IF(AU13=\"\",\"\",SUM($AU$4:AU13))","v":21},0,{"$f":"IF(AU13=\"\",\"\",SUM($AW$4:AW13))","v":79.6},{"$f":"IF(AU13=\"\",\"\",SUM($AW$4:AW13)-SUM($AU$4:AU13))","v":58.599999999999994},null,{"$f":"IF(L13=\"\",\"\",COUNTIF(B13,G13))","v":0},"P",{"$f":"IF(L13=\"\",\"\",IF(BB13=\"P\",0,L13))","v":0},"",{"$f":"IF(BD13=\"\",\"\",SUM($BD$4:BD13))","v":""},"",{"$f":"IF(BD13=\"\",\"\",SUM($BF$4:BF13))","v":""},{"$f":"IF(BD13=\"\",\"\",SUM($BF$4:BF13)-SUM($BD$4:BD13))","v":""},null,null,1,0,{"$f":"IF(BK13=\"\",\"\",SUM($BL$4:BL13)-SUM($BK$4:BK13))","v":23}]
[null,9,5,2,1,null,9,7,11,15,14,3.5,1.5,3.5,2.7,null,{"$f":"IF(L14=\"\",\"\",COUNTIF(B14,G14))","v":1},{"$f":"IF(L14=\"\",\"\",IF(Q14=0,\"P\",\"G\"))","v":"G"},{"$f":"IF(L14=\"\",\"\",IF(R14=\"P\",0,M14))","v":1.5},2,{"$f":"IF(T14=\"\",\"\",SUM($T$4:T14))","v":23},3,{"$f":"IF(T14=\"\",\"\",SUM($V$4:V14))","v":23.8},{"$f":"IF(T14=\"\",\"\",SUM($V$4:V14)-SUM($T$4:T14))","v":0.8000000000000007},{"$nulls":11},{"$f":"IF(L14=\"\",\"\",IF(#REF!=0,\"P\",\"G\"))","v":{"$error":"#REF!"}},{"$f":"IF(L14=\"\",\"\",IF(AJ14=\"P\",0,O14))","v":{"$error":"#REF!"}},{"$error":"#REF!"},{"$f":"IF(AL14=\"\",\"\",SUM($AL$4:AL14))","v":{"$error":"#REF!"}},{"$error":"#REF!"},{"$f":"IF(AL14=\"\",\"\",SUM($AN$4:AN14))","v":{"$error":"#REF!"}},{"$f":"IF(AL14=\"\",\"\",SUM($AN$4:AN14)-SUM($AL$4:AL14))","v":{"$error":"#REF!"}},null,{"$f":"IF(L14=\"\",\"\",COUNTIF(B14,G14))","v":1},{"$f":"IF(L14=\"\",\"\",IF(AR14=0,\"P\",\"G\"))","v":"G"},{"$f":"IF(L14=\"\",\"\",IF(AS14=\"P\",0,L14))","v":3.5},2,{"$f":"IF(AU14=\"\",\"\",SUM($AU$4:AU14))","v":23},7,{"$f":"IF(AU14=\"\",\"\",SUM($AW$4:AW14))","v":86.6},{"$f":"IF(AU14=\"\",\"\",SUM($AW$4:AW14)-SUM($AU$4:AU14))","v":63.599999999999994},null,{"$f":"IF(L14=\"\",\"\",COUNTIF(B14,G14))","v":1},"G",{"$f":"IF(L14=\"\",\"\",IF(BB14=\"P\",0,L14))","v":3.5},1,{"$f":"IF(BD14=\"\",\"\",SUM($BD$4:BD14))","v":17},3.5,{"$f":"IF(BD14=\"\",\"\",SUM($BF$4:BF14))","v":74.7},{"$f":"IF(BD14=\"\",\"\",SUM($BF$4:BF14)-SUM($BD$4:BD14))","v":57.7},null,null,4,14,{"$f":"IF(BK14=\"\",\"\",SUM($BL$4:BL14)-SUM($BK$4:BK14))","v":33}]
[null,3,6,12,10,null,3,6,12,4,8,2.8,1.3,1.5,2,null,{"$f":"IF(L15=\"\",\"\",COUNTIF(B15,G15))","v":1},{"$f":"IF(L15=\"\",\"\",IF(Q15=0,\"P\",\"G\"))","v":"G"},{"$f":"IF(L15=\"\",\"\",IF(R15=\"P\",0,M15))","v":1.3},1,{"$f":"IF(T15=\"\",\"\",SUM($T$4:T15))","v":24},1.3,{"$f":"IF(T15=\"\",\"\",SUM($V$4:V15))","v":25.1},{"$f":"IF(T15=\"\",\"\",SUM($V$4:V15)-SUM($T$4:T15))","v":1.1000000000000014},{"$nulls":11},{"$f":"IF(L15=\"\",\"\",IF(#REF!=0,\"P\",\"G\"))","v":{"$error":"#REF!"}},{"$f":"IF(L15=\"\",\"\",IF(AJ15=\"P\",0,O15))","v":{"$error":"#REF!"}},{"$error":"#REF!"},{"$f":"IF(AL15=\"\",\"\",SUM($AL$4:AL15))","v":{"$error":"#REF!"}},{"$error":"#REF!"},{"$f":"IF(AL15=\"\",\"\",SUM($AN$4:AN15))","v":{"$error":"#REF!"}},{"$f":"IF(AL15=\"\",\"\",SUM($AN$4:AN15)-SUM($AL$4:AL15))","v":{"$error":"#REF!"}},null,{"$f":"IF(L15=\"\",\"\",COUNTIF(B15,G15))","v":1},{"$f":"IF(L15=\"\",\"\",IF(AR15=0,\"P\",\"G\"))","v":"G"},{"$f":"IF(L15=\"\",\"\",IF(AS15=\"P\",0,L15))","v":2.8},1,{"$f":"IF(AU15=\"\",\"\",SUM($AU$4:AU15))","v":24},2.8,{"$f":"IF(AU15=\"\",\"\",SUM($AW$4:AW15))","v":89.39999999999999},{"$f":"IF(AU15=\"\",\"\",SUM($AW$4:AW15)-SUM($AU$4:AU15))","v":65.39999999999999},null,{"$f":"IF(L15=\"\",\"\",COUNTIF(B15,G15))","v":1},"G",{"$f":"IF(L15=\"\",\"\",IF(BB15=\"P\",0,L15))","v":2.8},"",{"$f":"IF(BD15=\"\",\"\",SUM($BD$4:BD15))","v":""},"",{"$f":"IF(BD15=\"\",\"\",SUM($BF$4:BF15))","v":""},{"$f":"IF(BD15=\"\",\"\",SUM($BF$4:BF15)-SUM($BD$4:BD15))","v":""},null,null,1,2.8,{"$f":"IF(BK15=\"\",\"\",SUM($BL$4:BL15)-SUM($BK$4:BK15))","v":34.8}]
[null,2,3,11,12,null,12,2,11,4,13,11.7,2.6,1.5,6.4,null,{"$f":"IF(L16=\"\",\"\",COUNTIF(B16,G16))","v":0},{"$f":"IF(L16=\"\",\"\",IF(Q16=0,\"P\",\"G\"))","v":"P"},{"$f":"IF(L16=\"\",\"\",IF(R16=\"P\",0,M16))","v":0},1,{"$f":"IF(T16=\"\",\"\",SUM($T$4:T16))","v":25},0,{"$f":"IF(T16=\"\",\"\",SUM($V$4:V16))","v":25.1},{"$f":"IF(T16=\"\",\"\",SUM($V$4:V16)-SUM($T$4:T16))","v":0.10000000000000142},{"$nulls":11},{"$f":"IF(L16=\"\",\"\",IF(#REF!=0,\"P\",\"G\"))","v":{"$error":"#REF!"}},{"$f":"IF(L16=\"\",\"\",IF(AJ16=\"P\",0,O16))","v":{"$error":"#REF!"}},{"$error":"#REF!"},{"$f":"IF(AL16=\"\",\"\",SUM($AL$4:AL16))","v":{"$error":"#REF!"}},{"$error":"#REF!"},{"$f":"IF(AL16=\"\",\"\",SUM($AN$4:AN16))","v":{"$error":"#REF!"}},{"$f":"IF(AL16=\"\",\"\",SUM($AN$4:AN16)-SUM($AL$4:AL16))","v":{"$error":"#REF!"}},null,{"$f":"IF(L16=\"\",\"\",COUNTIF(B16,G16))","v":0},{"$f":"IF(L16=\"\",\"\",IF(AR16=0,\"P\",\"G\"))","v":"P"},{"$f":"IF(L16=\"\",\"\",IF(AS16=\"P\",0,L16))","v":0},1,{"$f":"IF(AU16=\"\",\"\",SUM($AU$4:AU16))","v":25},0,{"$f":"IF(AU16=\"\",\"\",SUM($AW$4:AW16))","v":89.39999999999999},{"$f":"IF(AU16=\"\",\"\",SUM($AW$4:AW16)-SUM($AU$4:AU16))","v":64.39999999999999},null,{"$f":"IF(L16=\"\",\"\",COUNTIF(B16,G16))","v":0},"P",{"$f":"IF(L16=\"\",\"\",IF(BB16=\"P\",0,L16))","v":0},"",{"$f":"IF(BD16=\"\",\"\",SUM($BD$4:BD16))","v":""},"",{"$f":"IF(BD16=\"\",\"\",SUM($BF$4:BF16))","v":""},{"$f":"IF(BD16=\"\",\"\",SUM($BF$4:BF16)-SUM($BD$4:BD16))","v":""},null,null,1,0,{"$f":"IF(BK16=\"\",\"\",SUM($BL$4:BL16)-SUM($BK$4:BK16))","v":33.8}]
[null,2,5,7,3,null,2,9,1,6,13,10.7,3.1,2.2,2.5,null,{"$f":"IF(L17=\"\",\"\",COUNTIF(B17,G17))","v":1},{"$f":"IF(L17=\"\",\"\",IF(Q17=0,\"P\",\"G\"))","v":"G"},{"$f":"IF(L17=\"\",\"\",IF(R17=\"P\",0,M17))","v":3.1},2,{"$f":"IF(T17=\"\",\"\",SUM($T$4:T17))","v":27},6.2,{"$f":"IF(T17=\"\",\"\",SUM($V$4:V17))","v":31.3},{"$f":"IF(T17=\"\",\"\",SUM($V$4:V17)-SUM($T$4:T17))","v":4.300000000000001},{"$nulls":11},{"$f":"IF(L17=\"\",\"\",IF(#REF!=0,\"P\",\"G\"))","v":{"$error":"#REF!"}},{"$f":"IF(L17=\"\",\"\",IF(AJ17=\"P\",0,O17))","v":{"$error":"#REF!"}},{"$error":"#REF!"},{"$f":"IF(AL17=\"\",\"\",SUM($AL$4:AL17))","v":{"$error":"#REF!"}},{"$error":"#REF!"},{"$f":"IF(AL17=\"\",\"\",SUM($AN$4:AN17))","v":{"$error":"#REF!"}},{"$f":"IF(AL17=\"\",\"\",SUM($AN$4:AN17)-SUM($AL$4:AL17))","v":{"$error":"#REF!"}},null,{"$f":"IF(L17=\"\",\"\",COUNTIF(B17,G17))","v":1},{"$f":"IF(L17=\"\",\"\",IF(AR17=0,\"P\",\"G\"))","v":"G"},{"$f":"IF(L17=\"\",\"\",IF(AS17=\"P\",0,L17))","v":10.7},2,{"$f":"IF(AU17=\"\",\"\",SUM($AU$4:AU17))","v":27},21.4,{"$f":"IF(AU17=\"\",\"\",SUM($AW$4:AW17))","v":110.79999999999998},{"$f":"IF(AU17=\"\",\"\",SUM($AW$4:AW17)-SUM($AU$4:AU17))","v":83.79999999999998},null,{"$f":"IF(L17=\"\",\"\",COUNTIF(B17,G17))","v":1},"G",{"$f":"IF(L17=\"\",\"\",IF(BB17=\"P\",0,L17))","v":10.7},1,{"$f":"IF(BD17=\"\",\"\",SUM($BD$4:BD17))","v":18},10.7,{"$f":"IF(BD17=\"\",\"\",SUM($BF$4:BF17))","v":85.4},{"$f":"IF(BD17=\"\",\"\",SUM($BF$4:BF17)-SUM($BD$4:BD17))","v":67.4},null,null,4,42.8,{"$f":"IF(BK17=\"\",\"\",SUM($BL$4:BL17)-SUM($BK$4:BK17))","v":72.6}]
[null,5,6,4,2,null,12,9,2,3,10,14.5,4.4,4.4,2.6,null,{"$f":"IF(L18=\"\",\"\",COUNTIF(B18,G18))","v":0},{"$f":"IF(L18=\"\",\"\",IF(Q18=0,\"P\",\"G\"))","v":"P"},{"$f":"IF(L18=\"\",\"\",IF(R18=\"P\",0,M18))","v":0},1,{"$f":"IF(T18=\"\",\"\",SUM($T$4:T18))","v":28},0,{"$f":"IF(T18=\"\",\"\",SUM($V$4:V18))","v":31.3},{"$f":"IF(T18=\"\",\"\",SUM($V$4:V18)-SUM($T$4:T18))","v":3.3000000000000007},{"$nulls":11},{"$f":"IF(L18=\"\",\"\",IF(#REF!=0,\"P\",\"G\"))","v":{"$error":"#REF!"}},{"$f":"IF(L18=\"\",\"\",IF(AJ18=\"P\",0,O18))","v":{"$error":"#REF!"}},{"$error":"#REF!"},{"$f":"IF(AL18=\"\",\"\",SUM($AL$4:AL18))","v":{"$error":"#REF!"}},{"$error":"#REF!"},{"$f":"IF(AL18=\"\",\"\",SUM($AN$4:AN18))","v":{"$error":"#REF!"}},{"$f":"IF(AL18=\"\",\"\",SUM($AN$4:AN18)-SUM($AL$4:AL18))","v":{"$error":"#REF!"}},null,{"$f":"IF(L18=\"\",\"\",COUNTIF(B18,G18))","v":0},{"$f":"IF(L18=\"\",\"\",IF(AR18=0,\"P\",\"G\"))","v":"P"},{"$f":"IF(L18=\"\",\"\",IF(AS18=\"P\",0,L18))","v":0},1,{"$f":"IF(AU18=\"\",\"\",SUM($AU$4:AU18))","v":28},0,{"$f":"IF(AU18=\"\",\"\",SUM($AW$4:AW18))","v":110.79999999999998},{"$f":"IF(AU18=\"\",\"\",SUM($AW$4:AW18)-SUM($AU$4:AU18))","v":82.79999999999998},null,{"$f":"IF(L18=\"\",\"\",COUNTIF(B18,G18))","v":0},"P",{"$f":"IF(L18=\"\",\"\",IF(BB18=\"P\",0,L18))","v":0},"",{"$f":"IF(BD18=\"\",\"\",SUM($BD$4:BD18))","v":""},"",{"$f":"IF(BD18=\"\",\"\",SUM($BF$4:BF18))","v":""},{"$f":"IF(BD18=\"\",\"\",SUM($BF$4:BF18)-SUM($BD$4:BD18))","v":""},null,null,1,0,{"$f":"IF(BK18=\"\",\"\",SUM($BL$4:BL18)-SUM($BK$4:BK18))","v":71.6}]
[null,12,2,8,11,null,14,11,8,10,3,23.1,5,1.8,2.9,null,{"$f":"IF(L19=\"\",\"\",COUNTIF(B19,G19))","v":0},{"$f":"IF(L19=\"\",\"\",IF(Q19=0,\"P\",\"G\"))","v":"P"},{"$f":"IF(L19=\"\",\"\",IF(R19=\"P\",0,M19))","v":0},2,{"$f":"IF(T19=\"\",\"\",SUM($T$4:T19))","v":30},0,{"$f":"IF(T19=\"\",\"\",SUM($V$4:V19))","v":31.3},{"$f":"IF(T19=\"\",\"\",SUM($V$4:V19)-SUM($T$4:T19))","v":1.3000000000000007},{"$nulls":11},{"$f":"IF(L19=\"\",\"\",IF(#REF!=0,\"P\",\"G\"))","v":{"$error":"#REF!"}},{"$f":"IF(L19=\"\",\"\",IF(AJ19=\"P\",0,O19))","v":{"$error":"#REF!"}},{"$error":"#REF!"},{"$f":"IF(AL19=\"\",\"\",SUM($AL$4:AL19))","v":{"$error":"#REF!"}},{"$error":"#REF!"},{"$f":"IF(AL19=\"\",\"\",SUM($AN$4:AN19))","v":{"$error":"#REF!"}},{"$f":"IF(AL19=\"\",\"\",SUM($AN$4:AN19)-SUM($AL$4:AL19))","v":{"$error":"#REF!"}},null,{"$f":"IF(L19=\"\",\"\",COUNTIF(B19,G19))","v":0},{"$f":"IF(L19=\"\",\"\",IF(AR19=0,\"P\",\"G\"))","v":"P"},{"$f":"IF(L19=\"\",\"\",IF(AS19=\"P\",0,L19))","v":0},2,{"$f":"IF(AU19=\"\",\"\",SUM($AU$4:AU19))","v":30},0,{"$f":"IF(AU19=\"\",\"\",SUM($AW$4:AW19))","v":110.79999999999998},{"$f":"IF(AU19=\"\",\"\",SUM($AW$4:AW19)-SUM($AU$4:AU19))","v":80.79999999999998},null,{"$f":"IF(L19=\"\",\"\",COUNTIF(B19,G19))","v":0},"P",{"$f":"IF(L19=\"\",\"\",IF(BB19=\"P\",0,L19))","v":0},1,{"$f":"IF(BD19=\"\",\"\",SUM($BD$4:BD19))","v":19},0,{"$f":"IF(BD19=\"\",\"\",SUM($BF$4:BF19))","v":85.4},{"$f":"IF(BD19=\"\",\"\",SUM($BF$4:BF19)-SUM($BD$4:BD19))","v":66.4},null,null,4,0,{"$f":"IF(BK19=\"\",\"\",SUM($BL$4:BL19)-SUM($BK$4:BK19))","v":67.6}]
[{"$nulls":16},{"$f":"IF(L20=\"\",\"\",COUNTIF(B20,G20))","v":""},{"$f":"IF(L20=\"\",\"\",IF(Q20=0,\"P\",\"G\"))","v":""},{"$f":"IF(L20=\"\",\"\",IF(R20=\"P\",0,M20))","v":""},"",{"$f":"IF(T20=\"\",\"\",SUM($T$4:T20))","v":""},"",{"$f":"IF(T20=\"\",\"\",SUM($V$4:V20))","v":""},{"$f":"IF(T20=\"\",\"\",SUM($V$4:V20)-SUM($T$4:T20))","v":""},{"$nulls":11},{"$f":"IF(L20=\"\",\"\",IF(#REF!=0,\"P\",\"G\"))","v":""},{"$f":"IF(L20=\"\",\"\",IF(AJ20=\"P\",0,O20))","v":""},"",{"$f":"IF(AL20=\"\",\"\",SUM($AL$4:AL20))","v":""},"",{"$f":"IF(AL20=\"\",\"\",SUM($AN$4:AN20))","v":""},{"$f":"IF(AL20=\"\",\"\",SUM($AN$4:AN20)-SUM($AL$4:AL20))","v":""},null,{"$f":"IF(L20=\"\",\"\",COUNTIF(B20,G20))","v":""},{"$f":"IF(L20=\"\",\"\",IF(AR20=0,\"P\",\"G\"))","v":""},{"$f":"IF(L20=\"\",\"\",IF(AS20=\"P\",0,L20))","v":""},"",{"$f":"IF(AU20=\"\",\"\",SUM($AU$4:AU20))","v":""},"",{"$f":"IF(AU20=\"\",\"\",SUM($AW$4:AW20))","v":""},{"$f":"IF(AU20=\"\",\"\",SUM($AW$4:AW20)-SUM($AU$4:AU20))","v":""},null,{"$f":"IF(L20=\"\",\"\",COUNTIF(B20,G20))","v":""},"",{"$f":"IF(L20=\"\",\"\",IF(BB20=\"P\",0,L20))","v":""},"",{"$f":"IF(BD20=\"\",\"\",SUM($BD$4:BD20))","v":""},"",{"$f":"IF(BD20=\"\",\"\",SUM($BF$4:BF20))","v":""},{"$f":"IF(BD20=\"\",\"\",SUM($BF$4:BF20)-SUM($BD$4:BD20))","v":""},null,null,"","",{"$f":"IF(BK20=\"\",\"\",SUM($BL$4:BL20)-SUM($BK$4:BK20))","v":""}]
["2014-12-17",4,9,8,10,null,9,4,15,2,5,5.8,2.6,2,8.7,null,{"$f":"IF(L21=\"\",\"\",COUNTIF(B21,G21))","v":0},{"$f":"IF(L21=\"\",\"\",IF(Q21=0,\"P\",\"G\"))","v":"P"},{"$f":"IF(L21=\"\",\"\",IF(R21=\"P\",0,M21))","v":0},1,{"$f":"IF(T21=\"\",\"\",SUM($T$4:T21))","v":31},0,{"$f":"IF(T21=\"\",\"\",SUM($V$4:V21))","v":31.3},{"$f":"IF(T21=\"\",\"\",SUM($V$4:V21)-SUM($T$4:T21))","v":0.3000000000000007},{"$nulls":11},{"$f":"IF(L21=\"\",\"\",IF(#REF!=0,\"P\",\"G\"))","v":{"$error":"#REF!"}},{"$f":"IF(L21=\"\",\"\",IF(AJ21=\"P\",0,O21))","v":{"$error":"#REF!"}},{"$error":"#REF!"},{"$f":"IF(AL21=\"\",\"\",SUM($AL$4:AL21))","v":{"$error":"#REF!"}},{"$error":"#REF!"},{"$f":"IF(AL21=\"\",\"\",SUM($AN$4:AN21))","v":{"$error":"#REF!"}},{"$f":"IF(AL21=\"\",\"\",SUM($AN$4:AN21)-SUM($AL$4:AL21))","v":{"$error":"#REF!"}},null,{"$f":"IF(L21=\"\",\"\",COUNTIF(B21,G21))","v":0},{"$f":"IF(L21=\"\",\"\",IF(AR21=0,\"P\",\"G\"))","v":"P"},{"$f":"IF(L21=\"\",\"\",IF(AS21=\"P\",0,L21))","v":0},1,{"$f":"IF(AU21=\"\",\"\",SUM($AU$4:AU21))","v":31},0,{"$f":"IF(AU21=\"\",\"\",SUM($AW$4:AW21))","v":110.79999999999998},{"$f":"IF(AU21=\"\",\"\",SUM($AW$4:AW21)-SUM($AU$4:AU21))","v":79.79999999999998},null,{"$f":"IF(L21=\"\",\"\",COUNTIF(B21,G21))","v":0},"P",{"$f":"IF(L21=\"\",\"\",IF(BB21=\"P\",0,L21))","v":0},"",{"$f":"IF(BD21=\"\",\"\",SUM($BD$4:BD21))","v":""},"",{"$f":"IF(BD21=\"\",\"\",SUM($BF$4:BF21))","v":""},{"$f":"IF(BD21=\"\",\"\",SUM($BF$4:BF21)-SUM($BD$4:BD21))","v":""},null,null,1,0,{"$f":"IF(BK21=\"\",\"\",SUM($BL$4:BL21)-SUM($BK$4:BK21))","v":66.6}]