{"text_format":"3","workbook":"xlsx","n_sheets":9,"sheets":["Sommaire","Programme","Jours_fériés","Congés","Calendrier_annuel_2018","Calendrier_annuel_2019","Calendrier_annuel_2020","Calendrier_mensuel_2018","Légende"],"not_rendered":{"macros":1,"defined_names":4},"read":"whole","date_system":"1900"}

{"sheet":"Sommaire","index":0,"n_rows":0,"n_cols":0,"rows_kept":0,"hidden":true}

{"sheet":"Programme","index":1,"n_rows":32,"n_cols":5,"rows_kept":32,"hidden":true,"merged":[[0,0,0,4],[27,0,27,2],[31,0,31,4]]}
["1ère année"]
["N°","Intervenant",null,"Heures","Coeff"]
[null,null,"Stratégie et Gestion des entreprises :",{"$f":"SUM(D4:D6)","v":70},{"$f":"SUM(E4:E6)","v":3}]
["UE1.1",null,"Stratégie des entreprises",21,1]
["UE1.2",null,"Gestion des entreprises",28,1]
["UE1.3",null,"Gestion des talents",21,1]
[null,null,"Politiques Ressources Humaines :",{"$f":"SUM(D8:D11)","v":98},{"$f":"SUM(E8:E11)","v":4}]
["UE2.1",null,"Politique de gestion de l'emploi",28,1]
["UE2.2",null,"Politique de formation",28,1]
["UE2.3",null,"Management des compétences",21,1]
["UE2.4",null,"Paie approfondi",21,1]
[null,null,"Méthodologie :",{"$f":"SUM(D13:D14)","v":56},{"$f":"SUM(E13:E14)","v":1}]
["UE3.1",null,"Anglais",35,1]
["UE3.2",null,"Conférence métiers",21,0]
[null,null,"Environnement juridique et social :",{"$f":"SUM(D16:D19)","v":84},{"$f":"SUM(E16:E19)","v":4}]
["UE4.1",null,"Droit du travail",21,1]
["UE4.2",null,"Protection sociale complémentaire et rémunérations indirectes",21,1]
["UE4.3",null,"Relations professionnelles",21,1]
["UE4.4",null,"Santé et sécurité au travail",21,1]
[null,null,"Systèmes d'Information RH :",{"$f":"SUM(D21:D24)","v":91},{"$f":"SUM(E21:E24)","v":4}]
{"$rows_left_out":13}
{"sheet":"Jours_fériés","index":2,"n_rows":16,"n_cols":5,"rows_kept":16,"hidden":true,"merged":[[1,2,1,4]]}
[]
[null,null,"Jour fériés en France"]
[]
[null,null,2018,2019,2020]
[null,null,1,2,3]
[null,"Jour de l'an","2018-01-01","2019-01-01","2020-01-01"]
[null,"Lundi de Pâques","2018-04-02","2019-04-22","2020-04-13"]
[null,"Fête du Travail","2018-05-01","2019-05-01","2020-05-01"]
[null,"2018-05-08","2018-05-08","2019-05-08","2020-05-08"]
[null,"Jeudi de l'Ascension","2018-05-10","2019-05-30","2019-05-21"]
[null,"Lundi de Pentecôte","2018-05-21","2019-06-10","2020-06-01"]
[null,"Fête Nationale","2018-07-14","2019-07-14","2020-07-14"]
[null,"Assomption","2018-08-15","2019-08-15","2020-08-15"]
[null,"La Toussaint","2018-11-01","2019-11-01","2020-11-01"]
[null,"Armistice","2018-11-11","2019-11-11","2020-11-11"]
[null,"Noël","2018-12-25","2019-12-25","2020-12-25"]

{"sheet":"Congés","index":3,"n_rows":0,"n_cols":0,"rows_kept":0,"hidden":true}

{"sheet":"Calendrier_annuel_2018","index":4,"n_rows":56,"n_cols":12,"rows_kept":56,"hidden":true,"merged":[[9,0,9,2],[9,3,9,5],[9,6,9,8],[9,9,9,11]]}
{"$rows_empty":9}
["Septembre",null,null,"Octobre",null,null,"Novembre",null,null,"Décembre"]
["Jour","Cours","Commentaires","Jour","Cours","Commentaires","Jour","Cours","Commentaires","Jour","Cours","Commentaires"]
["2018-09-01",null,null,"2018-10-01",null,null,"2018-11-01",null,null,"2018-12-01"]
["2018-09-02",null,null,"2018-10-02",null,null,"2018-11-02",null,null,"2018-12-02"]
["2018-09-03",null,null,"2018-10-03",null,null,"2018-11-03",null,null,"2018-12-03"]
["2018-09-04",null,null,"2018-10-04",null,null,"2018-11-04",null,null,"2018-12-04"]
["2018-09-05",null,null,"2018-10-05",null,null,"2018-11-05",null,null,"2018-12-05"]
["2018-09-06",null,null,"2018-10-06",null,null,"2018-11-06",null,null,"2018-12-06"]
["2018-09-07",null,null,"2018-10-07",null,null,"2018-11-07",null,null,"2018-12-07"]
["2018-09-08",null,null,"2018-10-08",null,null,"2018-11-08",null,null,"2018-12-08"]
["2018-09-09",null,null,"2018-10-09",null,null,"2018-11-09",null,null,"2018-12-09"]
["2018-09-10",null,null,"2018-10-10",null,null,"2018-11-10",null,null,"2018-12-10"]
["2018-09-11",null,null,"2018-10-11",null,null,"2018-11-11",null,null,"2018-12-11"]
["2018-09-12",null,null,"2018-10-12",null,null,"2018-11-12",null,null,"2018-12-12"]
["2018-09-13",null,null,"2018-10-13",null,null,"2018-11-13",null,null,"2018-12-13"]
["2018-09-14",null,null,"2018-10-14",null,null,"2018-11-14",null,null,"2018-12-14"]
["2018-09-15",null,null,"2018-10-15",null,null,"2018-11-15",null,null,"2018-12-15"]
["2018-09-16",null,null,"2018-10-16",null,null,"2018-11-16",null,null,"2018-12-16"]
["2018-09-17",null,null,"2018-10-17",null,null,"2018-11-17",null,null,"2018-12-17"]
{"$rows_left_out":29}
{"sheet":"Calendrier_annuel_2019","index":5,"n_rows":56,"n_cols":36,"rows_kept":56,"hidden":true,"merged":[[9,0,9,2],[9,3,9,5],[9,6,9,8],[9,9,9,11],[9,12,9,14],[9,15,9,17],[9,18,9,20],[9,21,9,23],[9,24,9,26],[9,27,9,29],[9,30,9,32],[9,33,9,35]]}
{"$rows_empty":9}
["Janvier",null,null,"Février",null,null,"Mars",null,null,"Avril",null,null,"Mai",null,null,"Juin",null,null,"Juillet",null,null,"Août",null,null,"Septembre",null,null,"Octobre",null,null,"Novembre",null,null,"Décembre"]
["Jour","Cours","Commentaires","Jour","Cours","Commentaires","Jour","Cours","Commentaires","Jour","Cours","Commentaires","Jour","Cours","Commentaires","Jour","Cours","Commentaires","Jour","Cours","Commentaires","Jour","Cours","Commentaires","Jour","Cours","Commentaires","Jour","Cours","Commentaires","Jour","Cours","Commentaires","Jour","Cours","Commentaires"]
["2019-01-01",null,null,"2019-02-01",null,null,"2019-03-01",null,null,"2019-04-01",null,null,"2019-05-01",null,null,"2019-06-01",null,null,"2019-07-01",null,null,"2019-08-01",null,null,"2019-09-01",null,null,"2019-10-01",null,null,"2019-11-01",null,null,"2019-12-01"]
["2019-01-02",null,null,"2019-02-02",null,null,"2019-03-02",null,null,"2019-04-02",null,null,"2019-05-02",null,null,"2019-06-02",null,null,"2019-07-02",null,null,"2019-08-02",null,null,"2019-09-02",null,null,"2019-10-02",null,null,"2019-11-02",null,null,"2019-12-02"]
["2019-01-03",null,null,"2019-02-03",null,null,"2019-03-03",null,null,"2019-04-03",null,null,"2019-05-03",null,null,"2019-06-03",null,null,"2019-07-03",null,null,"2019-08-03",null,null,"2019-09-03",null,null,"2019-10-03",null,null,"2019-11-03",null,null,"2019-12-03"]
["2019-01-04",null,null,"2019-02-04",null,null,"2019-03-04",null,null,"2019-04-04",null,null,"2019-05-04",null,null,"2019-06-04",null,null,"2019-07-04",null,null,"2019-08-04",null,null,"2019-09-04",null,null,"2019-10-04",null,null,"2019-11-04",null,null,"2019-12-04"]
["2019-01-05",null,null,"2019-02-05",null,null,"2019-03-05",null,null,"2019-04-05",null,null,"2019-05-05",null,null,"2019-06-05",null,null,"2019-07-05",null,null,"2019-08-05",null,null,"2019-09-05",null,null,"2019-10-05",null,null,"2019-11-05",null,null,"2019-12-05"]
["2019-01-06",null,null,"2019-02-06",null,null,"2019-03-06",null,null,"2019-04-06",null,null,"2019-05-06",null,null,"2019-06-06",null,null,"2019-07-06",null,null,"2019-08-06",null,null,"2019-09-06",null,null,"2019-10-06",null,null,"2019-11-06",null,null,"2019-12-06"]
["2019-01-07",null,null,"2019-02-07",null,null,"2019-03-07",null,null,"2019-04-07",null,null,"2019-05-07",null,null,"2019-06-07",null,null,"2019-07-07",null,null,"2019-08-07",null,null,"2019-09-07",null,null,"2019-10-07",null,null,"2019-11-07",null,null,"2019-12-07"]
["2019-01-08",null,null,"2019-02-08",null,null,"2019-03-08",null,null,"2019-04-08",null,null,"2019-05-08",null,null,"2019-06-08",null,null,"2019-07-08",null,null,"2019-08-08",null,null,"2019-09-08",null,null,"2019-10-08",null,null,"2019-11-08",null,null,"2019-12-08"]
["2019-01-09",null,null,"2019-02-09",null,null,"2019-03-09",null,null,"2019-04-09",null,null,"2019-05-09",null,null,"2019-06-09",null,null,"2019-07-09",null,null,"2019-08-09",null,null,"2019-09-09",null,null,"2019-10-09",null,null,"2019-11-09",null,null,"2019-12-09"]
["2019-01-10",null,null,"2019-02-10",null,null,"2019-03-10",null,null,"2019-04-10",null,null,"2019-05-10",null,null,"2019-06-10",null,null,"2019-07-10",null,null,"2019-08-10",null,null,"2019-09-10",null,null,"2019-10-10",null,null,"2019-11-10",null,null,"2019-12-10"]
["2019-01-11",null,null,"2019-02-11",null,null,"2019-03-11",null,null,"2019-04-11",null,null,"2019-05-11",null,null,"2019-06-11",null,null,"2019-07-11",null,null,"2019-08-11",null,null,"2019-09-11",null,null,"2019-10-11",null,null,"2019-11-11",null,null,"2019-12-11"]
["2019-01-12",null,null,"2019-02-12",null,null,"2019-03-12",null,null,"2019-04-12",null,null,"2019-05-12",null,null,"2019-06-12",null,null,"2019-07-12",null,null,"2019-08-12",null,null,"2019-09-12",null,null,"2019-10-12",null,null,"2019-11-12",null,null,"2019-12-12"]
["2019-01-13",null,null,"2019-02-13",null,null,"2019-03-13",null,null,"2019-04-13",null,null,"2019-05-13",null,null,"2019-06-13",null,null,"2019-07-13",null,null,"2019-08-13",null,null,"2019-09-13",null,null,"2019-10-13",null,null,"2019-11-13",null,null,"2019-12-13"]
["2019-01-14",null,null,"2019-02-14",null,null,"2019-03-14",null,null,"2019-04-14",null,null,"2019-05-14",null,null,"2019-06-14",null,null,"2019-07-14",null,null,"2019-08-14",null,null,"2019-09-14",null,null,"2019-10-14",null,null,"2019-11-14",null,null,"2019-12-14"]
["2019-01-15",null,null,"2019-02-15",null,null,"2019-03-15",null,null,"2019-04-15",null,null,"2019-05-15",null,null,"2019-06-15",null,null,"2019-07-15",null,null,"2019-08-15",null,null,"2019-09-15",null,null,"2019-10-15",null,null,"2019-11-15",null,null,"2019-12-15"]
["2019-01-16",null,null,"2019-02-16",null,null,"2019-03-16",null,null,"2019-04-16",null,null,"2019-05-16",null,null,"2019-06-16",null,null,"2019-07-16",null,null,"2019-08-16",null,null,"2019-09-16",null,null,"2019-10-16",null,null,"2019-11-16",null,null,"2019-12-16"]
["2019-01-17",null,null,"2019-02-17",null,null,"2019-03-17",null,null,"2019-04-17",null,null,"2019-05-17",null,null,"2019-06-17",null,null,"2019-07-17",null,null,"2019-08-17",null,null,"2019-09-17",null,null,"2019-10-17",null,null,"2019-11-17",null,null,"2019-12-17"]
{"$rows_left_out":29}
{"sheet":"Calendrier_annuel_2020","index":6,"n_rows":56,"n_cols":36,"rows_kept":56,"hidden":true,"merged":[[9,0,9,2],[9,3,9,5],[9,6,9,8],[9,9,9,11],[9,12,9,14],[9,15,9,17],[9,18,9,20],[9,21,9,23],[9,24,9,26],[9,27,9,29],[9,30,9,32],[9,33,9,35]]}
{"$rows_empty":9}
["Janvier",null,null,"Février",null,null,"Mars",null,null,"Avril",null,null,"Mai",null,null,"Juin",null,null,"Juillet",null,null,"Août",null,null,"Septembre",null,null,"Octobre",null,null,"Novembre",null,null,"Décembre"]
["Jour","Cours","Commentaires","Jour","Cours","Commentaires","Jour","Cours","Commentaires","Jour","Cours","Commentaires","Jour","Cours","Commentaires","Jour","Cours","Commentaires","Jour","Cours","Commentaires","Jour","Cours","Commentaires","Jour","Cours","Commentaires","Jour","Cours","Commentaires","Jour","Cours","Commentaires","Jour","Cours","Commentaires"]
["2020-01-01",null,null,"2020-02-01",null,null,"2020-03-01",null,null,"2020-04-01",null,null,"2020-05-01",null,null,"2020-06-01",null,null,"2020-07-01",null,null,"2020-08-01",null,null,"2020-09-01",null,null,"2020-10-01",null,null,"2020-11-01",null,null,"2020-12-01"]
["2020-01-02",null,null,"2020-02-02",null,null,"2020-03-02",null,null,"2020-04-02",null,null,"2020-05-02",null,null,"2020-06-02",null,null,"2020-07-02",null,null,"2020-08-02",null,null,"2020-09-02",null,null,"2020-10-02",null,null,"2020-11-02",null,null,"2020-12-02"]
["2020-01-03",null,null,"2020-02-03",null,null,"2020-03-03",null,null,"2020-04-03",null,null,"2020-05-03",null,null,"2020-06-03",null,null,"2020-07-03",null,null,"2020-08-03",null,null,"2020-09-03",null,null,"2020-10-03",null,null,"2020-11-03",null,null,"2020-12-03"]
["2020-01-04",null,null,"2020-02-04",null,null,"2020-03-04",null,null,"2020-04-04",null,null,"2020-05-04",null,null,"2020-06-04",null,null,"2020-07-04",null,null,"2020-08-04",null,null,"2020-09-04",null,null,"2020-10-04",null,null,"2020-11-04",null,null,"2020-12-04"]
["2020-01-05",null,null,"2020-02-05",null,null,"2020-03-05",null,null,"2020-04-05",null,null,"2020-05-05",null,null,"2020-06-05",null,null,"2020-07-05",null,null,"2020-08-05",null,null,"2020-09-05",null,null,"2020-10-05",null,null,"2020-11-05",null,null,"2020-12-05"]
["2020-01-06",null,null,"2020-02-06",null,null,"2020-03-06",null,null,"2020-04-06",null,null,"2020-05-06",null,null,"2020-06-06",null,null,"2020-07-06",null,null,"2020-08-06",null,null,"2020-09-06",null,null,"2020-10-06",null,null,"2020-11-06",null,null,"2020-12-06"]
["2020-01-07",null,null,"2020-02-07",null,null,"2020-03-07",null,null,"2020-04-07",null,null,"2020-05-07",null,null,"2020-06-07",null,null,"2020-07-07",null,null,"2020-08-07",null,null,"2020-09-07",null,null,"2020-10-07",null,null,"2020-11-07",null,null,"2020-12-07"]
["2020-01-08",null,null,"2020-02-08",null,null,"2020-03-08",null,null,"2020-04-08",null,null,"2020-05-08",null,null,"2020-06-08",null,null,"2020-07-08",null,null,"2020-08-08",null,null,"2020-09-08",null,null,"2020-10-08",null,null,"2020-11-08",null,null,"2020-12-08"]
["2020-01-09",null,null,"2020-02-09",null,null,"2020-03-09",null,null,"2020-04-09",null,null,"2020-05-09",null,null,"2020-06-09",null,null,"2020-07-09",null,null,"2020-08-09",null,null,"2020-09-09",null,null,"2020-10-09",null,null,"2020-11-09",null,null,"2020-12-09"]
["2020-01-10",null,null,"2020-02-10",null,null,"2020-03-10",null,null,"2020-04-10",null,null,"2020-05-10",null,null,"2020-06-10",null,null,"2020-07-10",null,null,"2020-08-10",null,null,"2020-09-10",null,null,"2020-10-10",null,null,"2020-11-10",null,null,"2020-12-10"]
["2020-01-11",null,null,"2020-02-11",null,null,"2020-03-11",null,null,"2020-04-11",null,null,"2020-05-11",null,null,"2020-06-11",null,null,"2020-07-11",null,null,"2020-08-11",null,null,"2020-09-11",null,null,"2020-10-11",null,null,"2020-11-11",null,null,"2020-12-11"]
["2020-01-12",null,null,"2020-02-12",null,null,"2020-03-12",null,null,"2020-04-12",null,null,"2020-05-12",null,null,"2020-06-12",null,null,"2020-07-12",null,null,"2020-08-12",null,null,"2020-09-12",null,null,"2020-10-12",null,null,"2020-11-12",null,null,"2020-12-12"]
["2020-01-13",null,null,"2020-02-13",null,null,"2020-03-13",null,null,"2020-04-13",null,null,"2020-05-13",null,null,"2020-06-13",null,null,"2020-07-13",null,null,"2020-08-13",null,null,"2020-09-13",null,null,"2020-10-13",null,null,"2020-11-13",null,null,"2020-12-13"]
["2020-01-14",null,null,"2020-02-14",null,null,"2020-03-14",null,null,"2020-04-14",null,null,"2020-05-14",null,null,"2020-06-14",null,null,"2020-07-14",null,null,"2020-08-14",null,null,"2020-09-14",null,null,"2020-10-14",null,null,"2020-11-14",null,null,"2020-12-14"]
["2020-01-15",null,null,"2020-02-15",null,null,"2020-03-15",null,null,"2020-04-15",null,null,"2020-05-15",null,null,"2020-06-15",null,null,"2020-07-15",null,null,"2020-08-15",null,null,"2020-09-15",null,null,"2020-10-15",null,null,"2020-11-15",null,null,"2020-12-15"]
["2020-01-16",null,null,"2020-02-16",null,null,"2020-03-16",null,null,"2020-04-16",null,null,"2020-05-16",null,null,"2020-06-16",null,null,"2020-07-16",null,null,"2020-08-16",null,null,"2020-09-16",null,null,"2020-10-16",null,null,"2020-11-16",null,null,"2020-12-16"]
["2020-01-17",null,null,"2020-02-17",null,null,"2020-03-17",null,null,"2020-04-17",null,null,"2020-05-17",null,null,"2020-06-17",null,null,"2020-07-17",null,null,"2020-08-17",null,null,"2020-09-17",null,null,"2020-10-17",null,null,"2020-11-17",null,null,"2020-12-17"]
{"$rows_left_out":29}
{"sheet":"Calendrier_mensuel_2018","index":7,"n_rows":64,"n_cols":34,"rows_kept":64,"merged":[[10,0,11,0],[10,1,11,1],[10,2,11,2],[10,3,11,3]]}
{"$rows_empty":10}
["N°","Intervenant","Matière","Tâches","S","D","L","M","M","J","V","S","D","L","M","M","J","V","S","D","L","M","M","J","V","S","D","L","M","M","J","V","S","D"]
[{"$nulls":4},"2018-09-01","2018-09-02","2018-09-03","2018-09-04","2018-09-05","2018-09-06","2018-09-07","2018-09-08","2018-09-09","2018-09-10","2018-09-11","2018-09-12","2018-09-13","2018-09-14","2018-09-15","2018-09-16","2018-09-17","2018-09-18","2018-09-19","2018-09-20","2018-09-21","2018-09-22","2018-09-23","2018-09-24","2018-09-25","2018-09-26","2018-09-27","2018-09-28","2018-09-29","2018-09-30"]
[null,{"$f":"VLOOKUP(A13,Programme!A3:C27,2,FALSE)","v":{"$error":"#N/A"}},{"$f":"VLOOKUP(A13,Programme!A3:C27,3,FALSE)","v":{"$error":"#N/A"}}]
[null,{"$f":"VLOOKUP(A14,Programme!A4:C28,2,FALSE)","v":{"$error":"#N/A"}},{"$f":"VLOOKUP(A14,Programme!A4:C28,3,FALSE)","v":{"$error":"#N/A"}}]
[null,{"$f":"VLOOKUP(A15,Programme!A5:C29,2,FALSE)","v":{"$error":"#N/A"}},{"$f":"VLOOKUP(A15,Programme!A5:C29,3,FALSE)","v":{"$error":"#N/A"}}]
[null,{"$f":"VLOOKUP(A16,Programme!A6:C30,2,FALSE)","v":{"$error":"#N/A"}},{"$f":"VLOOKUP(A16,Programme!A6:C30,3,FALSE)","v":{"$error":"#N/A"}}]
[null,{"$f":"VLOOKUP(A17,Programme!A7:C31,2,FALSE)","v":{"$error":"#N/A"}},{"$f":"VLOOKUP(A17,Programme!A7:C31,3,FALSE)","v":{"$error":"#N/A"}}]
[null,{"$f":"VLOOKUP(A18,Programme!A8:C32,2,FALSE)","v":{"$error":"#N/A"}},{"$f":"VLOOKUP(A18,Programme!A8:C32,3,FALSE)","v":{"$error":"#N/A"}}]
[null,{"$f":"VLOOKUP(A19,Programme!A9:C33,2,FALSE)","v":{"$error":"#N/A"}},{"$f":"VLOOKUP(A19,Programme!A9:C33,3,FALSE)","v":{"$error":"#N/A"}}]
[null,{"$f":"VLOOKUP(A20,Programme!A10:C34,2,FALSE)","v":{"$error":"#N/A"}},{"$f":"VLOOKUP(A20,Programme!A10:C34,3,FALSE)","v":{"$error":"#N/A"}}]
[null,{"$f":"VLOOKUP(A21,Programme!A11:C35,2,FALSE)","v":{"$error":"#N/A"}},{"$f":"VLOOKUP(A21,Programme!A11:C35,3,FALSE)","v":{"$error":"#N/A"}}]
[null,{"$f":"VLOOKUP(A22,Programme!A12:C36,2,FALSE)","v":{"$error":"#N/A"}},{"$f":"VLOOKUP(A22,Programme!A12:C36,3,FALSE)","v":{"$error":"#N/A"}}]
[null,{"$f":"VLOOKUP(A23,Programme!A13:C37,2,FALSE)","v":{"$error":"#N/A"}},{"$f":"VLOOKUP(A23,Programme!A13:C37,3,FALSE)","v":{"$error":"#N/A"}}]
[null,{"$f":"VLOOKUP(A24,Programme!A14:C38,2,FALSE)","v":{"$error":"#N/A"}},{"$f":"VLOOKUP(A24,Programme!A14:C38,3,FALSE)","v":{"$error":"#N/A"}}]
[null,{"$f":"VLOOKUP(A25,Programme!A15:C39,2,FALSE)","v":{"$error":"#N/A"}},{"$f":"VLOOKUP(A25,Programme!A15:C39,3,FALSE)","v":{"$error":"#N/A"}}]
[null,{"$f":"VLOOKUP(A26,Programme!A16:C40,2,FALSE)","v":{"$error":"#N/A"}},{"$f":"VLOOKUP(A26,Programme!A16:C40,3,FALSE)","v":{"$error":"#N/A"}}]
[null,{"$f":"VLOOKUP(A27,Programme!A17:C41,2,FALSE)","v":{"$error":"#N/A"}},{"$f":"VLOOKUP(A27,Programme!A17:C41,3,FALSE)","v":{"$error":"#N/A"}}]
[null,{"$f":"VLOOKUP(A28,Programme!A18:C42,2,FALSE)","v":{"$error":"#N/A"}},{"$f":"VLOOKUP(A28,Programme!A18:C42,3,FALSE)","v":{"$error":"#N/A"}}]
[null,{"$f":"VLOOKUP(A29,Programme!A19:C43,2,FALSE)","v":{"$error":"#N/A"}},{"$f":"VLOOKUP(A29,Programme!A19:C43,3,FALSE)","v":{"$error":"#N/A"}}]
{"$rows_left_out":36}
{"sheet":"Légende","index":8,"n_rows":4,"n_cols":1,"rows_kept":4}
["Cours"]
["Deadline"]
["Réunion"]
["à faire"]