{"text_format":"3","workbook":"xlsx","n_sheets":7,"sheets":["LISTE des apprenants","Liste des Profs","3ème","4ème","5ème","6ème","Bulletin 6ème"],"not_rendered":{"images":1,"macros":1,"defined_names":5},"read":"whole","date_system":"1900"}

{"sheet":"LISTE des apprenants","index":0,"n_rows":266,"n_cols":4,"rows_kept":266}
["MATRICULE ","NOM ET PRENOMS ","SEXE","Classe"]
["16215341 N","Abraham Isaac       ","M","6ème"]
["1740850 X","Joseph Manasée","M","3ème"]
[null,null,"M","3ème"]
[null,null,"M","3ème"]
[null,null,"M","3ème"]
[null,null,"F","3ème"]
[null,null,"M","3ème"]
[null,null,"M","3ème"]
[null,null,"M","3ème"]
[null,null,"M","3ème"]
[null,null,"F","3ème"]
[null,null,"M","3ème"]
[null,null,"M","3ème"]
[null,null,"M","3ème"]
[null,null,"F","3ème"]
[null,null,"M","3ème"]
[null,null,"M","3ème"]
[null,null,"M","3ème"]
[null,null,"F","3ème"]
[null,null,"F","3ème"]
[null,null,"M","3ème"]
[null,null,"M","3ème"]
[null,null,"M","3ème"]
[null,null,"M","3ème"]
[null,null,"M","3ème"]
[null,null,"F","3ème"]
[null,null,"M","3ème"]
[null,null,"M","3ème"]
[null,null,"M","3ème"]
[null,null,"M","3ème"]
[null,null,"M","3ème"]
[null,null,"M","3ème"]
[null,null,"M","3ème"]
[null,null,"M","3ème"]
[null,null,"M","3ème"]
[null,null,"M","3ème"]
[null,null,"F","3ème"]
[null,null,"M","3ème"]
[null,null,"M","3ème"]
[null,null,"M","3ème"]
[null,null,"M","3ème"]
[null,null,"M","3ème"]
[null,null,"M","3ème"]
[null,null,"M","3ème"]
[null,null,"F","3ème"]
[null,null,"M","3ème"]
[null,null,"F","4ème"]
[null,null,"M","4ème"]
[null,null,"M","4ème"]
[null,null,"M","4ème"]
[null,null,"M","4ème"]
[null,null,"M","4ème"]
[null,null,"M","4ème"]
[null,null,"F","4ème"]
[null,null,"M","4ème"]
[null,null,"M","4ème"]
[null,null,"M","4ème"]
[null,null,"M","4ème"]
[null,null,"M","4ème"]
[null,null,"M","4ème"]
[null,null,"F","4ème"]
[null,null,"M","4ème"]
[null,null,"F","4ème"]
[null,null,"M","4ème"]
[null,null,"F","4ème"]
[null,null,"F","4ème"]
[null,null,"M","4ème"]
[null,null,"M","4ème"]
[null,null,"M","4ème"]
[null,null,"M","4ème"]
[null,null,"M","4ème"]
[null,null,"F","4ème"]
[null,null,"M","4ème"]
[null,null,"M","4ème"]
[null,null,"M","4ème"]
[null,null,"M","4ème"]
[null,null,"F","4ème"]
[null,null,"M","4ème"]
[null,null,"M","4ème"]
[null,null,"F","4ème"]
[null,null,"M","4ème"]
[null,null,"M","4ème"]
[null,null,"F","5ème"]
[null,null,"M","5ème"]
[null,null,"F","5ème"]
[null,null,"M","5ème"]
[null,null,"M","5ème"]
[null,null,"M","5ème"]
[null,null,"M","5ème"]
[null,null,"M","5ème"]
[null,null,"F","5ème"]
[null,null,"F","5ème"]
[null,null,"F","5ème"]
[null,null,"M","5ème"]
[null,null,"F","5ème"]
[null,null,"M","5ème"]
[null,null,"F","5ème"]
[null,null,"M","5ème"]
[null,null,"M","5ème"]
[null,null,"M","5ème"]
[null,null,"M","5ème"]
[null,null,"M","5ème"]
[null,null,"M","5ème"]
[null,null,"F","5ème"]
[null,null,"M","5ème"]
[null,null,"M","5ème"]
[null,null,"F","5ème"]
[null,null,"M","5ème"]
[null,null,"M","5ème"]
[null,null,"F","5ème"]
[null,null,"M","5ème"]
[null,null,"M","5ème"]
[null,null,"M","5ème"]
[null,null,"M","5ème"]
[null,null,"M","5ème"]
[null,null,"M","5ème"]
[null,null,"M","5ème"]
[null,null,"F","5ème"]
[null,null,"M","5ème"]
[null,null,"F","5ème"]
[null,null,"M","5ème"]
[null,null,"M","5ème"]
[null,null,"F","5ème"]
[null,null,"F","5ème"]
[null,null,"F","5ème"]
[null,null,"M","5ème"]
[null,null,"M","5ème"]
[null,null,"M","5ème"]
[null,null,"M","5ème"]
[null,null,"F","5ème"]
[null,null,"F","5ème"]
[null,null,"M","6ème2"]
[null,null,"F","6ème2"]
[null,null,"M","6ème2"]
[null,null,"F","6ème2"]
[null,null,"M","6ème2"]
[null,null,"M","6ème2"]
[null,null,"M","6ème2"]
[null,null,"F","6ème2"]
[null,null,"M","6ème2"]
[null,null,"F","6ème2"]
[null,null,"F","6ème2"]
[null,null,"M","6ème2"]
[null,null,"M","6ème2"]
[null,null,"M","6ème2"]
[null,null,"F","6ème2"]
[null,null,"M","6ème2"]
[null,null,"F","6ème2"]
[null,null,"M","6ème2"]
[null,null,"M","6ème2"]
[null,null,"M","6ème2"]
[null,null,"M","6ème2"]
[null,null,"F","6ème2"]
[null,null,"M","6ème2"]
[null,null,"F","6ème2"]
[null,null,"F","6ème2"]
[null,null,"M","6ème2"]
[null,null,"F","6ème2"]
[null,null,"F","6ème2"]
[null,null,"M","6ème2"]
[null,null,"M","6ème2"]
[null,null,"M","6ème2"]
[null,null,"F","6ème2"]
[null,null,"F","6ème2"]
[null,null,"F","6ème2"]
[null,null,"F","6ème2"]
[null,null,"M","6ème2"]
[null,null,"M","6ème2"]
[null,null,"M","6ème2"]
[null,null,"F","6ème2"]
[null,null,"M","6ème2"]
[null,null,"M","6ème2"]
[null,null,"F","6ème2"]
[null,null,"M","6ème2"]
[null,null,"F","6ème2"]
[null,null,"M","6ème2"]
[null,null,"M","6ème2"]
[null,null,"M","6ème2"]
[null,null,"F","6ème2"]
[null,null,"F","6ème2"]
[null,null,"F","6ème2"]
[null,null,"M","6ème2"]
[null,null,"F","6ème2"]
[null,null,"M","6ème2"]
[null,null,"M","6ème2"]
[null,null,"F","6ème2"]
[null,null,"M","6ème2"]
[null,null,"F","6ème2"]
[null,null,"F","6ème2"]
[null,null,"M","6ème2"]
[null,null,"M","6ème2"]
[null,null,"M","6ème2"]
[null,null,"M","6ème2"]
[null,null,"F","6ème2"]
[null,null,"F","6ème2"]
[null,null,"F","6ème2"]
[null,null,"F","6ème2"]
[null,null,"F","6ème2"]
[null,null,"M","6ème2"]
[null,null,"M","6ème2"]
[null,null,"M","6ème1"]
[null,null,"M","6ème1"]
[null,null,"F","6ème1"]
[null,null,"M","6ème1"]
[null,null,"M","6ème1"]
[null,null,"M","6ème1"]
[null,null,"F","6ème1"]
[null,null,"F","6ème1"]
[null,null,"F","6ème1"]
[null,null,"M","6ème1"]
[null,null,"M","6ème1"]
[null,null,"M","6ème1"]
[null,null,"F","6ème1"]
[null,null,"F","6ème1"]
[null,null,"M","6ème1"]
[null,null,"F","6ème1"]
[null,null,"M","6ème1"]
[null,null,"M","6ème1"]
[null,null,"M","6ème1"]
[null,null,"F","6ème1"]
[null,null,"M","6ème1"]
[null,null,"M","6ème1"]
[null,null,"F","6ème1"]
[null,null,"F","6ème1"]
[null,null,"M","6ème1"]
[null,null,"M","6ème1"]
[null,null,"M","6ème1"]
[null,null,"F","6ème1"]
[null,null,"M","6ème1"]
[null,null,"M","6ème1"]
[null,null,"F","6ème1"]
[null,null,"F","6ème1"]
[null,null,"F","6ème1"]
[null,null,"M","6ème1"]
[null,null,"F","6ème1"]
[null,null,"M","6ème1"]
[null,null,"M","6ème1"]
[null,null,"M","6ème1"]
[null,null,"F","6ème1"]
[null,null,"M","6ème1"]
[null,null,"M","6ème1"]
[null,null,"F","6ème1"]
[null,null,"F","6ème1"]
[null,null,"F","6ème1"]
[null,null,"M","6ème1"]
[null,null,"M","6ème1"]
[null,null,"M","6ème1"]
[null,null,"M","6ème1"]
[null,null,"F","6ème1"]
[null,null,"F","6ème1"]
[null,null,"M","6ème1"]
[null,null,"M","6ème1"]
[null,null,"F","6ème1"]
[null,null,"F","6ème1"]
[null,null,"F","6ème1"]
[null,null,"M","6ème1"]
[null,null,"F","6ème1"]
[null,null,"F","6ème1"]
[null,null,"F","6ème1"]
[null,null,"M","6ème1"]
[null,null,"F","6ème1"]
[null,null,"M","6ème1"]
[null,null,"F","6ème1"]
[null,null,"M","6ème1"]
[null,null,"F","6ème1"]

{"sheet":"Liste des Profs","index":1,"n_rows":21,"n_cols":9,"rows_kept":21,"merged":[[4,4,4,8]]}
[]
[]
[]
[]
[null,null,"Nom des Profs","Matière","Niveau"]
[null,null,"MARC","Français","3ème","4ème"]
[null,null,"SIMPLICE","Français","5ème","4ème"]
[null,null,"GEORGE","Maths","6ème1","6ème2","5ème","4ème","3ème"]
[null,null,"SORHO","Maths","6ème1","6ème2","5ème","4ème"]
[null,null,"CEDRIC","Histoire-Gèographie","6ème1","6ème2","5ème","4ème","3ème"]
[null,null,"KOFFI","Histoire-Gèographie","5ème","4ème","3ème"]
[null,null,"ATTA Y.","Allemand","6ème2","5ème","4ème"]
[null,null,"FRANCOIS","Espagnol","6ème1","6ème2",null,"4ème"]
[null,null,"JULIEN","SVT","4ème","3ème"]
[null,null,"NIANGORAN","SVT","6ème2","5ème","4ème"]
[null,null,"EPONON","EPS","6ème1","6ème2","5ème","4ème","3ème"]
[null,null,"TUTO ","Physiques-Chimies","4ème","3ème"]
[null,null,"KONE","Physiques-Chimies","5ème","4ème","3ème"]
[null,null,"YOBOUE","Edhc","6ème1","6ème2","5ème","4ème","3ème"]
[null,null,"TOUSSAINT","Anglais","5ème","4ème","3ème"]
[null,null,"DIGBEU A.","Anglais","6ème1","6ème2","5ème","4ème","3ème"]

{"sheet":"3ème","index":2,"n_rows":78,"n_cols":25,"rows_kept":78}
["MINISTERE DE L’EDUCATION NATIONALE                                   REPUBLIQUE DE CÔTE D’IVOIRE"]
["DE L’ENSEIGNEMENT TECHNIQUE ET                                                       "]
["DE LA FORMATION PROFESSIONNELLE                                                  Union – Discipline - Travail    "]
["                                                                                                            "]
["COLLEGE PRIVE NATCHEZHE BAHOULIFLA",{"$nulls":3},"Année Scolaire : 2017 – 2018"]
["Tél : 08 06 19 58/ 48 11 91 91",{"$nulls":3},"Classe: ","6ème 2"]
[null,1,2,3,4,5,6,7,8,9,10,11,12,13,14,15,16,17,18,19,20,21,22,23,24]
["N°","MATRICULE ","NOM ET PRENOMS ","ORI","CF","O.G","E.O","FR","Rang","ANG","Rang","H.G","Rang","MATHS","Rang","P.C","Rang","SVT","Rang","EPS","Rang","EDCH","Rang","M/20","Rang"]
[1]
[2]
[3]
[4]
[5]
[6]
[7]
[8]
[9]
[10]
[11]
[12]
[13]
[14]
[15]
[16]
[17]
[18]
[19]
[20]
[21]
[22]
[23]
[24]
[25]
[26]
[27]
[28]
[29]
[30]
[31]
[32]
[33]
[34]
[35]
[36]
[37]
[38]
[39]
[40]
[41]
[42]
[43]
[44]
[45]
[46]
[47]
[48]
[49]
[50]
[51]
[52]
[53]
[54]
[55]
[56]
[57]
[58]
[59]
[60]
[61]
[62]
[63]
[64]
[65]
[66]
[67]
[68]
[69]
[70]

{"sheet":"4ème","index":3,"n_rows":78,"n_cols":25,"rows_kept":78}
["MINISTERE DE L’EDUCATION NATIONALE                                   REPUBLIQUE DE CÔTE D’IVOIRE"]
["DE L’ENSEIGNEMENT TECHNIQUE ET                                                       "]
["DE LA FORMATION PROFESSIONNELLE                                                  Union – Discipline - Travail    "]
["                                                                                                            "]
["COLLEGE PRIVE NATCHEZHE BAHOULIFLA",{"$nulls":3},"Année Scolaire : 2017 – 2018"]
["Tél : 08 06 19 58/ 48 11 91 91",{"$nulls":3},"Classe: ","6ème 2"]
[null,1,2,3,4,5,6,7,8,9,10,11,12,13,14,15,16,17,18,19,20,21,22,23,24]
["N°","MATRICULE ","NOM ET PRENOMS ","ORI","CF","O.G","E.O","FR","Rang","ANG","Rang","H.G","Rang","MATHS","Rang","P.C","Rang","SVT","Rang","EPS","Rang","EDCH","Rang","M/20","Rang"]
[1]
[2]
[3]
[4]
[5]
[6]
[7]
[8]
[9]
[10]
[11]
[12]
[13]
[14]
[15]
[16]
[17]
[18]
[19]
[20]
[21]
[22]
[23]
[24]
[25]
[26]
[27]
[28]
[29]
[30]
[31]
[32]
[33]
[34]
[35]
[36]
[37]
[38]
[39]
[40]
[41]
[42]
[43]
[44]
[45]
[46]
[47]
[48]
[49]
[50]
[51]
[52]
[53]
[54]
[55]
[56]
[57]
[58]
[59]
[60]
[61]
[62]
[63]
[64]
[65]
[66]
[67]
[68]
[69]
[70]

{"sheet":"5ème","index":4,"n_rows":78,"n_cols":25,"rows_kept":78}
["MINISTERE DE L’EDUCATION NATIONALE                                   REPUBLIQUE DE CÔTE D’IVOIRE"]
["DE L’ENSEIGNEMENT TECHNIQUE ET                                                       "]
["DE LA FORMATION PROFESSIONNELLE                                                  Union – Discipline - Travail    "]
["                                                                                                            "]
["COLLEGE PRIVE NATCHEZHE BAHOULIFLA",{"$nulls":3},"Année Scolaire : 2017 – 2018"]
["Tél : 08 06 19 58/ 48 11 91 91",{"$nulls":3},"Classe: ","6ème 2"]
[null,1,2,3,4,5,6,7,8,9,10,11,12,13,14,15,16,17,18,19,20,21,22,23,24]
["N°","MATRICULE ","NOM ET PRENOMS ","ORI","CF","O.G","E.O","FR","Rang","ANG","Rang","H.G","Rang","MATHS","Rang","P.C","Rang","SVT","Rang","EPS","Rang","EDCH","Rang","M/20","Rang"]
[1]
[2]
[3]
[4]
[5]
[6]
[7]
[8]
[9]
[10]
[11]
[12]
[13]
[14]
[15]
[16]
[17]
[18]
[19]
[20]
[21]
[22]
[23]
[24]
[25]
[26]
[27]
[28]
[29]
[30]
[31]
[32]
[33]
[34]
[35]
[36]
[37]
[38]
[39]
[40]
[41]
[42]
[43]
[44]
[45]
[46]
[47]
[48]
[49]
[50]
[51]
[52]
[53]
[54]
[55]
[56]
[57]
[58]
[59]
[60]
[61]
[62]
[63]
[64]
[65]
[66]
[67]
[68]
[69]
[70]

{"sheet":"6ème","index":5,"n_rows":78,"n_cols":25,"rows_kept":78}
["MINISTERE DE L’EDUCATION NATIONALE                                   REPUBLIQUE DE CÔTE D’IVOIRE"]
["DE L’ENSEIGNEMENT TECHNIQUE ET                                                       "]
["DE LA FORMATION PROFESSIONNELLE                                                  Union – Discipline - Travail    "]
["                                                                                                            "]
["COLLEGE ",{"$nulls":3},"Année Scolaire : 2017 – 2018"]
["Tél : ",{"$nulls":3},"Classe: ","6ème 2"]
[null,1,2,3,4,5,6,7,8,9,10,11,12,13,14,15,16,17,18,19,20,21,22,23,24]
["N°","MATRICULE ","NOM ET PRENOMS ","ORI","CF","O.G","E.O","FR","Rang","ANG","Rang","H.G","Rang","MATHS","Rang","P.C","Rang","SVT","Rang","EPS","Rang","EDCH","Rang","M/20","Rang"]
[1,"16215341 N","Abraham Isaac       ","Gontran",8,5,16,{"$f":"AVERAGE(E9:G9)","v":9.666666666666666},{"$f":"RANK(H9,$H$9:$H$78,0)","v":1},13.5,{"$f":"RANK(J9,$J$9:$J$78,0)","v":1},19.5,{"$f":"+RANK(L9,$L$8:$L$78,0)","v":1},11.67,{"$f":"RANK(N9,$N$8:$N$78,0)","v":1},10,{"$f":"RANK(P9,$P$8:$P$78,0)","v":1},16.333333333333332,{"$f":"RANK(R9,$R$9:$R$77,0)","v":1},16,"2e",10,"23e",{"$f":"AVERAGE(H9,J9,L9,N9,P9,R9,T9,V9)","v":13.33375},{"$f":"RANK(X9,$X$8:$X$78,0)","v":1}]
[2,"1740850 X","Joseph Manasé","Gontran",null,7,null,7,2,null,null,19.25,2,{"$nulls":6},12.67,"15e",10,"23e",12.23,2]
[3]
[4]
[5]
[6]
[7]
[8]
[9]
[10]
[11]
[12]
[13]
[14]
[15]
[16]
[17]
[18]
[19]
[20]
[21]
[22]
[23]
[24]
[25]
[26]
[27]
[28]
[29]
[30]
[31]
[32]
[33]
[34]
[35]
[36]
[37]
[38]
[39]
[40]
[41]
[42]
[43]
[44]
[45]
[46]
[47]
[48]
[49]
[50]
[51]
[52]
[53]
[54]
[55]
[56]
[57]
[58]
[59]
[60]
[61]
[62]
[63]
[64]
[65]
[66]
[67]
[68]
[69]
[70]

{"sheet":"Bulletin 6ème","index":6,"n_rows":41,"n_cols":9,"rows_kept":41,"merged":[[7,0,7,5],[8,7,8,8],[9,7,9,8],[10,7,10,8],[12,0,12,8],[13,0,13,1],[14,0,14,1],[14,4,16,4],[14,5,16,5],[14,6,16,6],[14,7,16,7],[15,0,15,1],[16,0,16,1],[17,0,17,1],[18,0,18,1],[19,0,19,1],[20,0,20,1],[21,0,21,1],[21,2,21,3],[21,5,21,8],[22,0,22,1],[23,0,23,1],[24,0,24,1],[25,0,25,1],[25,2,25,3],[25,5,25,8],[26,0,26,1],[27,0,27,1],[28,0,28,1],[29,0,29,1],[30,0,30,1],[31,0,31,1],[32,0,32,1],[33,0,33,1],[35,0,35,3],[35,4,35,6],[35,7,35,8],[36,0,37,2],[36,4,36,6],[38,0,44,3],[39,7,39,8],[40,4,40,6]]}
["MINISTERE DE L’EDUCATION NATIONALE                                                                                                     Année scolaire"]
["DE L’ENSEIGNEMENT TECHNIQUE ET                                                                                                                      2017 - 2018"]
["DE LA FORMATION PROFESSIONNELLE                                                "]
["      DREN : "]
["Etablissement : COLLEGE ",{"$nulls":7},"Code : "]
[]
["Adresse postale :                     Téléphone : ",{"$nulls":7},"Statut : "]
[{"$f":"VLOOKUP(B9,'6ème'!B7:Y78,2,0)","v":"Abraham Isaac       "}]
["Matricule :","16215341 N",{"$nulls":3},"Sexe:",{"$f":"VLOOKUP(B9,'LISTE des apprenants'!A:D,3,0)","v":"M"}," Redoublant (e): "]
[{"$nulls":4},"Né(e) le :                                     ",null,null,"                      Regime:"]
["Classe  :                    ",{"$f":"VLOOKUP(B9,'LISTE des apprenants'!A:D,4,0)","v":"6ème"},null,null,"Lieu de naissance :                                     ",null,null,"        Affecté(e):"]
["Effectif : ",65,null,null,"Nationalité :"]
[]
["DISCIPLINES",null,"Moy.","Coef.","Total","Rang","Appréciation","Professeurs","Signature"]
["Composition française",null,{"$f":"VLOOKUP($B$9,'6ème'!$B$8:$Y$78,4,0)","v":{"v":8,"d":"8.00"}},1,{"$f":"(C15+C16+C17)/3","v":{"v":9.666666666666666,"d":"9.67"}},{"$f":"VLOOKUP($B$9,'6ème'!$B$8:$Y$78,8,0)","v":1},{"$f":"IF(E15>=17,\"Tres bien\",IF(E15>=14,\"Bien\",IF(E15>=12,\"Assez-bien\",IF(E15>=10,\"Passable\",IF(E15>=8,\"Insuffisant\",IF(E15>=6,\"Très insuffisant\",\"Travail nul\"))))))","v":"Insuffisant"},"MARC"]
["Expression Orale",null,{"$f":"VLOOKUP($B$9,'6ème'!$B$8:$Y$78,5,0)","v":{"v":5,"d":"5.00"}},1]
["Orthographe-Grammaire",null,{"$f":"VLOOKUP($B$9,'6ème'!$B$8:$Y$78,6,0)","v":{"v":16,"d":"16.00"}},1]
["Anglais",null,{"$f":"VLOOKUP($B$9,'6ème'!$B$8:$Y$78,9,0)","v":{"v":13.5,"d":"13.50"}},1,{"$f":"C18","v":{"v":13.5,"d":"13.50"}},{"$f":"VLOOKUP($B$9,'6ème'!$B$8:$Y$78,10,0)","v":1},{"$f":"IF(E18>=17,\"Tres bien\",IF(E18>=14,\"Bien\",IF(E18>=12,\"Assez-bien\",IF(E18>=10,\"Passable\",IF(E18>=8,\"Insuffisant\",IF(E18>=6,\"Très insuffisant\",\"Travail nul\"))))))","v":"Assez-bien"},"DIGBEU A."]
["Allemand"]
["Espagnol"]
["Histoire-Géographie",null,{"$f":"VLOOKUP($B$9,'6ème'!$B$8:$Y$78,11,0)","v":{"v":19.5,"d":"19.50"}},1,{"$f":"C21","v":{"v":19.5,"d":"19.50"}},{"$f":"VLOOKUP($B$9,'6ème'!$B$8:$Y$78,12,0)","v":1},{"$f":"IF(E21>=17,\"Tres bien\",IF(E21>=14,\"Bien\",IF(E21>=12,\"Assez-bien\",IF(E21>=10,\"Passable\",IF(E21>=8,\"Insuffisant\",IF(E21>=6,\"Très insuffisant\",\"Travail nul\"))))))","v":"Tres bien"},"CEDRIC"]
["BILAN LETTRES",{"$nulls":3},{"$f":"SUM(E15:E21)/3","v":{"v":14.222222222222221,"d":"14.22"}}]
["Mathématiques",null,{"$f":"VLOOKUP($B$9,'6ème'!$B$8:$Y$78,13,0)","v":11.67},1,{"$f":"C23","v":11.67},{"$f":"VLOOKUP($B$9,'6ème'!$B$8:$Y$78,14,0)","v":1},{"$f":"IF(E23>=17,\"Tres bien\",IF(E23>=14,\"Bien\",IF(E23>=12,\"Assez-bien\",IF(E23>=10,\"Passable\",IF(E23>=8,\"Insuffisant\",IF(E23>=6,\"Très insuffisant\",\"Travail nul\"))))))","v":"Passable"},"GEORGE"]
["Physique- Chimie",null,{"$f":"VLOOKUP($B$9,'6ème'!$B$8:$Y$78,15,0)","v":{"v":10,"d":"10.00"}},1,{"$f":"C24","v":{"v":10,"d":"10.00"}},{"$f":"VLOOKUP($B$9,'6ème'!$B$8:$Y$78,16,0)","v":1},{"$f":"IF(E24>=17,\"Tres bien\",IF(E24>=14,\"Bien\",IF(E24>=12,\"Assez-bien\",IF(E24>=10,\"Passable\",IF(E24>=8,\"Insuffisant\",IF(E24>=6,\"Très insuffisant\",\"Travail nul\"))))))","v":"Passable"},"KONE"]
["SVT",null,{"$f":"VLOOKUP($B$9,'6ème'!$B$8:$Y$78,17,0)","v":{"v":16.333333333333332,"d":"16.33"}},1,{"$f":"C25","v":{"v":16.333333333333332,"d":"16.33"}},{"$f":"VLOOKUP($B$9,'6ème'!$B$8:$Y$78,18,0)","v":1},{"$f":"IF(E25>=17,\"Tres bien\",IF(E25>=14,\"Bien\",IF(E25>=12,\"Assez-bien\",IF(E25>=10,\"Passable\",IF(E25>=8,\"Insuffisant\",IF(E25>=6,\"Très insuffisant\",\"Travail nul\"))))))","v":"Bien"},"TUTO "]
["BILAN SCIENCES",{"$nulls":3},{"$f":"SUM(E23:E25)/3","v":{"v":12.667777777777777,"d":"12.67"}}]
["Dessin"]
["EPS",null,{"$f":"VLOOKUP($B$9,'6ème'!$B$8:$Y$78,19,0)","v":{"v":16,"d":"16.00"}},1,{"$f":"C28","v":{"v":16,"d":"16.00"}},{"$f":"VLOOKUP($B$9,'6ème'!$B$8:$Y$78,20,0)","v":"2e"},null,"EPONON"]
["Edhc",null,{"$f":"VLOOKUP($B$9,'6ème'!$B$8:$Y$78,21,0)","v":{"v":10,"d":"10.00"}},1,{"$f":"C29","v":{"v":10,"d":"10.00"}},{"$f":"VLOOKUP($B$9,'6ème'!$B$8:$Y$78,22,0)","v":"23e"},null,"YOBOUE"]
["Tic à l'école"]
["Conduite",null,16,null,{"v":16,"d":"16.00"},null,null,"YAO ADJOUA"]
["Musique"]
["Entrepreneuriat"]
["Bonus TM"]
[{"$nulls":3},{"$f":"SUM(D17:D31)","v":8},{"$f":"(SUM(E15:E21)+SUM(E23:E25)+SUM(E28:E29))","v":{"v":106.66999999999999,"d":"106.67"}}]
[{"$nulls":4},"Moyenne trimestrielle",null,null,"Résultat de classe"]
[{"$nulls":4},{"$f":"E35/D35","v":{"v":13.333749999999998,"d":"13.33"}},null,null,"Moy. Générale","Moy. Mini : 7,44"]
[{"$nulls":3}," ","Rang : ",{"$f":"VLOOKUP($B$9,'6ème'!$B$8:$Y$78,24,0)","v":1},{"$f":"B12","v":65},"de la classe: 11,36","Moy. Maxi :15,81"]
[]
[{"$nulls":7},"Directeur des Etudes"]
[{"$nulls":4},{"$f":"IF(E37>=17,\"Tres bien\",IF(E37>=14,\"Bien\",IF(E37>=12,\"Assez-bien\",IF(E37>=10,\"Passable\",IF(E37>=8,\"Insuffisant\",IF(E37>=6,\"Très insuffisant\",\"Travail nul\"))))))","v":"Assez-bien"}]