{"text_format":"3","workbook":"xlsx","n_sheets":2,"sheets":["Formulaire","Répertoire des produits"],"not_rendered":{"images":2,"macros":1,"defined_names":7},"read":"whole","date_system":"1900"}

{"sheet":"Formulaire","index":0,"n_rows":358,"n_cols":25,"rows_kept":358,"merged":[[3,4,3,5],[4,4,4,5],[5,4,5,5]]}
[{"$nulls":13},"CUP"]
[null,"Formulaire de commande",{"$nulls":11},"3499290000017"]
[]
[null,"Numéro de client:",null,5838009,"Succursale d'approv.:",null,33599]
[null,"Nom propriétaire: ",null,"Dany Doucet","Date:",null,{"$f":"TODAY()","v":"2018-12-28"},"3263280111270"]
[null,"No agence",null,"AG125","Nombres de Caisse :",null,{"$f":"IFERROR(SUM(Tableau1[commande]),\"\")","v":0}]
[]
["ID","Code\nArticle","commande","Nom du produit","Format","UVC","CUP","Catégorie","Description",{"$nulls":7},"ID","Code\nArticle","Commande","Nom du produit","Format","UVC","CUP","Catégorie","Description"]
[{"$f":"ROW(C9)-8","v":1},606988,null,{"$f":"VLOOKUP($B9,'Répertoire des produits'!$1:$1048576,4,FALSE)","v":"Cabernet-Sauvignon/Syrah J.P. Chenet vin de pays d'Oc"},{"$f":"VLOOKUP($B9,'Répertoire des produits'!$1:$1048576,5,FALSE)","v":250},{"$f":"VLOOKUP($B9,'Répertoire des produits'!$1:$1048576,6,FALSE)","v":24},{"$f":"VLOOKUP($B9,'Répertoire des produits'!$1:$1048576,3,FALSE)","v":"03263286324216"},{"$f":"VLOOKUP($B9,'Répertoire des produits'!$1:$1048576,2,FALSE)","v":"Vin rg petits formats"},{"$f":"CONCATENATE(Tableau1[[#This Row],[Code\nArticle]]&\",\"&Tableau1[[#This Row],[Nom du produit]]&\",\"&Tableau1[[#This Row],[Format]]&\",\"&Tableau1[[#This Row],[UVC]]&\",\"&Tableau1[[#This Row],[CUP]]&\",\"&Tableau1[[#This Row],[Catégorie]])","v":"606988,Cabernet-Sauvignon/Syrah J.P. Chenet vin de pays d'Oc,250,24,03263286324216,Vin rg petits formats"},{"$nulls":7},11,857177,null,"Clos la Coutale Cahors",750,12,"03499290000017","Vin rg France Sud-Ouest"]
[2,464669,null,{"$f":"VLOOKUP($B10,'Répertoire des produits'!$1:$1048576,4,FALSE)","v":"Cellier des Dauphins Prestige Côtes du Rhône"},{"$f":"VLOOKUP($B10,'Répertoire des produits'!$1:$1048576,5,FALSE)","v":250},{"$f":"VLOOKUP($B10,'Répertoire des produits'!$1:$1048576,6,FALSE)","v":24},{"$f":"VLOOKUP($B10,'Répertoire des produits'!$1:$1048576,3,FALSE)","v":"03179070184013"},{"$f":"VLOOKUP($B10,'Répertoire des produits'!$1:$1048576,2,FALSE)","v":"Vin rg petits formats"},{"$f":"CONCATENATE(Tableau1[[#This Row],[Code\nArticle]]&\",\"&Tableau1[[#This Row],[Nom du produit]]&\",\"&Tableau1[[#This Row],[Format]]&\",\"&Tableau1[[#This Row],[UVC]]&\",\"&Tableau1[[#This Row],[CUP]]&\",\"&Tableau1[[#This Row],[Catégorie]])","v":"464669,Cellier des Dauphins Prestige Côtes du Rhône,250,24,03179070184013,Vin rg petits formats"}]
[3,11184933,null,{"$f":"VLOOKUP($B11,'Répertoire des produits'!$1:$1048576,4,FALSE)","v":"Shiraz/Malbec Fuzion Zuccardi Mendoza"},{"$f":"VLOOKUP($B11,'Répertoire des produits'!$1:$1048576,5,FALSE)","v":375},{"$f":"VLOOKUP($B11,'Répertoire des produits'!$1:$1048576,6,FALSE)","v":24},{"$f":"VLOOKUP($B11,'Répertoire des produits'!$1:$1048576,3,FALSE)","v":"07791728023107"},{"$f":"VLOOKUP($B11,'Répertoire des produits'!$1:$1048576,2,FALSE)","v":"Vin rg petits formats"},{"$f":"CONCATENATE(Tableau1[[#This Row],[Code\nArticle]]&\",\"&Tableau1[[#This Row],[Nom du produit]]&\",\"&Tableau1[[#This Row],[Format]]&\",\"&Tableau1[[#This Row],[UVC]]&\",\"&Tableau1[[#This Row],[CUP]]&\",\"&Tableau1[[#This Row],[Catégorie]])","v":"11184933,Shiraz/Malbec Fuzion Zuccardi Mendoza,375,24,07791728023107,Vin rg petits formats"}]
[4,123778,null,{"$f":"VLOOKUP($B12,'Répertoire des produits'!$1:$1048576,4,FALSE)","v":"Benjamin Brunel Rasteau Côtes du Rhône Villages"},{"$f":"VLOOKUP($B12,'Répertoire des produits'!$1:$1048576,5,FALSE)","v":750},{"$f":"VLOOKUP($B12,'Répertoire des produits'!$1:$1048576,6,FALSE)","v":12},{"$f":"VLOOKUP($B12,'Répertoire des produits'!$1:$1048576,3,FALSE)","v":"03760168120008"},{"$f":"VLOOKUP($B12,'Répertoire des produits'!$1:$1048576,2,FALSE)","v":"Vin rg France Vallée du Rhône"},{"$f":"CONCATENATE(Tableau1[[#This Row],[Code\nArticle]]&\",\"&Tableau1[[#This Row],[Nom du produit]]&\",\"&Tableau1[[#This Row],[Format]]&\",\"&Tableau1[[#This Row],[UVC]]&\",\"&Tableau1[[#This Row],[CUP]]&\",\"&Tableau1[[#This Row],[Catégorie]])","v":"123778,Benjamin Brunel Rasteau Côtes du Rhône Villages,750,12,03760168120008,Vin rg France Vallée du Rhône"}]
[5,23358,null,{"$f":"VLOOKUP($B13,'Répertoire des produits'!$1:$1048576,4,FALSE)","v":"J. Lebègue Saint-Emilion"},{"$f":"VLOOKUP($B13,'Répertoire des produits'!$1:$1048576,5,FALSE)","v":750},{"$f":"VLOOKUP($B13,'Répertoire des produits'!$1:$1048576,6,FALSE)","v":12},{"$f":"VLOOKUP($B13,'Répertoire des produits'!$1:$1048576,3,FALSE)","v":"00618726000046"},{"$f":"VLOOKUP($B13,'Répertoire des produits'!$1:$1048576,2,FALSE)","v":"Vin rg France Bordeaux"},{"$f":"CONCATENATE(Tableau1[[#This Row],[Code\nArticle]]&\",\"&Tableau1[[#This Row],[Nom du produit]]&\",\"&Tableau1[[#This Row],[Format]]&\",\"&Tableau1[[#This Row],[UVC]]&\",\"&Tableau1[[#This Row],[CUP]]&\",\"&Tableau1[[#This Row],[Catégorie]])","v":"23358,J. Lebègue Saint-Emilion,750,12,00618726000046,Vin rg France Bordeaux"}]
[6,237875,null,{"$f":"VLOOKUP($B14,'Répertoire des produits'!$1:$1048576,4,FALSE)","v":"Bourgogne Pinot noir Réserve Chèvre noire Boisseaux-Estivan"},{"$f":"VLOOKUP($B14,'Répertoire des produits'!$1:$1048576,5,FALSE)","v":750},{"$f":"VLOOKUP($B14,'Répertoire des produits'!$1:$1048576,6,FALSE)","v":12},{"$f":"VLOOKUP($B14,'Répertoire des produits'!$1:$1048576,3,FALSE)","v":"03700061600207"},{"$f":"VLOOKUP($B14,'Répertoire des produits'!$1:$1048576,2,FALSE)","v":"Vin rg France Bourgogne"},{"$f":"CONCATENATE(Tableau1[[#This Row],[Code\nArticle]]&\",\"&Tableau1[[#This Row],[Nom du produit]]&\",\"&Tableau1[[#This Row],[Format]]&\",\"&Tableau1[[#This Row],[UVC]]&\",\"&Tableau1[[#This Row],[CUP]]&\",\"&Tableau1[[#This Row],[Catégorie]])","v":"237875,Bourgogne Pinot noir Réserve Chèvre noire Boisseaux-Estivan,750,12,03700061600207,Vin rg France Bourgogne"}]
[7,70540,null,{"$f":"VLOOKUP($B15,'Répertoire des produits'!$1:$1048576,4,FALSE)","v":"Brouilly Georges Duboeuf"},{"$f":"VLOOKUP($B15,'Répertoire des produits'!$1:$1048576,5,FALSE)","v":750},{"$f":"VLOOKUP($B15,'Répertoire des produits'!$1:$1048576,6,FALSE)","v":12},{"$f":"VLOOKUP($B15,'Répertoire des produits'!$1:$1048576,3,FALSE)","v":"03351650001662"},{"$f":"VLOOKUP($B15,'Répertoire des produits'!$1:$1048576,2,FALSE)","v":"Vin rg France Beaujolais"},{"$f":"CONCATENATE(Tableau1[[#This Row],[Code\nArticle]]&\",\"&Tableau1[[#This Row],[Nom du produit]]&\",\"&Tableau1[[#This Row],[Format]]&\",\"&Tableau1[[#This Row],[UVC]]&\",\"&Tableau1[[#This Row],[CUP]]&\",\"&Tableau1[[#This Row],[Catégorie]])","v":"70540,Brouilly Georges Duboeuf,750,12,03351650001662,Vin rg France Beaujolais"}]
[8,628123,null,{"$f":"VLOOKUP($B16,'Répertoire des produits'!$1:$1048576,4,FALSE)","v":"Brouilly Mignot"},{"$f":"VLOOKUP($B16,'Répertoire des produits'!$1:$1048576,5,FALSE)","v":750},{"$f":"VLOOKUP($B16,'Répertoire des produits'!$1:$1048576,6,FALSE)","v":12},{"$f":"VLOOKUP($B16,'Répertoire des produits'!$1:$1048576,3,FALSE)","v":"03257651018886"},{"$f":"VLOOKUP($B16,'Répertoire des produits'!$1:$1048576,2,FALSE)","v":"Vin rg France Beaujolais"},{"$f":"CONCATENATE(Tableau1[[#This Row],[Code\nArticle]]&\",\"&Tableau1[[#This Row],[Nom du produit]]&\",\"&Tableau1[[#This Row],[Format]]&\",\"&Tableau1[[#This Row],[UVC]]&\",\"&Tableau1[[#This Row],[CUP]]&\",\"&Tableau1[[#This Row],[Catégorie]])","v":"628123,Brouilly Mignot,750,12,03257651018886,Vin rg France Beaujolais"}]
[9,13152142,null,"merlot grand sud",1000,12,null,"vin rouge de France",{"$f":"CONCATENATE(Tableau1[[#This Row],[Code\nArticle]]&\",\"&Tableau1[[#This Row],[Nom du produit]]&\",\"&Tableau1[[#This Row],[Format]]&\",\"&Tableau1[[#This Row],[UVC]]&\",\"&Tableau1[[#This Row],[CUP]]&\",\"&Tableau1[[#This Row],[Catégorie]])","v":"13152142,merlot grand sud,1000,12,,vin rouge de France"}]
[10,12167211,null,{"$f":"VLOOKUP($B18,'Répertoire des produits'!$1:$1048576,4,FALSE)","v":"Vive la vie"},{"$f":"VLOOKUP($B18,'Répertoire des produits'!$1:$1048576,5,FALSE)","v":750},{"$f":"VLOOKUP($B18,'Répertoire des produits'!$1:$1048576,6,FALSE)","v":12},{"$f":"VLOOKUP($B18,'Répertoire des produits'!$1:$1048576,3,FALSE)","v":"03263280111270"},{"$f":"VLOOKUP($B18,'Répertoire des produits'!$1:$1048576,2,FALSE)","v":"Vin rg France autres régions"},{"$f":"CONCATENATE(Tableau1[[#This Row],[Code\nArticle]]&\",\"&Tableau1[[#This Row],[Nom du produit]]&\",\"&Tableau1[[#This Row],[Format]]&\",\"&Tableau1[[#This Row],[UVC]]&\",\"&Tableau1[[#This Row],[CUP]]&\",\"&Tableau1[[#This Row],[Catégorie]])","v":"12167211,Vive la vie,750,12,03263280111270,Vin rg France autres régions"}]
[11,857177,null,{"$f":"VLOOKUP($B19,'Répertoire des produits'!$1:$1048576,4,FALSE)","v":"Clos la Coutale Cahors"},{"$f":"VLOOKUP($B19,'Répertoire des produits'!$1:$1048576,5,FALSE)","v":750},{"$f":"VLOOKUP($B19,'Répertoire des produits'!$1:$1048576,6,FALSE)","v":12},{"$f":"VLOOKUP($B19,'Répertoire des produits'!$1:$1048576,3,FALSE)","v":"03499290000017"},{"$f":"VLOOKUP($B19,'Répertoire des produits'!$1:$1048576,2,FALSE)","v":"Vin rg France Sud-Ouest"},{"$f":"CONCATENATE(Tableau1[[#This Row],[Code\nArticle]]&\",\"&Tableau1[[#This Row],[Nom du produit]]&\",\"&Tableau1[[#This Row],[Format]]&\",\"&Tableau1[[#This Row],[UVC]]&\",\"&Tableau1[[#This Row],[CUP]]&\",\"&Tableau1[[#This Row],[Catégorie]])","v":"857177,Clos la Coutale Cahors,750,12,03499290000017,Vin rg France Sud-Ouest"}]
[12,221218,null,{"$f":"VLOOKUP($B20,'Répertoire des produits'!$1:$1048576,4,FALSE)","v":"Comte André de Monpezat Cahors"},{"$f":"VLOOKUP($B20,'Répertoire des produits'!$1:$1048576,5,FALSE)","v":750},{"$f":"VLOOKUP($B20,'Répertoire des produits'!$1:$1048576,6,FALSE)","v":12},{"$f":"VLOOKUP($B20,'Répertoire des produits'!$1:$1048576,3,FALSE)","v":"03180611046646"},{"$f":"VLOOKUP($B20,'Répertoire des produits'!$1:$1048576,2,FALSE)","v":"Vin rg France Sud-Ouest"},{"$f":"CONCATENATE(Tableau1[[#This Row],[Code\nArticle]]&\",\"&Tableau1[[#This Row],[Nom du produit]]&\",\"&Tableau1[[#This Row],[Format]]&\",\"&Tableau1[[#This Row],[UVC]]&\",\"&Tableau1[[#This Row],[CUP]]&\",\"&Tableau1[[#This Row],[Catégorie]])","v":"221218,Comte André de Monpezat Cahors,750,12,03180611046646,Vin rg France Sud-Ouest"}]
[13,943,null,{"$f":"VLOOKUP($B21,'Répertoire des produits'!$1:$1048576,4,FALSE)","v":"Mouton Cadet Bordeaux"},{"$f":"VLOOKUP($B21,'Répertoire des produits'!$1:$1048576,5,FALSE)","v":750},{"$f":"VLOOKUP($B21,'Répertoire des produits'!$1:$1048576,6,FALSE)","v":12},{"$f":"VLOOKUP($B21,'Répertoire des produits'!$1:$1048576,3,FALSE)","v":"03262151001757"},{"$f":"VLOOKUP($B21,'Répertoire des produits'!$1:$1048576,2,FALSE)","v":"Vin rg France Bordeaux"},{"$f":"CONCATENATE(Tableau1[[#This Row],[Code\nArticle]]&\",\"&Tableau1[[#This Row],[Nom du produit]]&\",\"&Tableau1[[#This Row],[Format]]&\",\"&Tableau1[[#This Row],[UVC]]&\",\"&Tableau1[[#This Row],[CUP]]&\",\"&Tableau1[[#This Row],[Catégorie]])","v":"943,Mouton Cadet Bordeaux,750,12,03262151001757,Vin rg France Bordeaux"}]
[14,303529,null,{"$f":"VLOOKUP($B22,'Répertoire des produits'!$1:$1048576,4,FALSE)","v":"Château St-Didier-Parnac Cahors"},{"$f":"VLOOKUP($B22,'Répertoire des produits'!$1:$1048576,5,FALSE)","v":750},{"$f":"VLOOKUP($B22,'Répertoire des produits'!$1:$1048576,6,FALSE)","v":12},{"$f":"VLOOKUP($B22,'Répertoire des produits'!$1:$1048576,3,FALSE)","v":"03180611029175"},{"$f":"VLOOKUP($B22,'Répertoire des produits'!$1:$1048576,2,FALSE)","v":"Vin rg France Sud-Ouest"},{"$f":"CONCATENATE(Tableau1[[#This Row],[Code\nArticle]]&\",\"&Tableau1[[#This Row],[Nom du produit]]&\",\"&Tableau1[[#This Row],[Format]]&\",\"&Tableau1[[#This Row],[UVC]]&\",\"&Tableau1[[#This Row],[CUP]]&\",\"&Tableau1[[#This Row],[Catégorie]])","v":"303529,Château St-Didier-Parnac Cahors,750,12,03180611029175,Vin rg France Sud-Ouest"}]
[15,10802904,null,{"$f":"VLOOKUP($B23,'Répertoire des produits'!$1:$1048576,4,FALSE)","v":"Pinot noir Les Jamelles vin de pays d'Oc"},{"$f":"VLOOKUP($B23,'Répertoire des produits'!$1:$1048576,5,FALSE)","v":750},{"$f":"VLOOKUP($B23,'Répertoire des produits'!$1:$1048576,6,FALSE)","v":12},{"$f":"VLOOKUP($B23,'Répertoire des produits'!$1:$1048576,3,FALSE)","v":"03525490013240"},{"$f":"VLOOKUP($B23,'Répertoire des produits'!$1:$1048576,2,FALSE)","v":"Vin rg France Languedoc"},{"$f":"CONCATENATE(Tableau1[[#This Row],[Code\nArticle]]&\",\"&Tableau1[[#This Row],[Nom du produit]]&\",\"&Tableau1[[#This Row],[Format]]&\",\"&Tableau1[[#This Row],[UVC]]&\",\"&Tableau1[[#This Row],[CUP]]&\",\"&Tableau1[[#This Row],[Catégorie]])","v":"10802904,Pinot noir Les Jamelles vin de pays d'Oc,750,12,03525490013240,Vin rg France Languedoc"}]
[16,10374997,null,{"$f":"VLOOKUP($B24,'Répertoire des produits'!$1:$1048576,4,FALSE)","v":"Pinot noir De La Chevalière vin de pays d'Oc"},{"$f":"VLOOKUP($B24,'Répertoire des produits'!$1:$1048576,5,FALSE)","v":750},{"$f":"VLOOKUP($B24,'Répertoire des produits'!$1:$1048576,6,FALSE)","v":12},{"$f":"VLOOKUP($B24,'Répertoire des produits'!$1:$1048576,3,FALSE)","v":"03546680019415"},{"$f":"VLOOKUP($B24,'Répertoire des produits'!$1:$1048576,2,FALSE)","v":"Vin rg France Languedoc"},{"$f":"CONCATENATE(Tableau1[[#This Row],[Code\nArticle]]&\",\"&Tableau1[[#This Row],[Nom du produit]]&\",\"&Tableau1[[#This Row],[Format]]&\",\"&Tableau1[[#This Row],[UVC]]&\",\"&Tableau1[[#This Row],[CUP]]&\",\"&Tableau1[[#This Row],[Catégorie]])","v":"10374997,Pinot noir De La Chevalière vin de pays d'Oc,750,12,03546680019415,Vin rg France Languedoc"}]
[17,365924,null,{"$f":"VLOOKUP($B25,'Répertoire des produits'!$1:$1048576,4,FALSE)","v":"Beaujolais Villages Combe aux Jacques Louis Jadot"},{"$f":"VLOOKUP($B25,'Répertoire des produits'!$1:$1048576,5,FALSE)","v":750},{"$f":"VLOOKUP($B25,'Répertoire des produits'!$1:$1048576,6,FALSE)","v":12},{"$f":"VLOOKUP($B25,'Répertoire des produits'!$1:$1048576,3,FALSE)","v":"03535923001003"},{"$f":"VLOOKUP($B25,'Répertoire des produits'!$1:$1048576,2,FALSE)","v":"Vin rg France Beaujolais"},{"$f":"CONCATENATE(Tableau1[[#This Row],[Code\nArticle]]&\",\"&Tableau1[[#This Row],[Nom du produit]]&\",\"&Tableau1[[#This Row],[Format]]&\",\"&Tableau1[[#This Row],[UVC]]&\",\"&Tableau1[[#This Row],[CUP]]&\",\"&Tableau1[[#This Row],[Catégorie]])","v":"365924,Beaujolais Villages Combe aux Jacques Louis Jadot,750,12,03535923001003,Vin rg France Beaujolais"}]
[18,2881,null,{"$f":"VLOOKUP($B26,'Répertoire des produits'!$1:$1048576,4,FALSE)","v":"Beaujolais Pisse-Dru Noémie Vernaux"},{"$f":"VLOOKUP($B26,'Répertoire des produits'!$1:$1048576,5,FALSE)","v":750},{"$f":"VLOOKUP($B26,'Répertoire des produits'!$1:$1048576,6,FALSE)","v":12},{"$f":"VLOOKUP($B26,'Répertoire des produits'!$1:$1048576,3,FALSE)","v":"03040072510509"},{"$f":"VLOOKUP($B26,'Répertoire des produits'!$1:$1048576,2,FALSE)","v":"Vin rg France Beaujolais"},{"$f":"CONCATENATE(Tableau1[[#This Row],[Code\nArticle]]&\",\"&Tableau1[[#This Row],[Nom du produit]]&\",\"&Tableau1[[#This Row],[Format]]&\",\"&Tableau1[[#This Row],[UVC]]&\",\"&Tableau1[[#This Row],[CUP]]&\",\"&Tableau1[[#This Row],[Catégorie]])","v":"2881,Beaujolais Pisse-Dru Noémie Vernaux,750,12,03040072510509,Vin rg France Beaujolais"}]
[19,11374391,null,{"$f":"VLOOKUP($B27,'Répertoire des produits'!$1:$1048576,4,FALSE)","v":"Terre à Terre Corbières"},{"$f":"VLOOKUP($B27,'Répertoire des produits'!$1:$1048576,5,FALSE)","v":750},{"$f":"VLOOKUP($B27,'Répertoire des produits'!$1:$1048576,6,FALSE)","v":12},{"$f":"VLOOKUP($B27,'Répertoire des produits'!$1:$1048576,3,FALSE)","v":"03564732005094"},{"$f":"VLOOKUP($B27,'Répertoire des produits'!$1:$1048576,2,FALSE)","v":"Vin rg France Languedoc"},{"$f":"CONCATENATE(Tableau1[[#This Row],[Code\nArticle]]&\",\"&Tableau1[[#This Row],[Nom du produit]]&\",\"&Tableau1[[#This Row],[Format]]&\",\"&Tableau1[[#This Row],[UVC]]&\",\"&Tableau1[[#This Row],[CUP]]&\",\"&Tableau1[[#This Row],[Catégorie]])","v":"11374391,Terre à Terre Corbières,750,12,03564732005094,Vin rg France Languedoc"}]
[20,331090,null,{"$f":"VLOOKUP($B28,'Répertoire des produits'!$1:$1048576,4,FALSE)","v":"Grande Réserve des Challières Côtes du Ventoux"},{"$f":"VLOOKUP($B28,'Répertoire des produits'!$1:$1048576,5,FALSE)","v":750},{"$f":"VLOOKUP($B28,'Répertoire des produits'!$1:$1048576,6,FALSE)","v":12},{"$f":"VLOOKUP($B28,'Répertoire des produits'!$1:$1048576,3,FALSE)","v":"03260980006110"},{"$f":"VLOOKUP($B28,'Répertoire des produits'!$1:$1048576,2,FALSE)","v":"Vin rg France Vallée du Rhône"},{"$f":"CONCATENATE(Tableau1[[#This Row],[Code\nArticle]]&\",\"&Tableau1[[#This Row],[Nom du produit]]&\",\"&Tableau1[[#This Row],[Format]]&\",\"&Tableau1[[#This Row],[UVC]]&\",\"&Tableau1[[#This Row],[CUP]]&\",\"&Tableau1[[#This Row],[Catégorie]])","v":"331090,Grande Réserve des Challières Côtes du Ventoux,750,12,03260980006110,Vin rg France Vallée du Rhône"}]
[21,11459482,null,"beaujolais fun georges duboeuf",750,12,null,"vin rouge France",{"$f":"CONCATENATE(Tableau1[[#This Row],[Code\nArticle]]&\",\"&Tableau1[[#This Row],[Nom du produit]]&\",\"&Tableau1[[#This Row],[Format]]&\",\"&Tableau1[[#This Row],[UVC]]&\",\"&Tableau1[[#This Row],[CUP]]&\",\"&Tableau1[[#This Row],[Catégorie]])","v":"11459482,beaujolais fun georges duboeuf,750,12,,vin rouge France"}]
[22,10536757,null,{"$f":"VLOOKUP($B30,'Répertoire des produits'!$1:$1048576,4,FALSE)","v":"Cab.-Sauv./Syrah J.P. Chenet vin de pays d'Oc"},{"$f":"VLOOKUP($B30,'Répertoire des produits'!$1:$1048576,5,FALSE)","v":750},{"$f":"VLOOKUP($B30,'Répertoire des produits'!$1:$1048576,6,FALSE)","v":12},{"$f":"VLOOKUP($B30,'Répertoire des produits'!$1:$1048576,3,FALSE)","v":"03263286301323"},{"$f":"VLOOKUP($B30,'Répertoire des produits'!$1:$1048576,2,FALSE)","v":"Vin rg France Languedoc"},{"$f":"CONCATENATE(Tableau1[[#This Row],[Code\nArticle]]&\",\"&Tableau1[[#This Row],[Nom du produit]]&\",\"&Tableau1[[#This Row],[Format]]&\",\"&Tableau1[[#This Row],[UVC]]&\",\"&Tableau1[[#This Row],[CUP]]&\",\"&Tableau1[[#This Row],[Catégorie]])","v":"10536757,Cab.-Sauv./Syrah J.P. Chenet vin de pays d'Oc,750,12,03263286301323,Vin rg France Languedoc"}]
{"$rows_left_out":329}
{"sheet":"Répertoire des produits","index":1,"n_rows":2193,"n_cols":8,"rows_kept":2193}
["Code SAQ","Catégorie","Code CUP","Nom du produit","Format (ml)","Nombre d'unités / caisse (UVC)","Mode d'approvisionnement","Statut"]
[42,"Whisky","00080686816157","Canadian Club whisky canadien",750,12,"Courant achat continu","Article actif"]
[67,"Vodka et Alcool","00776103000260","Smirnoff triple distillation vodka",750,12,"Courant achat continu","Article actif"]
[117,"Rhum","00620213015402","Bacardi Superior rhum blanc",750,12,"Courant achat continu","Article actif"]
[166,"Vin rosé","05601012011500","Mateus rosé",750,12,"Courant achat continu","Article actif"]
[240,"Spiritueux 200 à 375 ML","00776103000246","Smirnoff triple distillation vodka",375,24,"Courant achat continu","Article actif"]
[356,"Apéritif","03163933575001","Dubonnet rouge apéritif",750,12,"Courant achat continu","Article actif"]
[406,"Gin","00088004400507","de Kuyper genièvre",1140,12,"Courant achat continu","Article actif"]
[463,"Spiritueux 200 à 375 ML","00080686816027","Canadian Club whisky canadien",375,24,"Courant achat continu","Article actif"]
[513,"Vin rg France autres régions","03264380027034","Cuvée Saint Pierre Mommessin rouge",750,12,"Courant achat continu","Article actif"]
[570,"Gin","05000329002216","Beefeater London dry gin",750,12,"Courant achat continu","Article actif"]
[596,"Spiritueux 200 à 375 ML","00620213015600","Ron Bacardi rhum blanc",375,24,"Courant achat continu","Article actif"]
[711,"Vin bl Italie autres régions","08001333700010","Fontana di Papa Colli Albani",1000,12,"Courant achat continu","Article actif"]
[935,"Rhum","00082000749974","Captain Morgan rhum blanc",750,12,"Courant achat continu","Article en écoulement"]
[943,"Vin rg France Bordeaux","03262151001757","Mouton Cadet Bordeaux",750,12,"Courant achat continu","Article actif"]
[1016,"Vin rg Italie autres régions","08001333700027","Fontana di Papa Castelli Romani",1000,12,"Courant achat continu","Article actif"]
[1040,"Gin","00622153139040","Gordon's London dry gin",750,12,"Courant achat continu","Article actif"]
[1099,"Whisky Ecosse","00622153631049","Johnnie Walker Red Label scotch blended",750,12,"Courant achat continu","Article actif"]
[1206,"Rhum","00620213025401","Bacardi Gold rhum ambré",750,12,"Courant achat continu","Article actif"]
[1339,"Gin","00088004400538","De Kuyper Genièvre",750,12,"Courant achat continu","Article actif"]
[1487,"Whisky","00087000007253","Crown Royal whisky canadien",750,12,"Courant achat continu","Article actif"]
[1743,"Vin rg Italie Toscane","08001660101757","Ruffino Chianti",750,12,"Courant achat continu","Article actif"]
[1784,"Liqueur","03018300000191","Grand Marnier liqueur d'agrumes",750,12,"Courant achat continu","Article actif"]
[1867,"Liqueur","00010391100753","Drambuie liqueur d'herbe",750,12,"Spécialité achat continu","Article actif"]
[1925,"Brandy et Cognac","03049197110236","Courvoisier Cognac V.S.",750,12,"Courant achat continu","Article actif"]
[2048,"Apéritif","08000440112891","Stock vermouth",1000,12,"Courant achat continu","Article actif"]
[2253,"Liqueur","00050037014501","Amaretto Disaronno Originale liqueur",750,12,"Courant achat continu","Article actif"]
[2337,"Apéritif","03394210004109","St-Raphaël apéritif",750,12,"Courant achat continu","Article actif"]
[2444,"Rhum","00622153160044","Ron Carioca rhum blanc",750,12,"Courant achat continu","Article actif"]
[2485,"Tequila","00080686832010","Sauza Silver tequila",750,12,"Courant achat continu","Article actif"]
{"$rows_left_out":2163}