{"text_format":"3","workbook":"xlsx","n_sheets":9,"sheets":["Feuil1","Finding report","General Findings","parts finding","TCD NW&T","TCD MM","TCD Missing","TCD FOD","TCD SUP"],"not_rendered":{"macros":1,"defined_names":1,"pivot_tables":5},"read":"whole","date_system":"1900"}

{"sheet":"Feuil1","index":0,"n_rows":1031,"n_cols":29,"rows_kept":1031}
["Sno","Op","Comp no/Wrk ctr","Qty/Run tm","Activ","U/M","Quantity","Date","Sts","Estimated cost","Itp","Whs","Itc","Report qty","Op description","Service","Description","Ret","Sup","Description","Main attr 1","Element","Ref ol","Pl dt","PO no","Non-mtrl","Psts","Order line","-"]
[null,10,"LOGIST",{"$nulls":3},1,50719,90,{"$nulls":5},"LOGISTICS","REPAIR","25-11-46, 25-11-58",{"$nulls":5},10]
[1,330,"SCN900-005-01",1,null,"EA",1,260719,90,10.26,110,"LW1",null,1,"SCN900-005-01",null,"LABEL, HIGH VOLTAGE",{"$nulls":8},0]
[2,330,"SB3-070-002-01",1,null,"EA",1,260719,90,242.1,110,"LW1",null,1,"SB3-070-002-01",null,"HEAD LAP BLOCK",{"$nulls":8},0]
[3,330,"EN3646A61210MN",1,null,"EA",1,260719,60,null,110,"LW1",null,null,"EN3646A61210MN",null,"PLUG",{"$nulls":8},0]
[4,330,"NSA938150-03-12",1,null,"EA",1,260719,90,48,110,"LW1",null,1,"NSA938150-03-12",null,"ADAPTER, CABLE CLAMP",{"$nulls":8},0]
[5,330,"NSA935805-12",1,null,"EA",1,260719,60,null,110,"LW1",null,null,"NSA935805-12",null,"GAINE FLEXIBLE ELECTRIQUE",{"$nulls":8},0]
[6,330,"8526-1348",4,null,"EA",4,260719,90,6.72,110,"LW1",null,4,"8526-1348",null,"CONTACT",{"$nulls":8},0]
[7,330,"ABS0073-313",4,null,"EA",4,50719,94,null,110,"LW1",null,null,"ABS0073-313",null,"LAMP",{"$nulls":8},0]
[8,330,"NYC0S0L4",2,null,"BX",2,260719,90,28.04,110,"LW1",null,2,"TT-I-735",null,"SOLVANT",{"$nulls":8},0]
[9,330,"8525-860A",1,null,"EA",1,260719,60,33.74,110,"LW1",null,null,"8525-860A",null,"SLEEVE",{"$nulls":8},0]
[10,330,"SB3-070-000-02",1,null,"EA",1,260719,90,243.38,110,"LW1",null,1,"SB3-070-000-02",null,"ASSEMBLY",{"$nulls":8},0]
[11,330,"E0043-1B0",2,null,"EA",2,260719,90,0.15,110,"LW1",null,2,"E0043-1B0",null,"E0043-1B0\\COLLIER DE FRETTAGE",{"$nulls":8},0]
[12,330,"4136290006R",1,null,"EA",1,260719,90,899.34,130,"LW1",8,1,"4136290006R",null,"ACTUATOR",{"$nulls":8},0]
[13,330,"ET3-200-014-09",1,null,"EA",1,260719,90,3.85,110,"LW1",null,1,"ET3-200-014-09",null,"LABEL",{"$nulls":8},0]
[14,330,"MS21083N5",1,null,"EA",1,260719,90,0.4,110,"LW1",null,1,"MS21083N5",null,"NUT . 52NTE054",{"$nulls":8},0]
[15,330,"23351AC080LE",1,null,"EA",1,260719,90,0.72,110,"LW1",null,1,"23351AC080LE",null,"LOCK PLATE",{"$nulls":8},0]
[16,330,"NSA935401-03",6,null,"EA",6,260719,90,0.19,110,"LW1",null,6,"NSA935401-03",null,"HOLDING CLAMP",{"$nulls":8},0]
[17,330,"E0043-4B0",1,null,"EA",1,260719,90,1.44,110,"LW1",null,1,"E0043-4B0",null,"CLAMP",{"$nulls":8},0]
[18,330,"NSA935401-05",3,null,"EA",3,260719,90,0.26,110,"LW1",null,3,"NSA935401-05",null,"TY-RAP",{"$nulls":8},0]
[19,330,"TAAI3-427030-01",1,null,"EA",1,260719,90,10.34,110,"LW1",null,1,"TAAI3-427030-01",null,"BONDING BRAID",{"$nulls":8},0]
[20,330,"NAS679A3",1,null,"EA",1,260719,90,0.42,110,"LW1",null,1,"NAS679A3",null,"NUT",{"$nulls":8},0]
[21,330,"8526-1348",3,null,"EA",3,260719,90,5.04,110,"LW1",null,3,"8526-1348",null,"CONTACT",{"$nulls":8},0]
[null,330,"D120",15,null,null,1,260719,70,540,{"$nulls":4},"REPAIR","REPAIR","25-11-46, 25-11-58",{"$nulls":5},10]
{"$rows_empty":457}
[null,null,"",null,null,"",{"$nulls":3},"",null,"","","","","",""]
[null,null,"",null,null,"",{"$nulls":3},"",null,"","","","","",""]
[null,null,"",null,null,"",{"$nulls":3},"",null,"","","","","",""]
[null,null,"",null,null,"",{"$nulls":3},"",null,"","","","","",""]
[null,null,"",null,null,"",{"$nulls":3},"",null,"","","","","",""]
[null,null,"",null,null,"",{"$nulls":3},"",null,"","","","","",""]
[null,null,"",null,null,"",{"$nulls":3},"",null,"","","","","",""]
[null,null,"",null,null,"",{"$nulls":3},"",null,"","","","","",""]
[null,null,"",null,null,"",{"$nulls":3},"",null,"","","","","",""]
[null,null,"",null,null,"",{"$nulls":3},"",null,"","","","","",""]
[null,null,"",null,null,"",{"$nulls":3},"",null,"","","","","",""]
[null,null,"",null,null,"",{"$nulls":3},"",null,"","","","","",""]
[null,null,"",null,null,"",{"$nulls":3},"",null,"","","","","",""]
[null,null,"",null,null,"",{"$nulls":3},"",null,"","","","","",""]
[null,null,"",null,null,"",{"$nulls":3},"",null,"","","","","",""]
[null,null,"",null,null,"",{"$nulls":3},"",null,"","","","","",""]
[null,null,"",null,null,"",{"$nulls":3},"",null,"","","","","",""]
[null,null,"",null,null,"",{"$nulls":3},"",null,"","","","","",""]
[null,null,"",null,null,"",{"$nulls":3},"",null,"","","","","",""]
[null,null,"",null,null,"",{"$nulls":3},"",null,"","","","","",""]
[null,null,"",null,null,"",{"$nulls":3},"",null,"","","","","",""]
[null,null,"",null,null,"",{"$nulls":3},"",null,"","","","","",""]
[null,null,"",null,null,"",{"$nulls":3},"",null,"","","","","",""]
[null,null,"",null,null,"",{"$nulls":3},"",null,"","","","","",""]
[null,null,"",null,null,"",{"$nulls":3},"",null,"","","","","",""]
[null,null,"",null,null,"",{"$nulls":3},"",null,"","","","","",""]
[null,null,"",null,null,"",{"$nulls":3},"",null,"","","","","",""]
[null,null,"",null,null,"",{"$nulls":3},"",null,"","","","","",""]
[null,null,"",null,null,"",{"$nulls":3},"",null,"","","","","",""]
[null,null,"",null,null,"",{"$nulls":3},"",null,"","","","","",""]
[null,null,"",null,null,"",{"$nulls":3},"",null,"","","","","",""]
[null,null,"",null,null,"",{"$nulls":3},"",null,"","","","","",""]
[null,null,"",null,null,"",{"$nulls":3},"",null,"","","","","",""]
[null,null,"",null,null,"",{"$nulls":3},"",null,"","","","","",""]
[null,null,"",null,null,"",{"$nulls":3},"",null,"","","","","",""]
[null,null,"",null,null,"",{"$nulls":3},"",null,"","","","","",""]
[null,null,"",null,null,"",{"$nulls":3},"",null,"","","","","",""]
[null,null,"",null,null,"",{"$nulls":3},"",null,"","","","","",""]
[null,null,"",null,null,"",{"$nulls":3},"",null,"","","","","",""]
[null,null,"",null,null,"",{"$nulls":3},"",null,"","","","","",""]
[null,null,"",null,null,"",{"$nulls":3},"",null,"","","","","",""]
[null,null,"",null,null,"",{"$nulls":3},"",null,"","","","","",""]
[null,null,"",null,null,"",{"$nulls":3},"",null,"","","","","",""]
[null,null,"",null,null,"",{"$nulls":3},"",null,"","","","","",""]
[null,null,"",null,null,"",{"$nulls":3},"",null,"","","","","",""]
[null,null,"",null,null,"",{"$nulls":3},"",null,"","","","","",""]
[null,null,"",null,null,"",{"$nulls":3},"",null,"","","","","",""]
[null,null,"",null,null,"",{"$nulls":3},"",null,"","","","","",""]
[null,null,"",null,null,"",{"$nulls":3},"",null,"","","","","",""]
[null,null,"",null,null,"",{"$nulls":3},"",null,"","","","","",""]
[null,null,"",null,null,"",{"$nulls":3},"",null,"","","","","",""]
[null,null,"",null,null,"",{"$nulls":3},"",null,"","","","","",""]
[null,null,"",null,null,"",{"$nulls":3},"",null,"","","","","",""]
[null,null,"",null,null,"",{"$nulls":3},"",null,"","","","","",""]
[null,null,"",null,null,"",{"$nulls":3},"",null,"","","","","",""]
[null,null,"",null,null,"",{"$nulls":3},"",null,"","","","","",""]
[null,null,"",null,null,"",{"$nulls":3},"",null,"","","","","",""]
[null,null,"",null,null,"",{"$nulls":3},"",null,"","","","","",""]
[null,null,"",null,null,"",{"$nulls":3},"",null,"","","","","",""]
[null,null,"",null,null,"",{"$nulls":3},"",null,"","","","","",""]
[null,null,"",null,null,"",{"$nulls":3},"",null,"","","","","",""]
[null,null,"",null,null,"",{"$nulls":3},"",null,"","","","","",""]
[null,null,"",null,null,"",{"$nulls":3},"",null,"","","","","",""]
[null,null,"",null,null,"",{"$nulls":3},"",null,"","","","","",""]
[null,null,"",null,null,"",{"$nulls":3},"",null,"","","","","",""]
[null,null,"",null,null,"",{"$nulls":3},"",null,"","","","","",""]
[null,null,"",null,null,"",{"$nulls":3},"",null,"","","","","",""]
[null,null,"",null,null,"",{"$nulls":3},"",null,"","","","","",""]
[null,null,"",null,null,"",{"$nulls":3},"",null,"","","","","",""]
[null,null,"",null,null,"",{"$nulls":3},"",null,"","","","","",""]
[null,null,"",null,null,"",{"$nulls":3},"",null,"","","","","",""]
[null,null,"",null,null,"",{"$nulls":3},"",null,"","","","","",""]
[null,null,"",null,null,"",{"$nulls":3},"",null,"","","","","",""]
[null,null,"",null,null,"",{"$nulls":3},"",null,"","","","","",""]
[null,null,"",null,null,"",{"$nulls":3},"",null,"","","","","",""]
[null,null,"",null,null,"",{"$nulls":3},"",null,"","","","","",""]
[null,null,"",null,null,"",{"$nulls":3},"",null,"","","","","",""]
[null,null,"",null,null,"",{"$nulls":3},"",null,"","","","","",""]
[null,null,"",null,null,"",{"$nulls":3},"",null,"","","","","",""]
[null,null,"",null,null,"",{"$nulls":3},"",null,"","","","","",""]
[null,null,"",null,null,"",{"$nulls":3},"",null,"","","","","",""]
[null,null,"",null,null,"",{"$nulls":3},"",null,"","","","","",""]
[null,null,"",null,null,"",{"$nulls":3},"",null,"","","","","",""]
[null,null,"",null,null,"",{"$nulls":3},"",null,"","","","","",""]
[null,null,"",null,null,"",{"$nulls":3},"",null,"","","","","",""]
[null,null,"",null,null,"",{"$nulls":3},"",null,"","","","","",""]
[null,null,"",null,null,"",{"$nulls":3},"",null,"","","","","",""]
[null,null,"",null,null,"",{"$nulls":3},"",null,"","","","","",""]
[null,null,"",null,null,"",{"$nulls":3},"",null,"","","","","",""]
[null,null,"",null,null,"",{"$nulls":3},"",null,"","","","","",""]
[null,null,"",null,null,"",{"$nulls":3},"",null,"","","","","",""]
[null,null,"",null,null,"",{"$nulls":3},"",null,"","","","","",""]
[null,null,"",null,null,"",{"$nulls":3},"",null,"","","","","",""]
[null,null,"",null,null,"",{"$nulls":3},"",null,"","","","","",""]
[null,null,"",null,null,"",{"$nulls":3},"",null,"","","","","",""]
[null,null,"",null,null,"",{"$nulls":3},"",null,"","","","","",""]
[null,null,"",null,null,"",{"$nulls":3},"",null,"","","","","",""]
[null,null,"",null,null,"",{"$nulls":3},"",null,"","","","","",""]
[null,null,"",null,null,"",{"$nulls":3},"",null,"","","","","",""]
[null,null,"",null,null,"",{"$nulls":3},"",null,"","","","","",""]
[null,null,"",null,null,"",{"$nulls":3},"",null,"","","","","",""]
[null,null,"",null,null,"",{"$nulls":3},"",null,"","","","","",""]
[null,null,"",null,null,"",{"$nulls":3},"",null,"","","","","",""]
[null,null,"",null,null,"",{"$nulls":3},"",null,"","","","","",""]
[null,null,"",null,null,"",{"$nulls":3},"",null,"","","","","",""]
[null,null,"",null,null,"",{"$nulls":3},"",null,"","","","","",""]
[null,null,"",null,null,"",{"$nulls":3},"",null,"","","","","",""]
[null,null,"",null,null,"",{"$nulls":3},"",null,"","","","","",""]
[null,null,"",null,null,"",{"$nulls":3},"",null,"","","","","",""]
[null,null,"",null,null,"",{"$nulls":3},"",null,"","","","","",""]
[null,null,"",null,null,"",{"$nulls":3},"",null,"","","","","",""]
[null,null,"",null,null,"",{"$nulls":3},"",null,"","","","","",""]
[null,null,"",null,null,"",{"$nulls":3},"",null,"","","","","",""]
[null,null,"",null,null,"",{"$nulls":3},"",null,"","","","","",""]
[null,null,"",null,null,"",{"$nulls":3},"",null,"","","","","",""]
[null,null,"",null,null,"",{"$nulls":3},"",null,"","","","","",""]
[null,null,"",null,null,"",{"$nulls":3},"",null,"","","","","",""]
[null,null,"",null,null,"",{"$nulls":3},"",null,"","","","","",""]
[null,null,"",null,null,"",{"$nulls":3},"",null,"","","","","",""]
[null,null,"",null,null,"",{"$nulls":3},"",null,"","","","","",""]
[null,null,"",null,null,"",{"$nulls":3},"",null,"","","","","",""]
[null,null,"",null,null,"",{"$nulls":3},"",null,"","","","","",""]
[null,null,"",null,null,"",{"$nulls":3},"",null,"","","","","",""]
[null,null,"",null,null,"",{"$nulls":3},"",null,"","","","","",""]
[null,null,"",null,null,"",{"$nulls":3},"",null,"","","","","",""]
[null,null,"",null,null,"",{"$nulls":3},"",null,"","","","","",""]
[null,null,"",null,null,"",{"$nulls":3},"",null,"","","","","",""]
[null,null,"",null,null,"",{"$nulls":3},"",null,"","","","","",""]
[null,null,"",null,null,"",{"$nulls":3},"",null,"","","","","",""]
[null,null,"",null,null,"",{"$nulls":3},"",null,"","","","","",""]
[null,null,"",null,null,"",{"$nulls":3},"",null,"","","","","",""]
[null,null,"",null,null,"",{"$nulls":3},"",null,"","","","","",""]
[null,null,"",null,null,"",{"$nulls":3},"",null,"","","","","",""]
[null,null,"",null,null,"",{"$nulls":3},"",null,"","","","","",""]
[null,null,"",null,null,"",{"$nulls":3},"",null,"","","","","",""]
[null,null,"",null,null,"",{"$nulls":3},"",null,"","","","","",""]
[null,null,"",null,null,"",{"$nulls":3},"",null,"","","","","",""]
[null,null,"",null,null,"",{"$nulls":3},"",null,"","","","","",""]
[null,null,"",null,null,"",{"$nulls":3},"",null,"","","","","",""]
[null,null,"",null,null,"",{"$nulls":3},"",null,"","","","","",""]
[null,null,"",null,null,"",{"$nulls":3},"",null,"","","","","",""]
[null,null,"",null,null,"",{"$nulls":3},"",null,"","","","","",""]
[null,null,"",null,null,"",{"$nulls":3},"",null,"","","","","",""]
[null,null,"",null,null,"",{"$nulls":3},"",null,"","","","","",""]
[null,null,"",null,null,"",{"$nulls":3},"",null,"","","","","",""]
[null,null,"",null,null,"",{"$nulls":3},"",null,"","","","","",""]
[null,null,"",null,null,"",{"$nulls":3},"",null,"","","","","",""]
[null,null,"",null,null,"",{"$nulls":3},"",null,"","","","","",""]
[null,null,"",null,null,"",{"$nulls":3},"",null,"","","","","",""]
[null,null,"",null,null,"",{"$nulls":3},"",null,"","","","","",""]
[null,null,"",null,null,"",{"$nulls":3},"",null,"","","","","",""]
[null,null,"",null,null,"",{"$nulls":3},"",null,"","","","","",""]
[null,null,"",null,null,"",{"$nulls":3},"",null,"","","","","",""]
[null,null,"",null,null,"",{"$nulls":3},"",null,"","","","","",""]
[null,null,"",null,null,"",{"$nulls":3},"",null,"","","","","",""]
[null,null,"",null,null,"",{"$nulls":3},"",null,"","","","","",""]
[null,null,"",null,null,"",{"$nulls":3},"",null,"","","","","",""]
[null,null,"",null,null,"",{"$nulls":3},"",null,"","","","","",""]
[null,null,"",null,null,"",{"$nulls":3},"",null,"","","","","",""]
[null,null,"",null,null,"",{"$nulls":3},"",null,"","","","","",""]
[null,null,"",null,null,"",{"$nulls":3},"",null,"","","","","",""]
[null,null,"",null,null,"",{"$nulls":3},"",null,"","","","","",""]
[null,null,"",null,null,"",{"$nulls":3},"",null,"","","","","",""]
[null,null,"",null,null,"",{"$nulls":3},"",null,"","","","","",""]
[null,null,"",null,null,"",{"$nulls":3},"",null,"","","","","",""]
[null,null,"",null,null,"",{"$nulls":3},"",null,"","","","","",""]
[null,null,"",null,null,"",{"$nulls":3},"",null,"","","","","",""]
[null,null,"",null,null,"",{"$nulls":3},"",null,"","","","","",""]
[null,null,"",null,null,"",{"$nulls":3},"",null,"","","","","",""]
[null,null,"",null,null,"",{"$nulls":3},"",null,"","","","","",""]
[null,null,"",null,null,"",{"$nulls":3},"",null,"","","","","",""]
[null,null,"",null,null,"",{"$nulls":3},"",null,"","","","","",""]
[null,null,"",null,null,"",{"$nulls":3},"",null,"","","","","",""]
[null,null,"",null,null,"",{"$nulls":3},"",null,"","","","","",""]
[null,null,"",null,null,"",{"$nulls":3},"",null,"","","","","",""]
[null,null,"",null,null,"",{"$nulls":3},"",null,"","","","","",""]
[null,null,"",null,null,"",{"$nulls":3},"",null,"","","","","",""]
[null,null,"",null,null,"",{"$nulls":3},"",null,"","","","","",""]
[null,null,"",null,null,"",{"$nulls":3},"",null,"","","","","",""]
[null,null,"",null,null,"",{"$nulls":3},"",null,"","","","","",""]
[null,null,"",null,null,"",{"$nulls":3},"",null,"","","","","",""]
[null,null,"",null,null,"",{"$nulls":3},"",null,"","","","","",""]
[null,null,"",null,null,"",{"$nulls":3},"",null,"","","","","",""]
[null,null,"",null,null,"",{"$nulls":3},"",null,"","","","","",""]
[null,null,"",null,null,"",{"$nulls":3},"",null,"","","","","",""]
[null,null,"",null,null,"",{"$nulls":3},"",null,"","","","","",""]
[null,null,"",null,null,"",{"$nulls":3},"",null,"","","","","",""]
[null,null,"",null,null,"",{"$nulls":3},"",null,"","","","","",""]
[null,null,"",null,null,"",{"$nulls":3},"",null,"","","","","",""]
[null,null,"",null,null,"",{"$nulls":3},"",null,"","","","","",""]
[null,null,"",null,null,"",{"$nulls":3},"",null,"","","","","",""]
[null,null,"",null,null,"",{"$nulls":3},"",null,"","","","","",""]
[null,null,"",null,null,"",{"$nulls":3},"",null,"","","","","",""]
[null,null,"",null,null,"",{"$nulls":3},"",null,"","","","","",""]
[null,null,"",null,null,"",{"$nulls":3},"",null,"","","","","",""]
[null,null,"",null,null,"",{"$nulls":3},"",null,"","","","","",""]
[null,null,"",null,null,"",{"$nulls":3},"",null,"","","","","",""]
[null,null,"",null,null,"",{"$nulls":3},"",null,"","","","","",""]
[null,null,"",null,null,"",{"$nulls":3},"",null,"","","","","",""]
[null,null,"",null,null,"",{"$nulls":3},"",null,"","","","","",""]
[null,null,"",null,null,"",{"$nulls":3},"",null,"","","","","",""]
[null,null,"",null,null,"",{"$nulls":3},"",null,"","","","","",""]
[null,null,"",null,null,"",{"$nulls":3},"",null,"","","","","",""]
[null,null,"",null,null,"",{"$nulls":3},"",null,"","","","","",""]
[null,null,"",null,null,"",{"$nulls":3},"",null,"","","","","",""]
[null,null,"",null,null,"",{"$nulls":3},"",null,"","","","","",""]
[null,null,"",null,null,"",{"$nulls":3},"",null,"","","","","",""]
[null,null,"",null,null,"",{"$nulls":3},"",null,"","","","","",""]
[null,null,"",null,null,"",{"$nulls":3},"",null,"","","","","",""]
[null,null,"",null,null,"",{"$nulls":3},"",null,"","","","","",""]
[null,null,"",null,null,"",{"$nulls":3},"",null,"","","","","",""]
[null,null,"",null,null,"",{"$nulls":3},"",null,"","","","","",""]
[null,null,"",null,null,"",{"$nulls":3},"",null,"","","","","",""]
[null,null,"",null,null,"",{"$nulls":3},"",null,"","","","","",""]
[null,null,"",null,null,"",{"$nulls":3},"",null,"","","","","",""]
[null,null,"",null,null,"",{"$nulls":3},"",null,"","","","","",""]
[null,null,"",null,null,"",{"$nulls":3},"",null,"","","","","",""]
[null,null,"",null,null,"",{"$nulls":3},"",null,"","","","","",""]
[null,null,"",null,null,"",{"$nulls":3},"",null,"","","","","",""]
[null,null,"",null,null,"",{"$nulls":3},"",null,"","","","","",""]
[null,null,"",null,null,"",{"$nulls":3},"",null,"","","","","",""]
[null,null,"",null,null,"",{"$nulls":3},"",null,"","","","","",""]
[null,null,"",null,null,"",{"$nulls":3},"",null,"","","","","",""]
[null,null,"",null,null,"",{"$nulls":3},"",null,"","","","","",""]
[null,null,"",null,null,"",{"$nulls":3},"",null,"","","","","",""]
[null,null,"",null,null,"",{"$nulls":3},"",null,"","","","","",""]
[null,null,"",null,null,"",{"$nulls":3},"",null,"","","","","",""]
[null,null,"",null,null,"",{"$nulls":3},"",null,"","","","","",""]
[null,null,"",null,null,"",{"$nulls":3},"",null,"","","","","",""]
[null,null,"",null,null,"",{"$nulls":3},"",null,"","","","","",""]
[null,null,"",null,null,"",{"$nulls":3},"",null,"","","","","",""]
[null,null,"",null,null,"",{"$nulls":3},"",null,"","","","","",""]
[null,null,"",null,null,"",{"$nulls":3},"",null,"","","","","",""]
[null,null,"",null,null,"",{"$nulls":3},"",null,"","","","","",""]
[null,null,"",null,null,"",{"$nulls":3},"",null,"","","","","",""]
[null,null,"",null,null,"",{"$nulls":3},"",null,"","","","","",""]
[null,null,"",null,null,"",{"$nulls":3},"",null,"","","","","",""]
[null,null,"",null,null,"",{"$nulls":3},"",null,"","","","","",""]
[null,null,"",null,null,"",{"$nulls":3},"",null,"","","","","",""]
[null,null,"",null,null,"",{"$nulls":3},"",null,"","","","","",""]
[null,null,"",null,null,"",{"$nulls":3},"",null,"","","","","",""]
[null,null,"",null,null,"",{"$nulls":3},"",null,"","","","","",""]
[null,null,"",null,null,"",{"$nulls":3},"",null,"","","","","",""]
[null,null,"",null,null,"",{"$nulls":3},"",null,"","","","","",""]
[null,null,"",null,null,"",{"$nulls":3},"",null,"","","","","",""]
[null,null,"",null,null,"",{"$nulls":3},"",null,"","","","","",""]
[null,null,"",null,null,"",{"$nulls":3},"",null,"","","","","",""]
[null,null,"",null,null,"",{"$nulls":3},"",null,"","","","","",""]
[null,null,"",null,null,"",{"$nulls":3},"",null,"","","","","",""]
[null,null,"",null,null,"",{"$nulls":3},"",null,"","","","","",""]
[null,null,"",null,null,"",{"$nulls":3},"",null,"","","","","",""]
[null,null,"",null,null,"",{"$nulls":3},"",null,"","","","","",""]
[null,null,"",null,null,"",{"$nulls":3},"",null,"","","","","",""]
[null,null,"",null,null,"",{"$nulls":3},"",null,"","","","","",""]
[null,null,"",null,null,"",{"$nulls":3},"",null,"","","","","",""]
[null,null,"",null,null,"",{"$nulls":3},"",null,"","","","","",""]
[null,null,"",null,null,"",{"$nulls":3},"",null,"","","","","",""]
[null,null,"",null,null,"",{"$nulls":3},"",null,"","","","","",""]
[null,null,"",null,null,"",{"$nulls":3},"",null,"","","","","",""]
[null,null,"",null,null,"",{"$nulls":3},"",null,"","","","","",""]
[null,null,"",null,null,"",{"$nulls":3},"",null,"","","","","",""]
[null,null,"",null,null,"",{"$nulls":3},"",null,"","","","","",""]
[null,null,"",null,null,"",{"$nulls":3},"",null,"","","","","",""]
[null,null,"",null,null,"",{"$nulls":3},"",null,"","","","","",""]
[null,null,"",null,null,"",{"$nulls":3},"",null,"","","","","",""]
[null,null,"",null,null,"",{"$nulls":3},"",null,"","","","","",""]
[null,null,"",null,null,"",{"$nulls":3},"",null,"","","","","",""]
[null,null,"",null,null,"",{"$nulls":3},"",null,"","","","","",""]
[null,null,"",null,null,"",{"$nulls":3},"",null,"","","","","",""]
[null,null,"",null,null,"",{"$nulls":3},"",null,"","","","","",""]
[null,null,"",null,null,"",{"$nulls":3},"",null,"","","","","",""]
[null,null,"",null,null,"",{"$nulls":3},"",null,"","","","","",""]
[null,null,"",null,null,"",{"$nulls":3},"",null,"","","","","",""]
[null,null,"",null,null,"",{"$nulls":3},"",null,"","","","","",""]
[null,null,"",null,null,"",{"$nulls":3},"",null,"","","","","",""]
[null,null,"",null,null,"",{"$nulls":3},"",null,"","","","","",""]
[null,null,"",null,null,"",{"$nulls":3},"",null,"","","","","",""]
[null,null,"",null,null,"",{"$nulls":3},"",null,"","","","","",""]
[null,null,"",null,null,"",{"$nulls":3},"",null,"","","","","",""]
[null,null,"",null,null,"",{"$nulls":3},"",null,"","","","","",""]
[null,null,"",null,null,"",{"$nulls":3},"",null,"","","","","",""]
[null,null,"",null,null,"",{"$nulls":3},"",null,"","","","","",""]
[null,null,"",null,null,"",{"$nulls":3},"",null,"","","","","",""]
[null,null,"",null,null,"",{"$nulls":3},"",null,"","","","","",""]
[null,null,"",null,null,"",{"$nulls":3},"",null,"","","","","",""]
[null,null,"",null,null,"",{"$nulls":3},"",null,"","","","","",""]
[null,null,"",null,null,"",{"$nulls":3},"",null,"","","","","",""]
[null,null,"",null,null,"",{"$nulls":3},"",null,"","","","","",""]
[null,null,"",null,null,"",{"$nulls":3},"",null,"","","","","",""]
[null,null,"",null,null,"",{"$nulls":3},"",null,"","","","","",""]
[null,null,"",null,null,"",{"$nulls":3},"",null,"","","","","",""]
[null,null,"",null,null,"",{"$nulls":3},"",null,"","","","","",""]
[null,null,"",null,null,"",{"$nulls":3},"",null,"","","","","",""]
[null,null,"",null,null,"",{"$nulls":3},"",null,"","","","","",""]
[null,null,"",null,null,"",{"$nulls":3},"",null,"","","","","",""]
[null,null,"",null,null,"",{"$nulls":3},"",null,"","","","","",""]
[null,null,"",null,null,"",{"$nulls":3},"",null,"","","","","",""]
[null,null,"",null,null,"",{"$nulls":3},"",null,"","","","","",""]
[null,null,"",null,null,"",{"$nulls":3},"",null,"","","","","",""]
[null,null,"",null,null,"",{"$nulls":3},"",null,"","","","","",""]
[null,null,"",null,null,"",{"$nulls":3},"",null,"","","","","",""]
[null,null,"",null,null,"",{"$nulls":3},"",null,"","","","","",""]
[null,null,"",null,null,"",{"$nulls":3},"",null,"","","","","",""]
[null,null,"",null,null,"",{"$nulls":3},"",null,"","","","","",""]
[null,null,"",null,null,"",{"$nulls":3},"",null,"","","","","",""]
[null,null,"",null,null,"",{"$nulls":3},"",null,"","","","","",""]
[null,null,"",null,null,"",{"$nulls":3},"",null,"","","","","",""]
[null,null,"",null,null,"",{"$nulls":3},"",null,"","","","","",""]
[null,null,"",null,null,"",{"$nulls":3},"",null,"","","","","",""]
[null,null,"",null,null,"",{"$nulls":3},"",null,"","","","","",""]
[null,null,"",null,null,"",{"$nulls":3},"",null,"","","","","",""]
[null,null,"",null,null,"",{"$nulls":3},"",null,"","","","","",""]
[null,null,"",null,null,"",{"$nulls":3},"",null,"","","","","",""]
[null,null,"",null,null,"",{"$nulls":3},"",null,"","","","","",""]
[null,null,"",null,null,"",{"$nulls":3},"",null,"","","","","",""]
[null,null,"",null,null,"",{"$nulls":3},"",null,"","","","","",""]
[null,null,"",null,null,"",{"$nulls":3},"",null,"","","","","",""]
[null,null,"",null,null,"",{"$nulls":3},"",null,"","","","","",""]
[null,null,"",null,null,"",{"$nulls":3},"",null,"","","","","",""]
[null,null,"",null,null,"",{"$nulls":3},"",null,"","","","","",""]
[null,null,"",null,null,"",{"$nulls":3},"",null,"","","","","",""]
[null,null,"",null,null,"",{"$nulls":3},"",null,"","","","","",""]
[null,null,"",null,null,"",{"$nulls":3},"",null,"","","","","",""]
[null,null,"",null,null,"",{"$nulls":3},"",null,"","","","","",""]
[null,null,"",null,null,"",{"$nulls":3},"",null,"","","","","",""]
[null,null,"",null,null,"",{"$nulls":3},"",null,"","","","","",""]
[null,null,"",null,null,"",{"$nulls":3},"",null,"","","","","",""]
[null,null,"",null,null,"",{"$nulls":3},"",null,"","","","","",""]
[null,null,"",null,null,"",{"$nulls":3},"",null,"","","","","",""]
[null,null,"",null,null,"",{"$nulls":3},"",null,"","","","","",""]
[null,null,"",null,null,"",{"$nulls":3},"",null,"","","","","",""]
[null,null,"",null,null,"",{"$nulls":3},"",null,"","","","","",""]
[null,null,"",null,null,"",{"$nulls":3},"",null,"","","","","",""]
[null,null,"",null,null,"",{"$nulls":3},"",null,"","","","","",""]
[null,null,"",null,null,"",{"$nulls":3},"",null,"","","","","",""]
[null,null,"",null,null,"",{"$nulls":3},"",null,"","","","","",""]
[null,null,"",null,null,"",{"$nulls":3},"",null,"","","","","",""]
[null,null,"",null,null,"",{"$nulls":3},"",null,"","","","","",""]
[null,null,"",null,null,"",{"$nulls":3},"",null,"","","","","",""]
[null,null,"",null,null,"",{"$nulls":3},"",null,"","","","","",""]
[null,null,"",null,null,"",{"$nulls":3},"",null,"","","","","",""]
[null,null,"",null,null,"",{"$nulls":3},"",null,"","","","","",""]
[null,null,"",null,null,"",{"$nulls":3},"",null,"","","","","",""]
[null,null,"",null,null,"",{"$nulls":3},"",null,"","","","","",""]
[null,null,"",null,null,"",{"$nulls":3},"",null,"","","","","",""]
[null,null,"",null,null,"",{"$nulls":3},"",null,"","","","","",""]
[null,null,"",null,null,"",{"$nulls":3},"",null,"","","","","",""]
[null,null,"",null,null,"",{"$nulls":3},"",null,"","","","","",""]
[null,null,"",null,null,"",{"$nulls":3},"",null,"","","","","",""]
[null,null,"",null,null,"",{"$nulls":3},"",null,"","","","","",""]
[null,null,"",null,null,"",{"$nulls":3},"",null,"","","","","",""]
[null,null,"",null,null,"",{"$nulls":3},"",null,"","","","","",""]
[null,null,"",null,null,"",{"$nulls":3},"",null,"","","","","",""]
[null,null,"",null,null,"",{"$nulls":3},"",null,"","","","","",""]
[null,null,"",null,null,"",{"$nulls":3},"",null,"","","","","",""]
[null,null,"",null,null,"",{"$nulls":3},"",null,"","","","","",""]
[null,null,"",null,null,"",{"$nulls":3},"",null,"","","","","",""]
[null,null,"",null,null,"",{"$nulls":3},"",null,"","","","","",""]
[null,null,"",null,null,"",{"$nulls":3},"",null,"","","","","",""]
[null,null,"",null,null,"",{"$nulls":3},"",null,"","","","","",""]
[null,null,"",null,null,"",{"$nulls":3},"",null,"","","","","",""]
[null,null,"",null,null,"",{"$nulls":3},"",null,"","","","","",""]
[null,null,"",null,null,"",{"$nulls":3},"",null,"","","","","",""]
[null,null,"",null,null,"",{"$nulls":3},"",null,"","","","","",""]
[null,null,"",null,null,"",{"$nulls":3},"",null,"","","","","",""]
[null,null,"",null,null,"",{"$nulls":3},"",null,"","","","","",""]
[null,null,"",null,null,"",{"$nulls":3},"",null,"","","","","",""]
[null,null,"",null,null,"",{"$nulls":3},"",null,"","","","","",""]
[null,null,"",null,null,"",{"$nulls":3},"",null,"","","","","",""]
[null,null,"",null,null,"",{"$nulls":3},"",null,"","","","","",""]
[null,null,"",null,null,"",{"$nulls":3},"",null,"","","","","",""]
[null,null,"",null,null,"",{"$nulls":3},"",null,"","","","","",""]
[null,null,"",null,null,"",{"$nulls":3},"",null,"","","","","",""]
[null,null,"",null,null,"",{"$nulls":3},"",null,"","","","","",""]
[null,null,"",null,null,"",{"$nulls":3},"",null,"","","","","",""]
[null,null,"",null,null,"",{"$nulls":3},"",null,"","","","","",""]
[null,null,"",null,null,"",{"$nulls":3},"",null,"","","","","",""]
[null,null,"",null,null,"",{"$nulls":3},"",null,"","","","","",""]
[null,null,"",null,null,"",{"$nulls":3},"",null,"","","","","",""]
[null,null,"",null,null,"",{"$nulls":3},"",null,"","","","","",""]
[null,null,"",null,null,"",{"$nulls":3},"",null,"","","","","",""]
[null,null,"",null,null,"",{"$nulls":3},"",null,"","","","","",""]
[null,null,"",null,null,"",{"$nulls":3},"",null,"","","","","",""]
[null,null,"",null,null,"",{"$nulls":3},"",null,"","","","","",""]
[null,null,"",null,null,"",{"$nulls":3},"",null,"","","","","",""]
[null,null,"",null,null,"",{"$nulls":3},"",null,"","","","","",""]
[null,null,"",null,null,"",{"$nulls":3},"",null,"","","","","",""]
[null,null,"",null,null,"",{"$nulls":3},"",null,"","","","","",""]
[null,null,"",null,null,"",{"$nulls":3},"",null,"","","","","",""]
[null,null,"",null,null,"",{"$nulls":3},"",null,"","","","","",""]
[null,null,"",null,null,"",{"$nulls":3},"",null,"","","","","",""]
[null,null,"",null,null,"",{"$nulls":3},"",null,"","","","","",""]
[null,null,"",null,null,"",{"$nulls":3},"",null,"","","","","",""]
[null,null,"",null,null,"",{"$nulls":3},"",null,"","","","","",""]
[null,null,"",null,null,"",{"$nulls":3},"",null,"","","","","",""]
[null,null,"",null,null,"",{"$nulls":3},"",null,"","","","","",""]
[null,null,"",null,null,"",{"$nulls":3},"",null,"","","","","",""]
[null,null,"",null,null,"",{"$nulls":3},"",null,"","","","","",""]
[null,null,"",null,null,"",{"$nulls":3},"",null,"","","","","",""]
[null,null,"",null,null,"",{"$nulls":3},"",null,"","","","","",""]
[null,null,"",null,null,"",{"$nulls":3},"",null,"","","","","",""]
[null,null,"",null,null,"",{"$nulls":3},"",null,"","","","","",""]
[null,null,"",null,null,"",{"$nulls":3},"",null,"","","","","",""]
[null,null,"",null,null,"",{"$nulls":3},"",null,"","","","","",""]
[null,null,"",null,null,"",{"$nulls":3},"",null,"","","","","",""]
[null,null,"",null,null,"",{"$nulls":3},"",null,"","","","","",""]
[null,null,"",null,null,"",{"$nulls":3},"",null,"","","","","",""]
[null,null,"",null,null,"",{"$nulls":3},"",null,"","","","","",""]
[null,null,"",null,null,"",{"$nulls":3},"",null,"","","","","",""]
[null,null,"",null,null,"",{"$nulls":3},"",null,"","","","","",""]
[null,null,"",null,null,"",{"$nulls":3},"",null,"","","","","",""]
[null,null,"",null,null,"",{"$nulls":3},"",null,"","","","","",""]
[null,null,"",null,null,"",{"$nulls":3},"",null,"","","","","",""]
[null,null,"",null,null,"",{"$nulls":3},"",null,"","","","","",""]
[null,null,"",null,null,"",{"$nulls":3},"",null,"","","","","",""]
[null,null,"",null,null,"",{"$nulls":3},"",null,"","","","","",""]
[null,null,"",null,null,"",{"$nulls":3},"",null,"","","","","",""]
[null,null,"",null,null,"",{"$nulls":3},"",null,"","","","","",""]
[null,null,"",null,null,"",{"$nulls":3},"",null,"","","","","",""]
[null,null,"",null,null,"",{"$nulls":3},"",null,"","","","","",""]
[null,null,"",null,null,"",{"$nulls":3},"",null,"","","","","",""]
[null,null,"",null,null,"",{"$nulls":3},"",null,"","","","","",""]
[null,null,"",null,null,"",{"$nulls":3},"",null,"","","","","",""]
[null,null,"",null,null,"",{"$nulls":3},"",null,"","","","","",""]
[null,null,"",null,null,"",{"$nulls":3},"",null,"","","","","",""]
[null,null,"",null,null,"",{"$nulls":3},"",null,"","","","","",""]
[null,null,"",null,null,"",{"$nulls":3},"",null,"","","","","",""]
[null,null,"",null,null,"",{"$nulls":3},"",null,"","","","","",""]
[null,null,"",null,null,"",{"$nulls":3},"",null,"","","","","",""]
[null,null,"",null,null,"",{"$nulls":3},"",null,"","","","","",""]
[null,null,"",null,null,"",{"$nulls":3},"",null,"","","","","",""]
[null,null,"",null,null,"",{"$nulls":3},"",null,"","","","","",""]
[null,null,"",null,null,"",{"$nulls":3},"",null,"","","","","",""]
[null,null,"",null,null,"",{"$nulls":3},"",null,"","","","","",""]
[null,null,"",null,null,"",{"$nulls":3},"",null,"","","","","",""]
[null,null,"",null,null,"",{"$nulls":3},"",null,"","","","","",""]
[null,null,"",null,null,"",{"$nulls":3},"",null,"","","","","",""]
[null,null,"",null,null,"",{"$nulls":3},"",null,"","","","","",""]
[null,null,"",null,null,"",{"$nulls":3},"",null,"","","","","",""]
[null,null,"",null,null,"",{"$nulls":3},"",null,"","","","","",""]
[null,null,"",null,null,"",{"$nulls":3},"",null,"","","","","",""]
[null,null,"",null,null,"",{"$nulls":3},"",null,"","","","","",""]
[null,null,"",null,null,"",{"$nulls":3},"",null,"","","","","",""]
[null,null,"",null,null,"",{"$nulls":3},"",null,"","","","","",""]
[null,null,"",null,null,"",{"$nulls":3},"",null,"","","","","",""]
[null,null,"",null,null,"",{"$nulls":3},"",null,"","","","","",""]
[null,null,"",null,null,"",{"$nulls":3},"",null,"","","","","",""]
[null,null,"",null,null,"",{"$nulls":3},"",null,"","","","","",""]
[null,null,"",null,null,"",{"$nulls":3},"",null,"","","","","",""]
[null,null,"",null,null,"",{"$nulls":3},"",null,"","","","","",""]
[null,null,"",null,null,"",{"$nulls":3},"",null,"","","","","",""]
[null,null,"",null,null,"",{"$nulls":3},"",null,"","","","","",""]
[null,null,"",null,null,"",{"$nulls":3},"",null,"","","","","",""]
[null,null,"",null,null,"",{"$nulls":3},"",null,"","","","","",""]
[null,null,"",null,null,"",{"$nulls":3},"",null,"","","","","",""]
[null,null,"",null,null,"",{"$nulls":3},"",null,"","","","","",""]
[null,null,"",null,null,"",{"$nulls":3},"",null,"","","","","",""]
[null,null,"",null,null,"",{"$nulls":3},"",null,"","","","","",""]
[null,null,"",null,null,"",{"$nulls":3},"",null,"","","","","",""]
[null,null,"",null,null,"",{"$nulls":3},"",null,"","","","","",""]
[null,null,"",null,null,"",{"$nulls":3},"",null,"","","","","",""]
[null,null,"",null,null,"",{"$nulls":3},"",null,"","","","","",""]
[null,null,"",null,null,"",{"$nulls":3},"",null,"","","","","",""]
[null,null,"",null,null,"",{"$nulls":3},"",null,"","","","","",""]
[null,null,"",null,null,"",{"$nulls":3},"",null,"","","","","",""]
[null,null,"",null,null,"",{"$nulls":3},"",null,"","","","","",""]
[null,null,"",null,null,"",{"$nulls":3},"",null,"","","","","",""]
[null,null,"",null,null,"",{"$nulls":3},"",null,"","","","","",""]
[null,null,"",null,null,"",{"$nulls":3},"",null,"","","","","",""]
[null,null,"",null,null,"",{"$nulls":3},"",null,"","","","","",""]
[null,null,"",null,null,"",{"$nulls":3},"",null,"","","","","",""]
[null,null,"",null,null,"",{"$nulls":3},"",null,"","","","","",""]
[null,null,"",null,null,"",{"$nulls":3},"",null,"","","","","",""]
[null,null,"",null,null,"",{"$nulls":3},"",null,"","","","","",""]
[null,null,"",null,null,"",{"$nulls":3},"",null,"","","","","",""]
[null,null,"",null,null,"",{"$nulls":3},"",null,"","","","","",""]
[null,null,"",null,null,"",{"$nulls":3},"",null,"","","","","",""]
[null,null,"",null,null,"",{"$nulls":3},"",null,"","","","","",""]
[null,null,"",null,null,"",{"$nulls":3},"",null,"","","","","",""]
[null,null,"",null,null,"",{"$nulls":3},"",null,"","","","","",""]
[null,null,"",null,null,"",{"$nulls":3},"",null,"","","","","",""]
[null,null,"",null,null,"",{"$nulls":3},"",null,"","","","","",""]
[null,null,"",null,null,"",{"$nulls":3},"",null,"","","","","",""]
[null,null,"",null,null,"",{"$nulls":3},"",null,"","","","","",""]
[null,null,"",null,null,"",{"$nulls":3},"",null,"","","","","",""]
[null,null,"",null,null,"",{"$nulls":3},"",null,"","","","","",""]
[null,null,"",null,null,"",{"$nulls":3},"",null,"","","","","",""]
[null,null,"",null,null,"",{"$nulls":3},"",null,"","","","","",""]
[null,null,"",null,null,"",{"$nulls":3},"",null,"","","","","",""]
[null,null,"",null,null,"",{"$nulls":3},"",null,"","","","","",""]
[null,null,"",null,null,"",{"$nulls":3},"",null,"","","","","",""]
[null,null,"",null,null,"",{"$nulls":3},"",null,"","","","","",""]
[null,null,"",null,null,"",{"$nulls":3},"",null,"","","","","",""]
[null,null,"",null,null,"",{"$nulls":3},"",null,"","","","","",""]
[null,null,"",null,null,"",{"$nulls":3},"",null,"","","","","",""]
[null,null,"",null,null,"",{"$nulls":3},"",null,"","","","","",""]
[null,null,"",null,null,"",{"$nulls":3},"",null,"","","","","",""]
[null,null,"",null,null,"",{"$nulls":3},"",null,"","","","","",""]
[null,null,"",null,null,"",{"$nulls":3},"",null,"","","","","",""]
[null,null,"",null,null,"",{"$nulls":3},"",null,"","","","","",""]
[null,null,"",null,null,"",{"$nulls":3},"",null,"","","","","",""]
[null,null,"",null,null,"",{"$nulls":3},"",null,"","","","","",""]
[null,null,"",null,null,"",{"$nulls":3},"",null,"","","","","",""]
[null,null,"",null,null,"",{"$nulls":3},"",null,"","","","","",""]
[null,null,"",null,null,"",{"$nulls":3},"",null,"","","","","",""]
[null,null,"",null,null,"",{"$nulls":3},"",null,"","","","","",""]
[null,null,"",null,null,"",{"$nulls":3},"",null,"","","","","",""]
[null,null,"",null,null,"",{"$nulls":3},"",null,"","","","","",""]
[null,null,"",null,null,"",{"$nulls":3},"",null,"","","","","",""]
[null,null,"",null,null,"",{"$nulls":3},"",null,"","","","","",""]
[null,null,"",null,null,"",{"$nulls":3},"",null,"","","","","",""]
[null,null,"",null,null,"",{"$nulls":3},"",null,"","","","","",""]
[null,null,"",null,null,"",{"$nulls":3},"",null,"","","","","",""]
[null,null,"",null,null,"",{"$nulls":3},"",null,"","","","","",""]
[null,null,"",null,null,"",{"$nulls":3},"",null,"","","","","",""]
[null,null,"",null,null,"",{"$nulls":3},"",null,"","","","","",""]
[null,null,"",null,null,"",{"$nulls":3},"",null,"","","","","",""]
[null,null,"",null,null,"",{"$nulls":3},"",null,"","","","","",""]
[null,null,"",null,null,"",{"$nulls":3},"",null,"","","","","",""]
[null,null,"",null,null,"",{"$nulls":3},"",null,"","","","","",""]
[null,null,"",null,null,"",{"$nulls":3},"",null,"","","","","",""]
[null,null,"",null,null,"",{"$nulls":3},"",null,"","","","","",""]
[null,null,"",null,null,"",{"$nulls":3},"",null,"","","","","",""]
[null,null,"",null,null,"",{"$nulls":3},"",null,"","","","","",""]
[null,null,"",null,null,"",{"$nulls":3},"",null,"","","","","",""]
[null,null,"",null,null,"",{"$nulls":3},"",null,"","","","","",""]
[null,null,"",null,null,"",{"$nulls":3},"",null,"","","","","",""]
[null,null,"",null,null,"",{"$nulls":3},"",null,"","","","","",""]
[null,null,"",null,null,"",{"$nulls":3},"",null,"","","","","",""]
[null,null,"",null,null,"",{"$nulls":3},"",null,"","","","","",""]
[null,null,"",null,null,"",{"$nulls":3},"",null,"","","","","",""]
[null,null,"",null,null,"",{"$nulls":3},"",null,"","","","","",""]
[null,null,"",null,null,"",{"$nulls":3},"",null,"","","","","",""]
[null,null,"",null,null,"",{"$nulls":3},"",null,"","","","","",""]
[null,null,"",null,null,"",{"$nulls":3},"",null,"","","","","",""]
[null,null,"",null,null,"",{"$nulls":3},"",null,"","","","","",""]
[null,null,"",null,null,"",{"$nulls":3},"",null,"","","","","",""]
[null,null,"",null,null,"",{"$nulls":3},"",null,"","","","","",""]
[null,null,"",null,null,"",{"$nulls":3},"",null,"","","","","",""]
[null,null,"",null,null,"",{"$nulls":3},"",null,"","","","","",""]
[null,null,"",null,null,"",{"$nulls":3},"",null,"","","","","",""]
[null,null,"",null,null,"",{"$nulls":3},"",null,"","","","","",""]
[null,null,"",null,null,"",{"$nulls":3},"",null,"","","","","",""]
[null,null,"",null,null,"",{"$nulls":3},"",null,"","","","","",""]
[null,null,"",null,null,"",{"$nulls":3},"",null,"","","","","",""]
[null,null,"",null,null,"",{"$nulls":3},"",null,"","","","","",""]
[null,null,"",null,null,"",{"$nulls":3},"",null,"","","","","",""]
[null,null,"",null,null,"",{"$nulls":3},"",null,"","","","","",""]
[null,null,"",null,null,"",{"$nulls":3},"",null,"","","","","",""]
[null,null,"",null,null,"",{"$nulls":3},"",null,"","","","","",""]

{"sheet":"Finding report","index":1,"n_rows":664,"n_cols":11,"rows_kept":664}
[]
[]
[]
[null,1,"ACTUATOR FAILED TORQUE TEST"]
[null,2,"PARTS DAMAGED TO BE REPLACED"]
[null,3,"PART MISSING"]
[null,4,"SUSPECTED UNAPPROVED PARTS"]
[null,5]
[null,6]
[null,7]
[null,8]
[null,9]
[null,10]
[]
[]
[]
[]
[]
[]
["item","PN","Desc","Qty","Finding number","Nature of finding","Source of default",null,"SB",{"$f":"IF(SUM(K:K)=0,\"Ok\",\"ERROR\")","v":"Ok"}]
[null,{"$f":"IF(_xlfn.NUMBERVALUE(Feuil1!N3,\".\")<=0,\"\",Feuil1!C3)","v":"SCN900-005-01"},{"$f":"IF(_xlfn.NUMBERVALUE(Feuil1!N3,\".\")<=0,\"\",Feuil1!Q3)","v":"LABEL, HIGH VOLTAGE"},{"$f":"IF(_xlfn.NUMBERVALUE(Feuil1!N3,\".\")<=0,\"\",_xlfn.NUMBERVALUE(Feuil1!N3,\".\"))","v":1},3,"Cracked","Normal wear & tear",null,null,{"$f":"IF(D21<>\"\",IF(E21=\"\",\"Finding Nbr\",IF(F21=\"\",\"Add Nature\",IF(G21=\"\",\"Add Source\",\"Ok\"))),IF(F21<>\"\",\"remove Nature\",IF(G21<>\"\",\"remove Source\",\"\")))","v":"Ok"},{"$f":"IF(J21=\"Ok\",0,IF(J21=\"\",0,1))","v":0}]
[null,{"$f":"IF(_xlfn.NUMBERVALUE(Feuil1!N4,\".\")<=0,\"\",Feuil1!C4)","v":"SB3-070-002-01"},{"$f":"IF(_xlfn.NUMBERVALUE(Feuil1!N4,\".\")<=0,\"\",Feuil1!Q4)","v":"HEAD LAP BLOCK"},{"$f":"IF(_xlfn.NUMBERVALUE(Feuil1!N4,\".\")<=0,\"\",_xlfn.NUMBERVALUE(Feuil1!N4,\".\"))","v":1},2,"Broken","Misuse/mishandeling",null,null,{"$f":"IF(D22<>\"\",IF(E22=\"\",\"Finding Nbr\",IF(F22=\"\",\"Add Nature\",IF(G22=\"\",\"Add Source\",\"Ok\"))),IF(F22<>\"\",\"remove Nature\",IF(G22<>\"\",\"remove Source\",\"\")))","v":"Ok"},{"$f":"IF(J22=\"Ok\",0,IF(J22=\"\",0,1))","v":0}]
[null,{"$f":"IF(_xlfn.NUMBERVALUE(Feuil1!N5,\".\")<=0,\"\",Feuil1!C5)","v":""},{"$f":"IF(_xlfn.NUMBERVALUE(Feuil1!N5,\".\")<=0,\"\",Feuil1!Q5)","v":""},{"$f":"IF(_xlfn.NUMBERVALUE(Feuil1!N5,\".\")<=0,\"\",_xlfn.NUMBERVALUE(Feuil1!N5,\".\"))","v":""},null,{"$f":"IF(G23=\"Mandatory Replacement\",\"Mandatory replacement\",IF(G23=\"SUP\",\"Incorrect / Suspected unapproved\",\"\"))","v":""},{"$nulls":3},"",0]
[null,{"$f":"IF(_xlfn.NUMBERVALUE(Feuil1!N6,\".\")<=0,\"\",Feuil1!C6)","v":"NSA938150-03-12"},{"$f":"IF(_xlfn.NUMBERVALUE(Feuil1!N6,\".\")<=0,\"\",Feuil1!Q6)","v":"ADAPTER, CABLE CLAMP"},{"$f":"IF(_xlfn.NUMBERVALUE(Feuil1!N6,\".\")<=0,\"\",_xlfn.NUMBERVALUE(Feuil1!N6,\".\"))","v":1},2,"Broken","Normal wear & tear",null,null,"Ok",0]
[null,{"$f":"IF(_xlfn.NUMBERVALUE(Feuil1!N7,\".\")<=0,\"\",Feuil1!C7)","v":""},{"$f":"IF(_xlfn.NUMBERVALUE(Feuil1!N7,\".\")<=0,\"\",Feuil1!Q7)","v":""},{"$f":"IF(_xlfn.NUMBERVALUE(Feuil1!N7,\".\")<=0,\"\",_xlfn.NUMBERVALUE(Feuil1!N7,\".\"))","v":""},null,"",{"$nulls":3},"",0]
[null,{"$f":"IF(_xlfn.NUMBERVALUE(Feuil1!N8,\".\")<=0,\"\",Feuil1!C8)","v":"8526-1348"},{"$f":"IF(_xlfn.NUMBERVALUE(Feuil1!N8,\".\")<=0,\"\",Feuil1!Q8)","v":"CONTACT"},{"$f":"IF(_xlfn.NUMBERVALUE(Feuil1!N8,\".\")<=0,\"\",_xlfn.NUMBERVALUE(Feuil1!N8,\".\"))","v":4},3,"Missing","Misuse/mishandeling",null,null,"Ok",0]
[null,{"$f":"IF(_xlfn.NUMBERVALUE(Feuil1!N9,\".\")<=0,\"\",Feuil1!C9)","v":""},{"$f":"IF(_xlfn.NUMBERVALUE(Feuil1!N9,\".\")<=0,\"\",Feuil1!Q9)","v":""},{"$f":"IF(_xlfn.NUMBERVALUE(Feuil1!N9,\".\")<=0,\"\",_xlfn.NUMBERVALUE(Feuil1!N9,\".\"))","v":""},null,"",{"$nulls":3},"",0]
[null,{"$f":"IF(_xlfn.NUMBERVALUE(Feuil1!N10,\".\")<=0,\"\",Feuil1!C10)","v":"NYC0S0L4"},{"$f":"IF(_xlfn.NUMBERVALUE(Feuil1!N10,\".\")<=0,\"\",Feuil1!Q10)","v":"SOLVANT"},{"$f":"IF(_xlfn.NUMBERVALUE(Feuil1!N10,\".\")<=0,\"\",_xlfn.NUMBERVALUE(Feuil1!N10,\".\"))","v":2},3,"Missing","Misuse/mishandeling",null,null,"Ok",0]
[null,{"$f":"IF(_xlfn.NUMBERVALUE(Feuil1!N11,\".\")<=0,\"\",Feuil1!C11)","v":""},{"$f":"IF(_xlfn.NUMBERVALUE(Feuil1!N11,\".\")<=0,\"\",Feuil1!Q11)","v":""},{"$f":"IF(_xlfn.NUMBERVALUE(Feuil1!N11,\".\")<=0,\"\",_xlfn.NUMBERVALUE(Feuil1!N11,\".\"))","v":""},null,"",{"$nulls":3},"",0]
[null,{"$f":"IF(_xlfn.NUMBERVALUE(Feuil1!N12,\".\")<=0,\"\",Feuil1!C12)","v":"SB3-070-000-02"},{"$f":"IF(_xlfn.NUMBERVALUE(Feuil1!N12,\".\")<=0,\"\",Feuil1!Q12)","v":"ASSEMBLY"},{"$f":"IF(_xlfn.NUMBERVALUE(Feuil1!N12,\".\")<=0,\"\",_xlfn.NUMBERVALUE(Feuil1!N12,\".\"))","v":1},4,"Incorrect / Suspected unapproved","SUP",null,null,"Ok",0]
[null,{"$f":"IF(_xlfn.NUMBERVALUE(Feuil1!N13,\".\")<=0,\"\",Feuil1!C13)","v":"E0043-1B0"},{"$f":"IF(_xlfn.NUMBERVALUE(Feuil1!N13,\".\")<=0,\"\",Feuil1!Q13)","v":"E0043-1B0\\COLLIER DE FRETTAGE"},{"$f":"IF(_xlfn.NUMBERVALUE(Feuil1!N13,\".\")<=0,\"\",_xlfn.NUMBERVALUE(Feuil1!N13,\".\"))","v":2},4,"Incorrect / Suspected unapproved","SUP",null,null,"Ok",0]
[null,{"$f":"IF(_xlfn.NUMBERVALUE(Feuil1!N14,\".\")<=0,\"\",Feuil1!C14)","v":"4136290006R"},{"$f":"IF(_xlfn.NUMBERVALUE(Feuil1!N14,\".\")<=0,\"\",Feuil1!Q14)","v":"ACTUATOR"},{"$f":"IF(_xlfn.NUMBERVALUE(Feuil1!N14,\".\")<=0,\"\",_xlfn.NUMBERVALUE(Feuil1!N14,\".\"))","v":1},1,"Failed test","Normal wear & tear",null,null,"Ok",0]
[null,{"$f":"IF(_xlfn.NUMBERVALUE(Feuil1!N15,\".\")<=0,\"\",Feuil1!C15)","v":"ET3-200-014-09"},{"$f":"IF(_xlfn.NUMBERVALUE(Feuil1!N15,\".\")<=0,\"\",Feuil1!Q15)","v":"LABEL"},{"$f":"IF(_xlfn.NUMBERVALUE(Feuil1!N15,\".\")<=0,\"\",_xlfn.NUMBERVALUE(Feuil1!N15,\".\"))","v":1},2,"Chafing","Normal wear & tear",null,null,"Ok",0]
[null,{"$f":"IF(_xlfn.NUMBERVALUE(Feuil1!N16,\".\")<=0,\"\",Feuil1!C16)","v":"MS21083N5"},{"$f":"IF(_xlfn.NUMBERVALUE(Feuil1!N16,\".\")<=0,\"\",Feuil1!Q16)","v":"NUT . 52NTE054"},{"$f":"IF(_xlfn.NUMBERVALUE(Feuil1!N16,\".\")<=0,\"\",_xlfn.NUMBERVALUE(Feuil1!N16,\".\"))","v":1},2,"Broken","Normal wear & tear",null,null,"Ok",0]
[null,{"$f":"IF(_xlfn.NUMBERVALUE(Feuil1!N17,\".\")<=0,\"\",Feuil1!C17)","v":"23351AC080LE"},{"$f":"IF(_xlfn.NUMBERVALUE(Feuil1!N17,\".\")<=0,\"\",Feuil1!Q17)","v":"LOCK PLATE"},{"$f":"IF(_xlfn.NUMBERVALUE(Feuil1!N17,\".\")<=0,\"\",_xlfn.NUMBERVALUE(Feuil1!N17,\".\"))","v":1},2,"Broken","Normal wear & tear",null,null,"Ok",0]
[null,{"$f":"IF(_xlfn.NUMBERVALUE(Feuil1!N18,\".\")<=0,\"\",Feuil1!C18)","v":"NSA935401-03"},{"$f":"IF(_xlfn.NUMBERVALUE(Feuil1!N18,\".\")<=0,\"\",Feuil1!Q18)","v":"HOLDING CLAMP"},{"$f":"IF(_xlfn.NUMBERVALUE(Feuil1!N18,\".\")<=0,\"\",_xlfn.NUMBERVALUE(Feuil1!N18,\".\"))","v":6},2,"Corroded","Normal wear & tear",null,null,"Ok",0]
[null,{"$f":"IF(_xlfn.NUMBERVALUE(Feuil1!N19,\".\")<=0,\"\",Feuil1!C19)","v":"E0043-4B0"},{"$f":"IF(_xlfn.NUMBERVALUE(Feuil1!N19,\".\")<=0,\"\",Feuil1!Q19)","v":"CLAMP"},{"$f":"IF(_xlfn.NUMBERVALUE(Feuil1!N19,\".\")<=0,\"\",_xlfn.NUMBERVALUE(Feuil1!N19,\".\"))","v":1},2,"Broken","Normal wear & tear",null,null,"Ok",0]
[null,{"$f":"IF(_xlfn.NUMBERVALUE(Feuil1!N20,\".\")<=0,\"\",Feuil1!C20)","v":"NSA935401-05"},{"$f":"IF(_xlfn.NUMBERVALUE(Feuil1!N20,\".\")<=0,\"\",Feuil1!Q20)","v":"TY-RAP"},{"$f":"IF(_xlfn.NUMBERVALUE(Feuil1!N20,\".\")<=0,\"\",_xlfn.NUMBERVALUE(Feuil1!N20,\".\"))","v":3},2,"Perforated","Normal wear & tear",null,null,"Ok",0]
[null,{"$f":"IF(_xlfn.NUMBERVALUE(Feuil1!N21,\".\")<=0,\"\",Feuil1!C21)","v":"TAAI3-427030-01"},{"$f":"IF(_xlfn.NUMBERVALUE(Feuil1!N21,\".\")<=0,\"\",Feuil1!Q21)","v":"BONDING BRAID"},{"$f":"IF(_xlfn.NUMBERVALUE(Feuil1!N21,\".\")<=0,\"\",_xlfn.NUMBERVALUE(Feuil1!N21,\".\"))","v":1},2,"Broken","Normal wear & tear",null,null,"Ok",0]
[null,{"$f":"IF(_xlfn.NUMBERVALUE(Feuil1!N22,\".\")<=0,\"\",Feuil1!C22)","v":"NAS679A3"},{"$f":"IF(_xlfn.NUMBERVALUE(Feuil1!N22,\".\")<=0,\"\",Feuil1!Q22)","v":"NUT"},{"$f":"IF(_xlfn.NUMBERVALUE(Feuil1!N22,\".\")<=0,\"\",_xlfn.NUMBERVALUE(Feuil1!N22,\".\"))","v":1},2,"Broken","Normal wear & tear",null,null,"Ok",0]
[null,{"$f":"IF(_xlfn.NUMBERVALUE(Feuil1!N23,\".\")<=0,\"\",Feuil1!C23)","v":"8526-1348"},{"$f":"IF(_xlfn.NUMBERVALUE(Feuil1!N23,\".\")<=0,\"\",Feuil1!Q23)","v":"CONTACT"},{"$f":"IF(_xlfn.NUMBERVALUE(Feuil1!N23,\".\")<=0,\"\",_xlfn.NUMBERVALUE(Feuil1!N23,\".\"))","v":3},2,"Broken","Normal wear & tear",null,null,"Ok",0]
[null,{"$f":"IF(_xlfn.NUMBERVALUE(Feuil1!N24,\".\")<=0,\"\",Feuil1!C24)","v":""},{"$f":"IF(_xlfn.NUMBERVALUE(Feuil1!N24,\".\")<=0,\"\",Feuil1!Q24)","v":""},{"$f":"IF(_xlfn.NUMBERVALUE(Feuil1!N24,\".\")<=0,\"\",_xlfn.NUMBERVALUE(Feuil1!N24,\".\"))","v":""},null,"",{"$nulls":3},"",0]
[null,{"$f":"IF(_xlfn.NUMBERVALUE(Feuil1!N25,\".\")<=0,\"\",Feuil1!C25)","v":""},{"$f":"IF(_xlfn.NUMBERVALUE(Feuil1!N25,\".\")<=0,\"\",Feuil1!Q25)","v":""},{"$f":"IF(_xlfn.NUMBERVALUE(Feuil1!N25,\".\")<=0,\"\",_xlfn.NUMBERVALUE(Feuil1!N25,\".\"))","v":""},null,"",{"$nulls":3},"",0]
[null,{"$f":"IF(_xlfn.NUMBERVALUE(Feuil1!N26,\".\")<=0,\"\",Feuil1!C26)","v":""},{"$f":"IF(_xlfn.NUMBERVALUE(Feuil1!N26,\".\")<=0,\"\",Feuil1!Q26)","v":""},{"$f":"IF(_xlfn.NUMBERVALUE(Feuil1!N26,\".\")<=0,\"\",_xlfn.NUMBERVALUE(Feuil1!N26,\".\"))","v":""},null,"",{"$nulls":3},"",0]
[null,{"$f":"IF(_xlfn.NUMBERVALUE(Feuil1!N27,\".\")<=0,\"\",Feuil1!C27)","v":""},{"$f":"IF(_xlfn.NUMBERVALUE(Feuil1!N27,\".\")<=0,\"\",Feuil1!Q27)","v":""},{"$f":"IF(_xlfn.NUMBERVALUE(Feuil1!N27,\".\")<=0,\"\",_xlfn.NUMBERVALUE(Feuil1!N27,\".\"))","v":""},null,"",{"$nulls":3},"",0]
[null,{"$f":"IF(_xlfn.NUMBERVALUE(Feuil1!N28,\".\")<=0,\"\",Feuil1!C28)","v":""},{"$f":"IF(_xlfn.NUMBERVALUE(Feuil1!N28,\".\")<=0,\"\",Feuil1!Q28)","v":""},{"$f":"IF(_xlfn.NUMBERVALUE(Feuil1!N28,\".\")<=0,\"\",_xlfn.NUMBERVALUE(Feuil1!N28,\".\"))","v":""},null,"",{"$nulls":3},"",0]
[null,{"$f":"IF(_xlfn.NUMBERVALUE(Feuil1!N29,\".\")<=0,\"\",Feuil1!C29)","v":""},{"$f":"IF(_xlfn.NUMBERVALUE(Feuil1!N29,\".\")<=0,\"\",Feuil1!Q29)","v":""},{"$f":"IF(_xlfn.NUMBERVALUE(Feuil1!N29,\".\")<=0,\"\",_xlfn.NUMBERVALUE(Feuil1!N29,\".\"))","v":""},null,"",{"$nulls":3},"",0]
[null,{"$f":"IF(_xlfn.NUMBERVALUE(Feuil1!N30,\".\")<=0,\"\",Feuil1!C30)","v":""},{"$f":"IF(_xlfn.NUMBERVALUE(Feuil1!N30,\".\")<=0,\"\",Feuil1!Q30)","v":""},{"$f":"IF(_xlfn.NUMBERVALUE(Feuil1!N30,\".\")<=0,\"\",_xlfn.NUMBERVALUE(Feuil1!N30,\".\"))","v":""},null,"",{"$nulls":3},"",0]
[null,{"$f":"IF(_xlfn.NUMBERVALUE(Feuil1!N31,\".\")<=0,\"\",Feuil1!C31)","v":""},{"$f":"IF(_xlfn.NUMBERVALUE(Feuil1!N31,\".\")<=0,\"\",Feuil1!Q31)","v":""},{"$f":"IF(_xlfn.NUMBERVALUE(Feuil1!N31,\".\")<=0,\"\",_xlfn.NUMBERVALUE(Feuil1!N31,\".\"))","v":""},null,"",{"$nulls":3},"",0]
[null,{"$f":"IF(_xlfn.NUMBERVALUE(Feuil1!N32,\".\")<=0,\"\",Feuil1!C32)","v":""},{"$f":"IF(_xlfn.NUMBERVALUE(Feuil1!N32,\".\")<=0,\"\",Feuil1!Q32)","v":""},{"$f":"IF(_xlfn.NUMBERVALUE(Feuil1!N32,\".\")<=0,\"\",_xlfn.NUMBERVALUE(Feuil1!N32,\".\"))","v":""},null,"",{"$nulls":3},"",0]
[null,{"$f":"IF(_xlfn.NUMBERVALUE(Feuil1!N33,\".\")<=0,\"\",Feuil1!C33)","v":""},{"$f":"IF(_xlfn.NUMBERVALUE(Feuil1!N33,\".\")<=0,\"\",Feuil1!Q33)","v":""},{"$f":"IF(_xlfn.NUMBERVALUE(Feuil1!N33,\".\")<=0,\"\",_xlfn.NUMBERVALUE(Feuil1!N33,\".\"))","v":""},null,"",{"$nulls":3},"",0]
[null,{"$f":"IF(_xlfn.NUMBERVALUE(Feuil1!N34,\".\")<=0,\"\",Feuil1!C34)","v":""},{"$f":"IF(_xlfn.NUMBERVALUE(Feuil1!N34,\".\")<=0,\"\",Feuil1!Q34)","v":""},{"$f":"IF(_xlfn.NUMBERVALUE(Feuil1!N34,\".\")<=0,\"\",_xlfn.NUMBERVALUE(Feuil1!N34,\".\"))","v":""},null,"",{"$nulls":3},"",0]
[null,{"$f":"IF(_xlfn.NUMBERVALUE(Feuil1!N35,\".\")<=0,\"\",Feuil1!C35)","v":""},{"$f":"IF(_xlfn.NUMBERVALUE(Feuil1!N35,\".\")<=0,\"\",Feuil1!Q35)","v":""},{"$f":"IF(_xlfn.NUMBERVALUE(Feuil1!N35,\".\")<=0,\"\",_xlfn.NUMBERVALUE(Feuil1!N35,\".\"))","v":""},null,"",{"$nulls":3},"",0]
[null,{"$f":"IF(_xlfn.NUMBERVALUE(Feuil1!N36,\".\")<=0,\"\",Feuil1!C36)","v":""},{"$f":"IF(_xlfn.NUMBERVALUE(Feuil1!N36,\".\")<=0,\"\",Feuil1!Q36)","v":""},{"$f":"IF(_xlfn.NUMBERVALUE(Feuil1!N36,\".\")<=0,\"\",_xlfn.NUMBERVALUE(Feuil1!N36,\".\"))","v":""},null,"",{"$nulls":3},"",0]
[null,{"$f":"IF(_xlfn.NUMBERVALUE(Feuil1!N37,\".\")<=0,\"\",Feuil1!C37)","v":""},{"$f":"IF(_xlfn.NUMBERVALUE(Feuil1!N37,\".\")<=0,\"\",Feuil1!Q37)","v":""},{"$f":"IF(_xlfn.NUMBERVALUE(Feuil1!N37,\".\")<=0,\"\",_xlfn.NUMBERVALUE(Feuil1!N37,\".\"))","v":""},null,"",{"$nulls":3},"",0]
[null,{"$f":"IF(_xlfn.NUMBERVALUE(Feuil1!N38,\".\")<=0,\"\",Feuil1!C38)","v":""},{"$f":"IF(_xlfn.NUMBERVALUE(Feuil1!N38,\".\")<=0,\"\",Feuil1!Q38)","v":""},{"$f":"IF(_xlfn.NUMBERVALUE(Feuil1!N38,\".\")<=0,\"\",_xlfn.NUMBERVALUE(Feuil1!N38,\".\"))","v":""},null,"",{"$nulls":3},"",0]
[null,{"$f":"IF(_xlfn.NUMBERVALUE(Feuil1!N39,\".\")<=0,\"\",Feuil1!C39)","v":""},{"$f":"IF(_xlfn.NUMBERVALUE(Feuil1!N39,\".\")<=0,\"\",Feuil1!Q39)","v":""},{"$f":"IF(_xlfn.NUMBERVALUE(Feuil1!N39,\".\")<=0,\"\",_xlfn.NUMBERVALUE(Feuil1!N39,\".\"))","v":""},null,"",{"$nulls":3},"",0]
[null,{"$f":"IF(_xlfn.NUMBERVALUE(Feuil1!N40,\".\")<=0,\"\",Feuil1!C40)","v":""},{"$f":"IF(_xlfn.NUMBERVALUE(Feuil1!N40,\".\")<=0,\"\",Feuil1!Q40)","v":""},{"$f":"IF(_xlfn.NUMBERVALUE(Feuil1!N40,\".\")<=0,\"\",_xlfn.NUMBERVALUE(Feuil1!N40,\".\"))","v":""},null,"",{"$nulls":3},"",0]
[null,{"$f":"IF(_xlfn.NUMBERVALUE(Feuil1!N41,\".\")<=0,\"\",Feuil1!C41)","v":""},{"$f":"IF(_xlfn.NUMBERVALUE(Feuil1!N41,\".\")<=0,\"\",Feuil1!Q41)","v":""},{"$f":"IF(_xlfn.NUMBERVALUE(Feuil1!N41,\".\")<=0,\"\",_xlfn.NUMBERVALUE(Feuil1!N41,\".\"))","v":""},null,"",{"$nulls":3},"",0]
[null,{"$f":"IF(_xlfn.NUMBERVALUE(Feuil1!N42,\".\")<=0,\"\",Feuil1!C42)","v":""},{"$f":"IF(_xlfn.NUMBERVALUE(Feuil1!N42,\".\")<=0,\"\",Feuil1!Q42)","v":""},{"$f":"IF(_xlfn.NUMBERVALUE(Feuil1!N42,\".\")<=0,\"\",_xlfn.NUMBERVALUE(Feuil1!N42,\".\"))","v":""},null,"",{"$nulls":3},"",0]
[null,{"$f":"IF(_xlfn.NUMBERVALUE(Feuil1!N43,\".\")<=0,\"\",Feuil1!C43)","v":""},{"$f":"IF(_xlfn.NUMBERVALUE(Feuil1!N43,\".\")<=0,\"\",Feuil1!Q43)","v":""},{"$f":"IF(_xlfn.NUMBERVALUE(Feuil1!N43,\".\")<=0,\"\",_xlfn.NUMBERVALUE(Feuil1!N43,\".\"))","v":""},null,"",{"$nulls":3},"",0]
[null,{"$f":"IF(_xlfn.NUMBERVALUE(Feuil1!N44,\".\")<=0,\"\",Feuil1!C44)","v":""},{"$f":"IF(_xlfn.NUMBERVALUE(Feuil1!N44,\".\")<=0,\"\",Feuil1!Q44)","v":""},{"$f":"IF(_xlfn.NUMBERVALUE(Feuil1!N44,\".\")<=0,\"\",_xlfn.NUMBERVALUE(Feuil1!N44,\".\"))","v":""},null,"",{"$nulls":3},"",0]
[null,{"$f":"IF(_xlfn.NUMBERVALUE(Feuil1!N45,\".\")<=0,\"\",Feuil1!C45)","v":""},{"$f":"IF(_xlfn.NUMBERVALUE(Feuil1!N45,\".\")<=0,\"\",Feuil1!Q45)","v":""},{"$f":"IF(_xlfn.NUMBERVALUE(Feuil1!N45,\".\")<=0,\"\",_xlfn.NUMBERVALUE(Feuil1!N45,\".\"))","v":""},null,"",{"$nulls":3},"",0]
[null,{"$f":"IF(_xlfn.NUMBERVALUE(Feuil1!N46,\".\")<=0,\"\",Feuil1!C46)","v":""},{"$f":"IF(_xlfn.NUMBERVALUE(Feuil1!N46,\".\")<=0,\"\",Feuil1!Q46)","v":""},{"$f":"IF(_xlfn.NUMBERVALUE(Feuil1!N46,\".\")<=0,\"\",_xlfn.NUMBERVALUE(Feuil1!N46,\".\"))","v":""},null,"",{"$nulls":3},"",0]
[null,{"$f":"IF(_xlfn.NUMBERVALUE(Feuil1!N47,\".\")<=0,\"\",Feuil1!C47)","v":""},{"$f":"IF(_xlfn.NUMBERVALUE(Feuil1!N47,\".\")<=0,\"\",Feuil1!Q47)","v":""},{"$f":"IF(_xlfn.NUMBERVALUE(Feuil1!N47,\".\")<=0,\"\",_xlfn.NUMBERVALUE(Feuil1!N47,\".\"))","v":""},null,"",{"$nulls":3},"",0]
[null,{"$f":"IF(_xlfn.NUMBERVALUE(Feuil1!N48,\".\")<=0,\"\",Feuil1!C48)","v":""},{"$f":"IF(_xlfn.NUMBERVALUE(Feuil1!N48,\".\")<=0,\"\",Feuil1!Q48)","v":""},{"$f":"IF(_xlfn.NUMBERVALUE(Feuil1!N48,\".\")<=0,\"\",_xlfn.NUMBERVALUE(Feuil1!N48,\".\"))","v":""},null,"",{"$nulls":3},"",0]
[null,{"$f":"IF(_xlfn.NUMBERVALUE(Feuil1!N49,\".\")<=0,\"\",Feuil1!C49)","v":""},{"$f":"IF(_xlfn.NUMBERVALUE(Feuil1!N49,\".\")<=0,\"\",Feuil1!Q49)","v":""},{"$f":"IF(_xlfn.NUMBERVALUE(Feuil1!N49,\".\")<=0,\"\",_xlfn.NUMBERVALUE(Feuil1!N49,\".\"))","v":""},null,"",{"$nulls":3},"",0]
[null,{"$f":"IF(_xlfn.NUMBERVALUE(Feuil1!N50,\".\")<=0,\"\",Feuil1!C50)","v":""},{"$f":"IF(_xlfn.NUMBERVALUE(Feuil1!N50,\".\")<=0,\"\",Feuil1!Q50)","v":""},{"$f":"IF(_xlfn.NUMBERVALUE(Feuil1!N50,\".\")<=0,\"\",_xlfn.NUMBERVALUE(Feuil1!N50,\".\"))","v":""},null,"",{"$nulls":3},"",0]
[null,{"$f":"IF(_xlfn.NUMBERVALUE(Feuil1!N51,\".\")<=0,\"\",Feuil1!C51)","v":""},{"$f":"IF(_xlfn.NUMBERVALUE(Feuil1!N51,\".\")<=0,\"\",Feuil1!Q51)","v":""},{"$f":"IF(_xlfn.NUMBERVALUE(Feuil1!N51,\".\")<=0,\"\",_xlfn.NUMBERVALUE(Feuil1!N51,\".\"))","v":""},null,"",{"$nulls":3},"",0]
[null,{"$f":"IF(_xlfn.NUMBERVALUE(Feuil1!N52,\".\")<=0,\"\",Feuil1!C52)","v":""},{"$f":"IF(_xlfn.NUMBERVALUE(Feuil1!N52,\".\")<=0,\"\",Feuil1!Q52)","v":""},{"$f":"IF(_xlfn.NUMBERVALUE(Feuil1!N52,\".\")<=0,\"\",_xlfn.NUMBERVALUE(Feuil1!N52,\".\"))","v":""},null,"",{"$nulls":3},"",0]
[null,{"$f":"IF(_xlfn.NUMBERVALUE(Feuil1!N53,\".\")<=0,\"\",Feuil1!C53)","v":""},{"$f":"IF(_xlfn.NUMBERVALUE(Feuil1!N53,\".\")<=0,\"\",Feuil1!Q53)","v":""},{"$f":"IF(_xlfn.NUMBERVALUE(Feuil1!N53,\".\")<=0,\"\",_xlfn.NUMBERVALUE(Feuil1!N53,\".\"))","v":""},null,"",{"$nulls":3},"",0]
[null,{"$f":"IF(_xlfn.NUMBERVALUE(Feuil1!N54,\".\")<=0,\"\",Feuil1!C54)","v":""},{"$f":"IF(_xlfn.NUMBERVALUE(Feuil1!N54,\".\")<=0,\"\",Feuil1!Q54)","v":""},{"$f":"IF(_xlfn.NUMBERVALUE(Feuil1!N54,\".\")<=0,\"\",_xlfn.NUMBERVALUE(Feuil1!N54,\".\"))","v":""},null,"",{"$nulls":3},"",0]
[null,{"$f":"IF(_xlfn.NUMBERVALUE(Feuil1!N55,\".\")<=0,\"\",Feuil1!C55)","v":""},{"$f":"IF(_xlfn.NUMBERVALUE(Feuil1!N55,\".\")<=0,\"\",Feuil1!Q55)","v":""},{"$f":"IF(_xlfn.NUMBERVALUE(Feuil1!N55,\".\")<=0,\"\",_xlfn.NUMBERVALUE(Feuil1!N55,\".\"))","v":""},null,"",{"$nulls":3},"",0]
[null,{"$f":"IF(_xlfn.NUMBERVALUE(Feuil1!N56,\".\")<=0,\"\",Feuil1!C56)","v":""},{"$f":"IF(_xlfn.NUMBERVALUE(Feuil1!N56,\".\")<=0,\"\",Feuil1!Q56)","v":""},{"$f":"IF(_xlfn.NUMBERVALUE(Feuil1!N56,\".\")<=0,\"\",_xlfn.NUMBERVALUE(Feuil1!N56,\".\"))","v":""},null,"",{"$nulls":3},"",0]
[null,{"$f":"IF(_xlfn.NUMBERVALUE(Feuil1!N57,\".\")<=0,\"\",Feuil1!C57)","v":""},{"$f":"IF(_xlfn.NUMBERVALUE(Feuil1!N57,\".\")<=0,\"\",Feuil1!Q57)","v":""},{"$f":"IF(_xlfn.NUMBERVALUE(Feuil1!N57,\".\")<=0,\"\",_xlfn.NUMBERVALUE(Feuil1!N57,\".\"))","v":""},null,"",{"$nulls":3},"",0]
[null,{"$f":"IF(_xlfn.NUMBERVALUE(Feuil1!N58,\".\")<=0,\"\",Feuil1!C58)","v":""},{"$f":"IF(_xlfn.NUMBERVALUE(Feuil1!N58,\".\")<=0,\"\",Feuil1!Q58)","v":""},{"$f":"IF(_xlfn.NUMBERVALUE(Feuil1!N58,\".\")<=0,\"\",_xlfn.NUMBERVALUE(Feuil1!N58,\".\"))","v":""},null,"",{"$nulls":3},"",0]
[null,{"$f":"IF(_xlfn.NUMBERVALUE(Feuil1!N59,\".\")<=0,\"\",Feuil1!C59)","v":""},{"$f":"IF(_xlfn.NUMBERVALUE(Feuil1!N59,\".\")<=0,\"\",Feuil1!Q59)","v":""},{"$f":"IF(_xlfn.NUMBERVALUE(Feuil1!N59,\".\")<=0,\"\",_xlfn.NUMBERVALUE(Feuil1!N59,\".\"))","v":""},null,"",{"$nulls":3},"",0]
[null,{"$f":"IF(_xlfn.NUMBERVALUE(Feuil1!N60,\".\")<=0,\"\",Feuil1!C60)","v":""},{"$f":"IF(_xlfn.NUMBERVALUE(Feuil1!N60,\".\")<=0,\"\",Feuil1!Q60)","v":""},{"$f":"IF(_xlfn.NUMBERVALUE(Feuil1!N60,\".\")<=0,\"\",_xlfn.NUMBERVALUE(Feuil1!N60,\".\"))","v":""},null,"",{"$nulls":3},"",0]
[null,{"$f":"IF(_xlfn.NUMBERVALUE(Feuil1!N61,\".\")<=0,\"\",Feuil1!C61)","v":""},{"$f":"IF(_xlfn.NUMBERVALUE(Feuil1!N61,\".\")<=0,\"\",Feuil1!Q61)","v":""},{"$f":"IF(_xlfn.NUMBERVALUE(Feuil1!N61,\".\")<=0,\"\",_xlfn.NUMBERVALUE(Feuil1!N61,\".\"))","v":""},null,"",{"$nulls":3},"",0]
[null,{"$f":"IF(_xlfn.NUMBERVALUE(Feuil1!N62,\".\")<=0,\"\",Feuil1!C62)","v":""},{"$f":"IF(_xlfn.NUMBERVALUE(Feuil1!N62,\".\")<=0,\"\",Feuil1!Q62)","v":""},{"$f":"IF(_xlfn.NUMBERVALUE(Feuil1!N62,\".\")<=0,\"\",_xlfn.NUMBERVALUE(Feuil1!N62,\".\"))","v":""},null,"",{"$nulls":3},"",0]
[null,{"$f":"IF(_xlfn.NUMBERVALUE(Feuil1!N63,\".\")<=0,\"\",Feuil1!C63)","v":""},{"$f":"IF(_xlfn.NUMBERVALUE(Feuil1!N63,\".\")<=0,\"\",Feuil1!Q63)","v":""},{"$f":"IF(_xlfn.NUMBERVALUE(Feuil1!N63,\".\")<=0,\"\",_xlfn.NUMBERVALUE(Feuil1!N63,\".\"))","v":""},null,"",{"$nulls":3},"",0]
[null,{"$f":"IF(_xlfn.NUMBERVALUE(Feuil1!N64,\".\")<=0,\"\",Feuil1!C64)","v":""},{"$f":"IF(_xlfn.NUMBERVALUE(Feuil1!N64,\".\")<=0,\"\",Feuil1!Q64)","v":""},{"$f":"IF(_xlfn.NUMBERVALUE(Feuil1!N64,\".\")<=0,\"\",_xlfn.NUMBERVALUE(Feuil1!N64,\".\"))","v":""},null,"",{"$nulls":3},"",0]
[null,{"$f":"IF(_xlfn.NUMBERVALUE(Feuil1!N65,\".\")<=0,\"\",Feuil1!C65)","v":""},{"$f":"IF(_xlfn.NUMBERVALUE(Feuil1!N65,\".\")<=0,\"\",Feuil1!Q65)","v":""},{"$f":"IF(_xlfn.NUMBERVALUE(Feuil1!N65,\".\")<=0,\"\",_xlfn.NUMBERVALUE(Feuil1!N65,\".\"))","v":""},null,"",{"$nulls":3},"",0]
[null,{"$f":"IF(_xlfn.NUMBERVALUE(Feuil1!N66,\".\")<=0,\"\",Feuil1!C66)","v":""},{"$f":"IF(_xlfn.NUMBERVALUE(Feuil1!N66,\".\")<=0,\"\",Feuil1!Q66)","v":""},{"$f":"IF(_xlfn.NUMBERVALUE(Feuil1!N66,\".\")<=0,\"\",_xlfn.NUMBERVALUE(Feuil1!N66,\".\"))","v":""},null,"",{"$nulls":3},"",0]
[null,{"$f":"IF(_xlfn.NUMBERVALUE(Feuil1!N67,\".\")<=0,\"\",Feuil1!C67)","v":""},{"$f":"IF(_xlfn.NUMBERVALUE(Feuil1!N67,\".\")<=0,\"\",Feuil1!Q67)","v":""},{"$f":"IF(_xlfn.NUMBERVALUE(Feuil1!N67,\".\")<=0,\"\",_xlfn.NUMBERVALUE(Feuil1!N67,\".\"))","v":""},null,"",{"$nulls":3},"",0]
[null,{"$f":"IF(_xlfn.NUMBERVALUE(Feuil1!N68,\".\")<=0,\"\",Feuil1!C68)","v":""},{"$f":"IF(_xlfn.NUMBERVALUE(Feuil1!N68,\".\")<=0,\"\",Feuil1!Q68)","v":""},{"$f":"IF(_xlfn.NUMBERVALUE(Feuil1!N68,\".\")<=0,\"\",_xlfn.NUMBERVALUE(Feuil1!N68,\".\"))","v":""},null,"",{"$nulls":3},{"$f":"IF(D86<>\"\",IF(E86=\"\",\"Finding Nbr\",IF(F86=\"\",\"Add Nature\",IF(G86=\"\",\"Add Source\",\"Ok\"))),IF(F86<>\"\",\"remove Nature\",IF(G86<>\"\",\"remove Source\",\"\")))","v":""},{"$f":"IF(J86=\"Ok\",0,IF(J86=\"\",0,1))","v":0}]
[null,{"$f":"IF(_xlfn.NUMBERVALUE(Feuil1!N69,\".\")<=0,\"\",Feuil1!C69)","v":""},{"$f":"IF(_xlfn.NUMBERVALUE(Feuil1!N69,\".\")<=0,\"\",Feuil1!Q69)","v":""},{"$f":"IF(_xlfn.NUMBERVALUE(Feuil1!N69,\".\")<=0,\"\",_xlfn.NUMBERVALUE(Feuil1!N69,\".\"))","v":""},null,{"$f":"IF(G87=\"Mandatory Replacement\",\"Mandatory replacement\",IF(G87=\"SUP\",\"Incorrect / Suspected unapproved\",\"\"))","v":""},{"$nulls":3},"",0]
[null,{"$f":"IF(_xlfn.NUMBERVALUE(Feuil1!N70,\".\")<=0,\"\",Feuil1!C70)","v":""},{"$f":"IF(_xlfn.NUMBERVALUE(Feuil1!N70,\".\")<=0,\"\",Feuil1!Q70)","v":""},{"$f":"IF(_xlfn.NUMBERVALUE(Feuil1!N70,\".\")<=0,\"\",_xlfn.NUMBERVALUE(Feuil1!N70,\".\"))","v":""},null,"",{"$nulls":3},"",0]
[null,{"$f":"IF(_xlfn.NUMBERVALUE(Feuil1!N71,\".\")<=0,\"\",Feuil1!C71)","v":""},{"$f":"IF(_xlfn.NUMBERVALUE(Feuil1!N71,\".\")<=0,\"\",Feuil1!Q71)","v":""},{"$f":"IF(_xlfn.NUMBERVALUE(Feuil1!N71,\".\")<=0,\"\",_xlfn.NUMBERVALUE(Feuil1!N71,\".\"))","v":""},null,"",{"$nulls":3},"",0]
[null,{"$f":"IF(_xlfn.NUMBERVALUE(Feuil1!N72,\".\")<=0,\"\",Feuil1!C72)","v":""},{"$f":"IF(_xlfn.NUMBERVALUE(Feuil1!N72,\".\")<=0,\"\",Feuil1!Q72)","v":""},{"$f":"IF(_xlfn.NUMBERVALUE(Feuil1!N72,\".\")<=0,\"\",_xlfn.NUMBERVALUE(Feuil1!N72,\".\"))","v":""},null,"",{"$nulls":3},"",0]
[null,{"$f":"IF(_xlfn.NUMBERVALUE(Feuil1!N73,\".\")<=0,\"\",Feuil1!C73)","v":""},{"$f":"IF(_xlfn.NUMBERVALUE(Feuil1!N73,\".\")<=0,\"\",Feuil1!Q73)","v":""},{"$f":"IF(_xlfn.NUMBERVALUE(Feuil1!N73,\".\")<=0,\"\",_xlfn.NUMBERVALUE(Feuil1!N73,\".\"))","v":""},null,"",{"$nulls":3},"",0]
[null,{"$f":"IF(_xlfn.NUMBERVALUE(Feuil1!N74,\".\")<=0,\"\",Feuil1!C74)","v":""},{"$f":"IF(_xlfn.NUMBERVALUE(Feuil1!N74,\".\")<=0,\"\",Feuil1!Q74)","v":""},{"$f":"IF(_xlfn.NUMBERVALUE(Feuil1!N74,\".\")<=0,\"\",_xlfn.NUMBERVALUE(Feuil1!N74,\".\"))","v":""},null,"",{"$nulls":3},"",0]
[null,{"$f":"IF(_xlfn.NUMBERVALUE(Feuil1!N75,\".\")<=0,\"\",Feuil1!C75)","v":""},{"$f":"IF(_xlfn.NUMBERVALUE(Feuil1!N75,\".\")<=0,\"\",Feuil1!Q75)","v":""},{"$f":"IF(_xlfn.NUMBERVALUE(Feuil1!N75,\".\")<=0,\"\",_xlfn.NUMBERVALUE(Feuil1!N75,\".\"))","v":""},null,"",{"$nulls":3},"",0]
[null,{"$f":"IF(_xlfn.NUMBERVALUE(Feuil1!N76,\".\")<=0,\"\",Feuil1!C76)","v":""},{"$f":"IF(_xlfn.NUMBERVALUE(Feuil1!N76,\".\")<=0,\"\",Feuil1!Q76)","v":""},{"$f":"IF(_xlfn.NUMBERVALUE(Feuil1!N76,\".\")<=0,\"\",_xlfn.NUMBERVALUE(Feuil1!N76,\".\"))","v":""},null,"",{"$nulls":3},"",0]
[null,{"$f":"IF(_xlfn.NUMBERVALUE(Feuil1!N77,\".\")<=0,\"\",Feuil1!C77)","v":""},{"$f":"IF(_xlfn.NUMBERVALUE(Feuil1!N77,\".\")<=0,\"\",Feuil1!Q77)","v":""},{"$f":"IF(_xlfn.NUMBERVALUE(Feuil1!N77,\".\")<=0,\"\",_xlfn.NUMBERVALUE(Feuil1!N77,\".\"))","v":""},null,"",{"$nulls":3},"",0]
[null,{"$f":"IF(_xlfn.NUMBERVALUE(Feuil1!N78,\".\")<=0,\"\",Feuil1!C78)","v":""},{"$f":"IF(_xlfn.NUMBERVALUE(Feuil1!N78,\".\")<=0,\"\",Feuil1!Q78)","v":""},{"$f":"IF(_xlfn.NUMBERVALUE(Feuil1!N78,\".\")<=0,\"\",_xlfn.NUMBERVALUE(Feuil1!N78,\".\"))","v":""},null,"",{"$nulls":3},"",0]
[null,{"$f":"IF(_xlfn.NUMBERVALUE(Feuil1!N79,\".\")<=0,\"\",Feuil1!C79)","v":""},{"$f":"IF(_xlfn.NUMBERVALUE(Feuil1!N79,\".\")<=0,\"\",Feuil1!Q79)","v":""},{"$f":"IF(_xlfn.NUMBERVALUE(Feuil1!N79,\".\")<=0,\"\",_xlfn.NUMBERVALUE(Feuil1!N79,\".\"))","v":""},null,"",{"$nulls":3},"",0]
[null,{"$f":"IF(_xlfn.NUMBERVALUE(Feuil1!N80,\".\")<=0,\"\",Feuil1!C80)","v":""},{"$f":"IF(_xlfn.NUMBERVALUE(Feuil1!N80,\".\")<=0,\"\",Feuil1!Q80)","v":""},{"$f":"IF(_xlfn.NUMBERVALUE(Feuil1!N80,\".\")<=0,\"\",_xlfn.NUMBERVALUE(Feuil1!N80,\".\"))","v":""},null,"",{"$nulls":3},"",0]
[null,{"$f":"IF(_xlfn.NUMBERVALUE(Feuil1!N81,\".\")<=0,\"\",Feuil1!C81)","v":""},{"$f":"IF(_xlfn.NUMBERVALUE(Feuil1!N81,\".\")<=0,\"\",Feuil1!Q81)","v":""},{"$f":"IF(_xlfn.NUMBERVALUE(Feuil1!N81,\".\")<=0,\"\",_xlfn.NUMBERVALUE(Feuil1!N81,\".\"))","v":""},null,"",{"$nulls":3},"",0]
[null,{"$f":"IF(_xlfn.NUMBERVALUE(Feuil1!N82,\".\")<=0,\"\",Feuil1!C82)","v":""},{"$f":"IF(_xlfn.NUMBERVALUE(Feuil1!N82,\".\")<=0,\"\",Feuil1!Q82)","v":""},{"$f":"IF(_xlfn.NUMBERVALUE(Feuil1!N82,\".\")<=0,\"\",_xlfn.NUMBERVALUE(Feuil1!N82,\".\"))","v":""},null,"",{"$nulls":3},"",0]
[null,{"$f":"IF(_xlfn.NUMBERVALUE(Feuil1!N83,\".\")<=0,\"\",Feuil1!C83)","v":""},{"$f":"IF(_xlfn.NUMBERVALUE(Feuil1!N83,\".\")<=0,\"\",Feuil1!Q83)","v":""},{"$f":"IF(_xlfn.NUMBERVALUE(Feuil1!N83,\".\")<=0,\"\",_xlfn.NUMBERVALUE(Feuil1!N83,\".\"))","v":""},null,"",{"$nulls":3},"",0]
[null,{"$f":"IF(_xlfn.NUMBERVALUE(Feuil1!N84,\".\")<=0,\"\",Feuil1!C84)","v":""},{"$f":"IF(_xlfn.NUMBERVALUE(Feuil1!N84,\".\")<=0,\"\",Feuil1!Q84)","v":""},{"$f":"IF(_xlfn.NUMBERVALUE(Feuil1!N84,\".\")<=0,\"\",_xlfn.NUMBERVALUE(Feuil1!N84,\".\"))","v":""},null,"",{"$nulls":3},"",0]
[null,{"$f":"IF(_xlfn.NUMBERVALUE(Feuil1!N85,\".\")<=0,\"\",Feuil1!C85)","v":""},{"$f":"IF(_xlfn.NUMBERVALUE(Feuil1!N85,\".\")<=0,\"\",Feuil1!Q85)","v":""},{"$f":"IF(_xlfn.NUMBERVALUE(Feuil1!N85,\".\")<=0,\"\",_xlfn.NUMBERVALUE(Feuil1!N85,\".\"))","v":""},null,"",{"$nulls":3},"",0]
[null,{"$f":"IF(_xlfn.NUMBERVALUE(Feuil1!N86,\".\")<=0,\"\",Feuil1!C86)","v":""},{"$f":"IF(_xlfn.NUMBERVALUE(Feuil1!N86,\".\")<=0,\"\",Feuil1!Q86)","v":""},{"$f":"IF(_xlfn.NUMBERVALUE(Feuil1!N86,\".\")<=0,\"\",_xlfn.NUMBERVALUE(Feuil1!N86,\".\"))","v":""},null,"",{"$nulls":3},"",0]
[null,{"$f":"IF(_xlfn.NUMBERVALUE(Feuil1!N87,\".\")<=0,\"\",Feuil1!C87)","v":""},{"$f":"IF(_xlfn.NUMBERVALUE(Feuil1!N87,\".\")<=0,\"\",Feuil1!Q87)","v":""},{"$f":"IF(_xlfn.NUMBERVALUE(Feuil1!N87,\".\")<=0,\"\",_xlfn.NUMBERVALUE(Feuil1!N87,\".\"))","v":""},null,"",{"$nulls":3},"",0]
[null,{"$f":"IF(_xlfn.NUMBERVALUE(Feuil1!N88,\".\")<=0,\"\",Feuil1!C88)","v":""},{"$f":"IF(_xlfn.NUMBERVALUE(Feuil1!N88,\".\")<=0,\"\",Feuil1!Q88)","v":""},{"$f":"IF(_xlfn.NUMBERVALUE(Feuil1!N88,\".\")<=0,\"\",_xlfn.NUMBERVALUE(Feuil1!N88,\".\"))","v":""},null,"",{"$nulls":3},"",0]
[null,{"$f":"IF(_xlfn.NUMBERVALUE(Feuil1!N89,\".\")<=0,\"\",Feuil1!C89)","v":""},{"$f":"IF(_xlfn.NUMBERVALUE(Feuil1!N89,\".\")<=0,\"\",Feuil1!Q89)","v":""},{"$f":"IF(_xlfn.NUMBERVALUE(Feuil1!N89,\".\")<=0,\"\",_xlfn.NUMBERVALUE(Feuil1!N89,\".\"))","v":""},null,"",{"$nulls":3},"",0]
[null,{"$f":"IF(_xlfn.NUMBERVALUE(Feuil1!N90,\".\")<=0,\"\",Feuil1!C90)","v":""},{"$f":"IF(_xlfn.NUMBERVALUE(Feuil1!N90,\".\")<=0,\"\",Feuil1!Q90)","v":""},{"$f":"IF(_xlfn.NUMBERVALUE(Feuil1!N90,\".\")<=0,\"\",_xlfn.NUMBERVALUE(Feuil1!N90,\".\"))","v":""},null,"",{"$nulls":3},"",0]
[null,{"$f":"IF(_xlfn.NUMBERVALUE(Feuil1!N91,\".\")<=0,\"\",Feuil1!C91)","v":""},{"$f":"IF(_xlfn.NUMBERVALUE(Feuil1!N91,\".\")<=0,\"\",Feuil1!Q91)","v":""},{"$f":"IF(_xlfn.NUMBERVALUE(Feuil1!N91,\".\")<=0,\"\",_xlfn.NUMBERVALUE(Feuil1!N91,\".\"))","v":""},null,"",{"$nulls":3},"",0]
[null,{"$f":"IF(_xlfn.NUMBERVALUE(Feuil1!N92,\".\")<=0,\"\",Feuil1!C92)","v":""},{"$f":"IF(_xlfn.NUMBERVALUE(Feuil1!N92,\".\")<=0,\"\",Feuil1!Q92)","v":""},{"$f":"IF(_xlfn.NUMBERVALUE(Feuil1!N92,\".\")<=0,\"\",_xlfn.NUMBERVALUE(Feuil1!N92,\".\"))","v":""},null,"",{"$nulls":3},"",0]
[null,{"$f":"IF(_xlfn.NUMBERVALUE(Feuil1!N93,\".\")<=0,\"\",Feuil1!C93)","v":""},{"$f":"IF(_xlfn.NUMBERVALUE(Feuil1!N93,\".\")<=0,\"\",Feuil1!Q93)","v":""},{"$f":"IF(_xlfn.NUMBERVALUE(Feuil1!N93,\".\")<=0,\"\",_xlfn.NUMBERVALUE(Feuil1!N93,\".\"))","v":""},null,"",{"$nulls":3},"",0]
[null,{"$f":"IF(_xlfn.NUMBERVALUE(Feuil1!N94,\".\")<=0,\"\",Feuil1!C94)","v":""},{"$f":"IF(_xlfn.NUMBERVALUE(Feuil1!N94,\".\")<=0,\"\",Feuil1!Q94)","v":""},{"$f":"IF(_xlfn.NUMBERVALUE(Feuil1!N94,\".\")<=0,\"\",_xlfn.NUMBERVALUE(Feuil1!N94,\".\"))","v":""},null,"",{"$nulls":3},"",0]
[null,{"$f":"IF(_xlfn.NUMBERVALUE(Feuil1!N95,\".\")<=0,\"\",Feuil1!C95)","v":""},{"$f":"IF(_xlfn.NUMBERVALUE(Feuil1!N95,\".\")<=0,\"\",Feuil1!Q95)","v":""},{"$f":"IF(_xlfn.NUMBERVALUE(Feuil1!N95,\".\")<=0,\"\",_xlfn.NUMBERVALUE(Feuil1!N95,\".\"))","v":""},null,"",{"$nulls":3},"",0]
[null,{"$f":"IF(_xlfn.NUMBERVALUE(Feuil1!N96,\".\")<=0,\"\",Feuil1!C96)","v":""},{"$f":"IF(_xlfn.NUMBERVALUE(Feuil1!N96,\".\")<=0,\"\",Feuil1!Q96)","v":""},{"$f":"IF(_xlfn.NUMBERVALUE(Feuil1!N96,\".\")<=0,\"\",_xlfn.NUMBERVALUE(Feuil1!N96,\".\"))","v":""},null,"",{"$nulls":3},"",0]
[null,{"$f":"IF(_xlfn.NUMBERVALUE(Feuil1!N97,\".\")<=0,\"\",Feuil1!C97)","v":""},{"$f":"IF(_xlfn.NUMBERVALUE(Feuil1!N97,\".\")<=0,\"\",Feuil1!Q97)","v":""},{"$f":"IF(_xlfn.NUMBERVALUE(Feuil1!N97,\".\")<=0,\"\",_xlfn.NUMBERVALUE(Feuil1!N97,\".\"))","v":""},null,"",{"$nulls":3},"",0]
[null,{"$f":"IF(_xlfn.NUMBERVALUE(Feuil1!N98,\".\")<=0,\"\",Feuil1!C98)","v":""},{"$f":"IF(_xlfn.NUMBERVALUE(Feuil1!N98,\".\")<=0,\"\",Feuil1!Q98)","v":""},{"$f":"IF(_xlfn.NUMBERVALUE(Feuil1!N98,\".\")<=0,\"\",_xlfn.NUMBERVALUE(Feuil1!N98,\".\"))","v":""},null,"",{"$nulls":3},"",0]
[null,{"$f":"IF(_xlfn.NUMBERVALUE(Feuil1!N99,\".\")<=0,\"\",Feuil1!C99)","v":""},{"$f":"IF(_xlfn.NUMBERVALUE(Feuil1!N99,\".\")<=0,\"\",Feuil1!Q99)","v":""},{"$f":"IF(_xlfn.NUMBERVALUE(Feuil1!N99,\".\")<=0,\"\",_xlfn.NUMBERVALUE(Feuil1!N99,\".\"))","v":""},null,"",{"$nulls":3},"",0]
[null,{"$f":"IF(_xlfn.NUMBERVALUE(Feuil1!N100,\".\")<=0,\"\",Feuil1!C100)","v":""},{"$f":"IF(_xlfn.NUMBERVALUE(Feuil1!N100,\".\")<=0,\"\",Feuil1!Q100)","v":""},{"$f":"IF(_xlfn.NUMBERVALUE(Feuil1!N100,\".\")<=0,\"\",_xlfn.NUMBERVALUE(Feuil1!N100,\".\"))","v":""},null,"",{"$nulls":3},"",0]
[null,{"$f":"IF(_xlfn.NUMBERVALUE(Feuil1!N101,\".\")<=0,\"\",Feuil1!C101)","v":""},{"$f":"IF(_xlfn.NUMBERVALUE(Feuil1!N101,\".\")<=0,\"\",Feuil1!Q101)","v":""},{"$f":"IF(_xlfn.NUMBERVALUE(Feuil1!N101,\".\")<=0,\"\",_xlfn.NUMBERVALUE(Feuil1!N101,\".\"))","v":""},null,"",{"$nulls":3},"",0]
[null,{"$f":"IF(_xlfn.NUMBERVALUE(Feuil1!N102,\".\")<=0,\"\",Feuil1!C102)","v":""},{"$f":"IF(_xlfn.NUMBERVALUE(Feuil1!N102,\".\")<=0,\"\",Feuil1!Q102)","v":""},{"$f":"IF(_xlfn.NUMBERVALUE(Feuil1!N102,\".\")<=0,\"\",_xlfn.NUMBERVALUE(Feuil1!N102,\".\"))","v":""},null,"",{"$nulls":3},"",0]
[null,{"$f":"IF(_xlfn.NUMBERVALUE(Feuil1!N103,\".\")<=0,\"\",Feuil1!C103)","v":""},{"$f":"IF(_xlfn.NUMBERVALUE(Feuil1!N103,\".\")<=0,\"\",Feuil1!Q103)","v":""},{"$f":"IF(_xlfn.NUMBERVALUE(Feuil1!N103,\".\")<=0,\"\",_xlfn.NUMBERVALUE(Feuil1!N103,\".\"))","v":""},null,"",{"$nulls":3},"",0]
[null,{"$f":"IF(_xlfn.NUMBERVALUE(Feuil1!N104,\".\")<=0,\"\",Feuil1!C104)","v":""},{"$f":"IF(_xlfn.NUMBERVALUE(Feuil1!N104,\".\")<=0,\"\",Feuil1!Q104)","v":""},{"$f":"IF(_xlfn.NUMBERVALUE(Feuil1!N104,\".\")<=0,\"\",_xlfn.NUMBERVALUE(Feuil1!N104,\".\"))","v":""},null,"",{"$nulls":3},"",0]
[null,{"$f":"IF(_xlfn.NUMBERVALUE(Feuil1!N105,\".\")<=0,\"\",Feuil1!C105)","v":""},{"$f":"IF(_xlfn.NUMBERVALUE(Feuil1!N105,\".\")<=0,\"\",Feuil1!Q105)","v":""},{"$f":"IF(_xlfn.NUMBERVALUE(Feuil1!N105,\".\")<=0,\"\",_xlfn.NUMBERVALUE(Feuil1!N105,\".\"))","v":""},null,"",{"$nulls":3},"",0]
[null,{"$f":"IF(_xlfn.NUMBERVALUE(Feuil1!N106,\".\")<=0,\"\",Feuil1!C106)","v":""},{"$f":"IF(_xlfn.NUMBERVALUE(Feuil1!N106,\".\")<=0,\"\",Feuil1!Q106)","v":""},{"$f":"IF(_xlfn.NUMBERVALUE(Feuil1!N106,\".\")<=0,\"\",_xlfn.NUMBERVALUE(Feuil1!N106,\".\"))","v":""},null,"",{"$nulls":3},"",0]
[null,{"$f":"IF(_xlfn.NUMBERVALUE(Feuil1!N107,\".\")<=0,\"\",Feuil1!C107)","v":""},{"$f":"IF(_xlfn.NUMBERVALUE(Feuil1!N107,\".\")<=0,\"\",Feuil1!Q107)","v":""},{"$f":"IF(_xlfn.NUMBERVALUE(Feuil1!N107,\".\")<=0,\"\",_xlfn.NUMBERVALUE(Feuil1!N107,\".\"))","v":""},null,"",{"$nulls":3},"",0]
[null,{"$f":"IF(_xlfn.NUMBERVALUE(Feuil1!N108,\".\")<=0,\"\",Feuil1!C108)","v":""},{"$f":"IF(_xlfn.NUMBERVALUE(Feuil1!N108,\".\")<=0,\"\",Feuil1!Q108)","v":""},{"$f":"IF(_xlfn.NUMBERVALUE(Feuil1!N108,\".\")<=0,\"\",_xlfn.NUMBERVALUE(Feuil1!N108,\".\"))","v":""},null,"",{"$nulls":3},"",0]
[null,{"$f":"IF(_xlfn.NUMBERVALUE(Feuil1!N109,\".\")<=0,\"\",Feuil1!C109)","v":""},{"$f":"IF(_xlfn.NUMBERVALUE(Feuil1!N109,\".\")<=0,\"\",Feuil1!Q109)","v":""},{"$f":"IF(_xlfn.NUMBERVALUE(Feuil1!N109,\".\")<=0,\"\",_xlfn.NUMBERVALUE(Feuil1!N109,\".\"))","v":""},null,"",{"$nulls":3},"",0]
[null,{"$f":"IF(_xlfn.NUMBERVALUE(Feuil1!N110,\".\")<=0,\"\",Feuil1!C110)","v":""},{"$f":"IF(_xlfn.NUMBERVALUE(Feuil1!N110,\".\")<=0,\"\",Feuil1!Q110)","v":""},{"$f":"IF(_xlfn.NUMBERVALUE(Feuil1!N110,\".\")<=0,\"\",_xlfn.NUMBERVALUE(Feuil1!N110,\".\"))","v":""},null,"",{"$nulls":3},"",0]
[null,{"$f":"IF(_xlfn.NUMBERVALUE(Feuil1!N111,\".\")<=0,\"\",Feuil1!C111)","v":""},{"$f":"IF(_xlfn.NUMBERVALUE(Feuil1!N111,\".\")<=0,\"\",Feuil1!Q111)","v":""},{"$f":"IF(_xlfn.NUMBERVALUE(Feuil1!N111,\".\")<=0,\"\",_xlfn.NUMBERVALUE(Feuil1!N111,\".\"))","v":""},null,"",{"$nulls":3},"",0]
[null,{"$f":"IF(_xlfn.NUMBERVALUE(Feuil1!N112,\".\")<=0,\"\",Feuil1!C112)","v":""},{"$f":"IF(_xlfn.NUMBERVALUE(Feuil1!N112,\".\")<=0,\"\",Feuil1!Q112)","v":""},{"$f":"IF(_xlfn.NUMBERVALUE(Feuil1!N112,\".\")<=0,\"\",_xlfn.NUMBERVALUE(Feuil1!N112,\".\"))","v":""},null,"",{"$nulls":3},"",0]
[null,{"$f":"IF(_xlfn.NUMBERVALUE(Feuil1!N113,\".\")<=0,\"\",Feuil1!C113)","v":""},{"$f":"IF(_xlfn.NUMBERVALUE(Feuil1!N113,\".\")<=0,\"\",Feuil1!Q113)","v":""},{"$f":"IF(_xlfn.NUMBERVALUE(Feuil1!N113,\".\")<=0,\"\",_xlfn.NUMBERVALUE(Feuil1!N113,\".\"))","v":""},null,"",{"$nulls":3},"",0]
[null,{"$f":"IF(_xlfn.NUMBERVALUE(Feuil1!N114,\".\")<=0,\"\",Feuil1!C114)","v":""},{"$f":"IF(_xlfn.NUMBERVALUE(Feuil1!N114,\".\")<=0,\"\",Feuil1!Q114)","v":""},{"$f":"IF(_xlfn.NUMBERVALUE(Feuil1!N114,\".\")<=0,\"\",_xlfn.NUMBERVALUE(Feuil1!N114,\".\"))","v":""},null,"",{"$nulls":3},"",0]
[null,{"$f":"IF(_xlfn.NUMBERVALUE(Feuil1!N115,\".\")<=0,\"\",Feuil1!C115)","v":""},{"$f":"IF(_xlfn.NUMBERVALUE(Feuil1!N115,\".\")<=0,\"\",Feuil1!Q115)","v":""},{"$f":"IF(_xlfn.NUMBERVALUE(Feuil1!N115,\".\")<=0,\"\",_xlfn.NUMBERVALUE(Feuil1!N115,\".\"))","v":""},null,"",{"$nulls":3},"",0]
[null,{"$f":"IF(_xlfn.NUMBERVALUE(Feuil1!N116,\".\")<=0,\"\",Feuil1!C116)","v":""},{"$f":"IF(_xlfn.NUMBERVALUE(Feuil1!N116,\".\")<=0,\"\",Feuil1!Q116)","v":""},{"$f":"IF(_xlfn.NUMBERVALUE(Feuil1!N116,\".\")<=0,\"\",_xlfn.NUMBERVALUE(Feuil1!N116,\".\"))","v":""},null,"",{"$nulls":3},"",0]
[null,{"$f":"IF(_xlfn.NUMBERVALUE(Feuil1!N117,\".\")<=0,\"\",Feuil1!C117)","v":""},{"$f":"IF(_xlfn.NUMBERVALUE(Feuil1!N117,\".\")<=0,\"\",Feuil1!Q117)","v":""},{"$f":"IF(_xlfn.NUMBERVALUE(Feuil1!N117,\".\")<=0,\"\",_xlfn.NUMBERVALUE(Feuil1!N117,\".\"))","v":""},null,"",{"$nulls":3},"",0]
[null,{"$f":"IF(_xlfn.NUMBERVALUE(Feuil1!N118,\".\")<=0,\"\",Feuil1!C118)","v":""},{"$f":"IF(_xlfn.NUMBERVALUE(Feuil1!N118,\".\")<=0,\"\",Feuil1!Q118)","v":""},{"$f":"IF(_xlfn.NUMBERVALUE(Feuil1!N118,\".\")<=0,\"\",_xlfn.NUMBERVALUE(Feuil1!N118,\".\"))","v":""},null,"",{"$nulls":3},"",0]
[null,{"$f":"IF(_xlfn.NUMBERVALUE(Feuil1!N119,\".\")<=0,\"\",Feuil1!C119)","v":""},{"$f":"IF(_xlfn.NUMBERVALUE(Feuil1!N119,\".\")<=0,\"\",Feuil1!Q119)","v":""},{"$f":"IF(_xlfn.NUMBERVALUE(Feuil1!N119,\".\")<=0,\"\",_xlfn.NUMBERVALUE(Feuil1!N119,\".\"))","v":""},null,"",{"$nulls":3},"",0]
[null,{"$f":"IF(_xlfn.NUMBERVALUE(Feuil1!N120,\".\")<=0,\"\",Feuil1!C120)","v":""},{"$f":"IF(_xlfn.NUMBERVALUE(Feuil1!N120,\".\")<=0,\"\",Feuil1!Q120)","v":""},{"$f":"IF(_xlfn.NUMBERVALUE(Feuil1!N120,\".\")<=0,\"\",_xlfn.NUMBERVALUE(Feuil1!N120,\".\"))","v":""},null,"",{"$nulls":3},"",0]
[null,{"$f":"IF(_xlfn.NUMBERVALUE(Feuil1!N121,\".\")<=0,\"\",Feuil1!C121)","v":""},{"$f":"IF(_xlfn.NUMBERVALUE(Feuil1!N121,\".\")<=0,\"\",Feuil1!Q121)","v":""},{"$f":"IF(_xlfn.NUMBERVALUE(Feuil1!N121,\".\")<=0,\"\",_xlfn.NUMBERVALUE(Feuil1!N121,\".\"))","v":""},null,"",{"$nulls":3},"",0]
[null,{"$f":"IF(_xlfn.NUMBERVALUE(Feuil1!N122,\".\")<=0,\"\",Feuil1!C122)","v":""},{"$f":"IF(_xlfn.NUMBERVALUE(Feuil1!N122,\".\")<=0,\"\",Feuil1!Q122)","v":""},{"$f":"IF(_xlfn.NUMBERVALUE(Feuil1!N122,\".\")<=0,\"\",_xlfn.NUMBERVALUE(Feuil1!N122,\".\"))","v":""},null,"",{"$nulls":3},"",0]
[null,{"$f":"IF(_xlfn.NUMBERVALUE(Feuil1!N123,\".\")<=0,\"\",Feuil1!C123)","v":""},{"$f":"IF(_xlfn.NUMBERVALUE(Feuil1!N123,\".\")<=0,\"\",Feuil1!Q123)","v":""},{"$f":"IF(_xlfn.NUMBERVALUE(Feuil1!N123,\".\")<=0,\"\",_xlfn.NUMBERVALUE(Feuil1!N123,\".\"))","v":""},null,"",{"$nulls":3},"",0]
[null,{"$f":"IF(_xlfn.NUMBERVALUE(Feuil1!N124,\".\")<=0,\"\",Feuil1!C124)","v":""},{"$f":"IF(_xlfn.NUMBERVALUE(Feuil1!N124,\".\")<=0,\"\",Feuil1!Q124)","v":""},{"$f":"IF(_xlfn.NUMBERVALUE(Feuil1!N124,\".\")<=0,\"\",_xlfn.NUMBERVALUE(Feuil1!N124,\".\"))","v":""},null,"",{"$nulls":3},"",0]
[null,{"$f":"IF(_xlfn.NUMBERVALUE(Feuil1!N125,\".\")<=0,\"\",Feuil1!C125)","v":""},{"$f":"IF(_xlfn.NUMBERVALUE(Feuil1!N125,\".\")<=0,\"\",Feuil1!Q125)","v":""},{"$f":"IF(_xlfn.NUMBERVALUE(Feuil1!N125,\".\")<=0,\"\",_xlfn.NUMBERVALUE(Feuil1!N125,\".\"))","v":""},null,"",{"$nulls":3},"",0]
[null,{"$f":"IF(_xlfn.NUMBERVALUE(Feuil1!N126,\".\")<=0,\"\",Feuil1!C126)","v":""},{"$f":"IF(_xlfn.NUMBERVALUE(Feuil1!N126,\".\")<=0,\"\",Feuil1!Q126)","v":""},{"$f":"IF(_xlfn.NUMBERVALUE(Feuil1!N126,\".\")<=0,\"\",_xlfn.NUMBERVALUE(Feuil1!N126,\".\"))","v":""},null,"",{"$nulls":3},"",0]
[null,{"$f":"IF(_xlfn.NUMBERVALUE(Feuil1!N127,\".\")<=0,\"\",Feuil1!C127)","v":""},{"$f":"IF(_xlfn.NUMBERVALUE(Feuil1!N127,\".\")<=0,\"\",Feuil1!Q127)","v":""},{"$f":"IF(_xlfn.NUMBERVALUE(Feuil1!N127,\".\")<=0,\"\",_xlfn.NUMBERVALUE(Feuil1!N127,\".\"))","v":""},null,"",{"$nulls":3},"",0]
[null,{"$f":"IF(_xlfn.NUMBERVALUE(Feuil1!N128,\".\")<=0,\"\",Feuil1!C128)","v":""},{"$f":"IF(_xlfn.NUMBERVALUE(Feuil1!N128,\".\")<=0,\"\",Feuil1!Q128)","v":""},{"$f":"IF(_xlfn.NUMBERVALUE(Feuil1!N128,\".\")<=0,\"\",_xlfn.NUMBERVALUE(Feuil1!N128,\".\"))","v":""},null,"",{"$nulls":3},"",0]
[null,{"$f":"IF(_xlfn.NUMBERVALUE(Feuil1!N129,\".\")<=0,\"\",Feuil1!C129)","v":""},{"$f":"IF(_xlfn.NUMBERVALUE(Feuil1!N129,\".\")<=0,\"\",Feuil1!Q129)","v":""},{"$f":"IF(_xlfn.NUMBERVALUE(Feuil1!N129,\".\")<=0,\"\",_xlfn.NUMBERVALUE(Feuil1!N129,\".\"))","v":""},null,"",{"$nulls":3},"",0]
[null,{"$f":"IF(_xlfn.NUMBERVALUE(Feuil1!N130,\".\")<=0,\"\",Feuil1!C130)","v":""},{"$f":"IF(_xlfn.NUMBERVALUE(Feuil1!N130,\".\")<=0,\"\",Feuil1!Q130)","v":""},{"$f":"IF(_xlfn.NUMBERVALUE(Feuil1!N130,\".\")<=0,\"\",_xlfn.NUMBERVALUE(Feuil1!N130,\".\"))","v":""},null,"",{"$nulls":3},"",0]
[null,{"$f":"IF(_xlfn.NUMBERVALUE(Feuil1!N131,\".\")<=0,\"\",Feuil1!C131)","v":""},{"$f":"IF(_xlfn.NUMBERVALUE(Feuil1!N131,\".\")<=0,\"\",Feuil1!Q131)","v":""},{"$f":"IF(_xlfn.NUMBERVALUE(Feuil1!N131,\".\")<=0,\"\",_xlfn.NUMBERVALUE(Feuil1!N131,\".\"))","v":""},null,"",{"$nulls":3},"",0]
[null,{"$f":"IF(_xlfn.NUMBERVALUE(Feuil1!N132,\".\")<=0,\"\",Feuil1!C132)","v":""},{"$f":"IF(_xlfn.NUMBERVALUE(Feuil1!N132,\".\")<=0,\"\",Feuil1!Q132)","v":""},{"$f":"IF(_xlfn.NUMBERVALUE(Feuil1!N132,\".\")<=0,\"\",_xlfn.NUMBERVALUE(Feuil1!N132,\".\"))","v":""},null,"",{"$nulls":3},{"$f":"IF(D150<>\"\",IF(E150=\"\",\"Finding Nbr\",IF(F150=\"\",\"Add Nature\",IF(G150=\"\",\"Add Source\",\"Ok\"))),IF(F150<>\"\",\"remove Nature\",IF(G150<>\"\",\"remove Source\",\"\")))","v":""},{"$f":"IF(J150=\"Ok\",0,IF(J150=\"\",0,1))","v":0}]
[null,{"$f":"IF(_xlfn.NUMBERVALUE(Feuil1!N133,\".\")<=0,\"\",Feuil1!C133)","v":""},{"$f":"IF(_xlfn.NUMBERVALUE(Feuil1!N133,\".\")<=0,\"\",Feuil1!Q133)","v":""},{"$f":"IF(_xlfn.NUMBERVALUE(Feuil1!N133,\".\")<=0,\"\",_xlfn.NUMBERVALUE(Feuil1!N133,\".\"))","v":""},null,{"$f":"IF(G151=\"Mandatory Replacement\",\"Mandatory replacement\",IF(G151=\"SUP\",\"Incorrect / Suspected unapproved\",\"\"))","v":""},{"$nulls":3},"",0]
[null,{"$f":"IF(_xlfn.NUMBERVALUE(Feuil1!N134,\".\")<=0,\"\",Feuil1!C134)","v":""},{"$f":"IF(_xlfn.NUMBERVALUE(Feuil1!N134,\".\")<=0,\"\",Feuil1!Q134)","v":""},{"$f":"IF(_xlfn.NUMBERVALUE(Feuil1!N134,\".\")<=0,\"\",_xlfn.NUMBERVALUE(Feuil1!N134,\".\"))","v":""},null,"",{"$nulls":3},"",0]
[null,{"$f":"IF(_xlfn.NUMBERVALUE(Feuil1!N135,\".\")<=0,\"\",Feuil1!C135)","v":""},{"$f":"IF(_xlfn.NUMBERVALUE(Feuil1!N135,\".\")<=0,\"\",Feuil1!Q135)","v":""},{"$f":"IF(_xlfn.NUMBERVALUE(Feuil1!N135,\".\")<=0,\"\",_xlfn.NUMBERVALUE(Feuil1!N135,\".\"))","v":""},null,"",{"$nulls":3},"",0]
[null,{"$f":"IF(_xlfn.NUMBERVALUE(Feuil1!N136,\".\")<=0,\"\",Feuil1!C136)","v":""},{"$f":"IF(_xlfn.NUMBERVALUE(Feuil1!N136,\".\")<=0,\"\",Feuil1!Q136)","v":""},{"$f":"IF(_xlfn.NUMBERVALUE(Feuil1!N136,\".\")<=0,\"\",_xlfn.NUMBERVALUE(Feuil1!N136,\".\"))","v":""},null,"",{"$nulls":3},"",0]
[null,{"$f":"IF(_xlfn.NUMBERVALUE(Feuil1!N137,\".\")<=0,\"\",Feuil1!C137)","v":""},{"$f":"IF(_xlfn.NUMBERVALUE(Feuil1!N137,\".\")<=0,\"\",Feuil1!Q137)","v":""},{"$f":"IF(_xlfn.NUMBERVALUE(Feuil1!N137,\".\")<=0,\"\",_xlfn.NUMBERVALUE(Feuil1!N137,\".\"))","v":""},null,"",{"$nulls":3},"",0]
[null,{"$f":"IF(_xlfn.NUMBERVALUE(Feuil1!N138,\".\")<=0,\"\",Feuil1!C138)","v":""},{"$f":"IF(_xlfn.NUMBERVALUE(Feuil1!N138,\".\")<=0,\"\",Feuil1!Q138)","v":""},{"$f":"IF(_xlfn.NUMBERVALUE(Feuil1!N138,\".\")<=0,\"\",_xlfn.NUMBERVALUE(Feuil1!N138,\".\"))","v":""},null,"",{"$nulls":3},"",0]
[null,{"$f":"IF(_xlfn.NUMBERVALUE(Feuil1!N139,\".\")<=0,\"\",Feuil1!C139)","v":""},{"$f":"IF(_xlfn.NUMBERVALUE(Feuil1!N139,\".\")<=0,\"\",Feuil1!Q139)","v":""},{"$f":"IF(_xlfn.NUMBERVALUE(Feuil1!N139,\".\")<=0,\"\",_xlfn.NUMBERVALUE(Feuil1!N139,\".\"))","v":""},null,"",{"$nulls":3},"",0]
[null,{"$f":"IF(_xlfn.NUMBERVALUE(Feuil1!N140,\".\")<=0,\"\",Feuil1!C140)","v":""},{"$f":"IF(_xlfn.NUMBERVALUE(Feuil1!N140,\".\")<=0,\"\",Feuil1!Q140)","v":""},{"$f":"IF(_xlfn.NUMBERVALUE(Feuil1!N140,\".\")<=0,\"\",_xlfn.NUMBERVALUE(Feuil1!N140,\".\"))","v":""},null,"",{"$nulls":3},"",0]
[null,{"$f":"IF(_xlfn.NUMBERVALUE(Feuil1!N141,\".\")<=0,\"\",Feuil1!C141)","v":""},{"$f":"IF(_xlfn.NUMBERVALUE(Feuil1!N141,\".\")<=0,\"\",Feuil1!Q141)","v":""},{"$f":"IF(_xlfn.NUMBERVALUE(Feuil1!N141,\".\")<=0,\"\",_xlfn.NUMBERVALUE(Feuil1!N141,\".\"))","v":""},null,"",{"$nulls":3},"",0]
[null,{"$f":"IF(_xlfn.NUMBERVALUE(Feuil1!N142,\".\")<=0,\"\",Feuil1!C142)","v":""},{"$f":"IF(_xlfn.NUMBERVALUE(Feuil1!N142,\".\")<=0,\"\",Feuil1!Q142)","v":""},{"$f":"IF(_xlfn.NUMBERVALUE(Feuil1!N142,\".\")<=0,\"\",_xlfn.NUMBERVALUE(Feuil1!N142,\".\"))","v":""},null,"",{"$nulls":3},"",0]
[null,{"$f":"IF(_xlfn.NUMBERVALUE(Feuil1!N143,\".\")<=0,\"\",Feuil1!C143)","v":""},{"$f":"IF(_xlfn.NUMBERVALUE(Feuil1!N143,\".\")<=0,\"\",Feuil1!Q143)","v":""},{"$f":"IF(_xlfn.NUMBERVALUE(Feuil1!N143,\".\")<=0,\"\",_xlfn.NUMBERVALUE(Feuil1!N143,\".\"))","v":""},null,"",{"$nulls":3},"",0]
[null,{"$f":"IF(_xlfn.NUMBERVALUE(Feuil1!N144,\".\")<=0,\"\",Feuil1!C144)","v":""},{"$f":"IF(_xlfn.NUMBERVALUE(Feuil1!N144,\".\")<=0,\"\",Feuil1!Q144)","v":""},{"$f":"IF(_xlfn.NUMBERVALUE(Feuil1!N144,\".\")<=0,\"\",_xlfn.NUMBERVALUE(Feuil1!N144,\".\"))","v":""},null,"",{"$nulls":3},"",0]
[null,{"$f":"IF(_xlfn.NUMBERVALUE(Feuil1!N145,\".\")<=0,\"\",Feuil1!C145)","v":""},{"$f":"IF(_xlfn.NUMBERVALUE(Feuil1!N145,\".\")<=0,\"\",Feuil1!Q145)","v":""},{"$f":"IF(_xlfn.NUMBERVALUE(Feuil1!N145,\".\")<=0,\"\",_xlfn.NUMBERVALUE(Feuil1!N145,\".\"))","v":""},null,"",{"$nulls":3},"",0]
[null,{"$f":"IF(_xlfn.NUMBERVALUE(Feuil1!N146,\".\")<=0,\"\",Feuil1!C146)","v":""},{"$f":"IF(_xlfn.NUMBERVALUE(Feuil1!N146,\".\")<=0,\"\",Feuil1!Q146)","v":""},{"$f":"IF(_xlfn.NUMBERVALUE(Feuil1!N146,\".\")<=0,\"\",_xlfn.NUMBERVALUE(Feuil1!N146,\".\"))","v":""},null,"",{"$nulls":3},"",0]
[null,{"$f":"IF(_xlfn.NUMBERVALUE(Feuil1!N147,\".\")<=0,\"\",Feuil1!C147)","v":""},{"$f":"IF(_xlfn.NUMBERVALUE(Feuil1!N147,\".\")<=0,\"\",Feuil1!Q147)","v":""},{"$f":"IF(_xlfn.NUMBERVALUE(Feuil1!N147,\".\")<=0,\"\",_xlfn.NUMBERVALUE(Feuil1!N147,\".\"))","v":""},null,"",{"$nulls":3},"",0]
[null,{"$f":"IF(_xlfn.NUMBERVALUE(Feuil1!N148,\".\")<=0,\"\",Feuil1!C148)","v":""},{"$f":"IF(_xlfn.NUMBERVALUE(Feuil1!N148,\".\")<=0,\"\",Feuil1!Q148)","v":""},{"$f":"IF(_xlfn.NUMBERVALUE(Feuil1!N148,\".\")<=0,\"\",_xlfn.NUMBERVALUE(Feuil1!N148,\".\"))","v":""},null,"",{"$nulls":3},"",0]
[null,{"$f":"IF(_xlfn.NUMBERVALUE(Feuil1!N149,\".\")<=0,\"\",Feuil1!C149)","v":""},{"$f":"IF(_xlfn.NUMBERVALUE(Feuil1!N149,\".\")<=0,\"\",Feuil1!Q149)","v":""},{"$f":"IF(_xlfn.NUMBERVALUE(Feuil1!N149,\".\")<=0,\"\",_xlfn.NUMBERVALUE(Feuil1!N149,\".\"))","v":""},null,"",{"$nulls":3},"",0]
[null,{"$f":"IF(_xlfn.NUMBERVALUE(Feuil1!N150,\".\")<=0,\"\",Feuil1!C150)","v":""},{"$f":"IF(_xlfn.NUMBERVALUE(Feuil1!N150,\".\")<=0,\"\",Feuil1!Q150)","v":""},{"$f":"IF(_xlfn.NUMBERVALUE(Feuil1!N150,\".\")<=0,\"\",_xlfn.NUMBERVALUE(Feuil1!N150,\".\"))","v":""},null,"",{"$nulls":3},"",0]
[null,{"$f":"IF(_xlfn.NUMBERVALUE(Feuil1!N151,\".\")<=0,\"\",Feuil1!C151)","v":""},{"$f":"IF(_xlfn.NUMBERVALUE(Feuil1!N151,\".\")<=0,\"\",Feuil1!Q151)","v":""},{"$f":"IF(_xlfn.NUMBERVALUE(Feuil1!N151,\".\")<=0,\"\",_xlfn.NUMBERVALUE(Feuil1!N151,\".\"))","v":""},null,"",{"$nulls":3},"",0]
[null,{"$f":"IF(_xlfn.NUMBERVALUE(Feuil1!N152,\".\")<=0,\"\",Feuil1!C152)","v":""},{"$f":"IF(_xlfn.NUMBERVALUE(Feuil1!N152,\".\")<=0,\"\",Feuil1!Q152)","v":""},{"$f":"IF(_xlfn.NUMBERVALUE(Feuil1!N152,\".\")<=0,\"\",_xlfn.NUMBERVALUE(Feuil1!N152,\".\"))","v":""},null,"",{"$nulls":3},"",0]
[null,{"$f":"IF(_xlfn.NUMBERVALUE(Feuil1!N153,\".\")<=0,\"\",Feuil1!C153)","v":""},{"$f":"IF(_xlfn.NUMBERVALUE(Feuil1!N153,\".\")<=0,\"\",Feuil1!Q153)","v":""},{"$f":"IF(_xlfn.NUMBERVALUE(Feuil1!N153,\".\")<=0,\"\",_xlfn.NUMBERVALUE(Feuil1!N153,\".\"))","v":""},null,"",{"$nulls":3},"",0]
[null,{"$f":"IF(_xlfn.NUMBERVALUE(Feuil1!N154,\".\")<=0,\"\",Feuil1!C154)","v":""},{"$f":"IF(_xlfn.NUMBERVALUE(Feuil1!N154,\".\")<=0,\"\",Feuil1!Q154)","v":""},{"$f":"IF(_xlfn.NUMBERVALUE(Feuil1!N154,\".\")<=0,\"\",_xlfn.NUMBERVALUE(Feuil1!N154,\".\"))","v":""},null,"",{"$nulls":3},"",0]
[null,{"$f":"IF(_xlfn.NUMBERVALUE(Feuil1!N155,\".\")<=0,\"\",Feuil1!C155)","v":""},{"$f":"IF(_xlfn.NUMBERVALUE(Feuil1!N155,\".\")<=0,\"\",Feuil1!Q155)","v":""},{"$f":"IF(_xlfn.NUMBERVALUE(Feuil1!N155,\".\")<=0,\"\",_xlfn.NUMBERVALUE(Feuil1!N155,\".\"))","v":""},null,"",{"$nulls":3},"",0]
[null,{"$f":"IF(_xlfn.NUMBERVALUE(Feuil1!N156,\".\")<=0,\"\",Feuil1!C156)","v":""},{"$f":"IF(_xlfn.NUMBERVALUE(Feuil1!N156,\".\")<=0,\"\",Feuil1!Q156)","v":""},{"$f":"IF(_xlfn.NUMBERVALUE(Feuil1!N156,\".\")<=0,\"\",_xlfn.NUMBERVALUE(Feuil1!N156,\".\"))","v":""},null,"",{"$nulls":3},"",0]
[null,{"$f":"IF(_xlfn.NUMBERVALUE(Feuil1!N157,\".\")<=0,\"\",Feuil1!C157)","v":""},{"$f":"IF(_xlfn.NUMBERVALUE(Feuil1!N157,\".\")<=0,\"\",Feuil1!Q157)","v":""},{"$f":"IF(_xlfn.NUMBERVALUE(Feuil1!N157,\".\")<=0,\"\",_xlfn.NUMBERVALUE(Feuil1!N157,\".\"))","v":""},null,"",{"$nulls":3},"",0]
[null,{"$f":"IF(_xlfn.NUMBERVALUE(Feuil1!N158,\".\")<=0,\"\",Feuil1!C158)","v":""},{"$f":"IF(_xlfn.NUMBERVALUE(Feuil1!N158,\".\")<=0,\"\",Feuil1!Q158)","v":""},{"$f":"IF(_xlfn.NUMBERVALUE(Feuil1!N158,\".\")<=0,\"\",_xlfn.NUMBERVALUE(Feuil1!N158,\".\"))","v":""},null,"",{"$nulls":3},"",0]
[null,{"$f":"IF(_xlfn.NUMBERVALUE(Feuil1!N159,\".\")<=0,\"\",Feuil1!C159)","v":""},{"$f":"IF(_xlfn.NUMBERVALUE(Feuil1!N159,\".\")<=0,\"\",Feuil1!Q159)","v":""},{"$f":"IF(_xlfn.NUMBERVALUE(Feuil1!N159,\".\")<=0,\"\",_xlfn.NUMBERVALUE(Feuil1!N159,\".\"))","v":""},null,"",{"$nulls":3},"",0]
[null,{"$f":"IF(_xlfn.NUMBERVALUE(Feuil1!N160,\".\")<=0,\"\",Feuil1!C160)","v":""},{"$f":"IF(_xlfn.NUMBERVALUE(Feuil1!N160,\".\")<=0,\"\",Feuil1!Q160)","v":""},{"$f":"IF(_xlfn.NUMBERVALUE(Feuil1!N160,\".\")<=0,\"\",_xlfn.NUMBERVALUE(Feuil1!N160,\".\"))","v":""},null,"",{"$nulls":3},"",0]
[null,{"$f":"IF(_xlfn.NUMBERVALUE(Feuil1!N161,\".\")<=0,\"\",Feuil1!C161)","v":""},{"$f":"IF(_xlfn.NUMBERVALUE(Feuil1!N161,\".\")<=0,\"\",Feuil1!Q161)","v":""},{"$f":"IF(_xlfn.NUMBERVALUE(Feuil1!N161,\".\")<=0,\"\",_xlfn.NUMBERVALUE(Feuil1!N161,\".\"))","v":""},null,"",{"$nulls":3},"",0]
[null,{"$f":"IF(_xlfn.NUMBERVALUE(Feuil1!N162,\".\")<=0,\"\",Feuil1!C162)","v":""},{"$f":"IF(_xlfn.NUMBERVALUE(Feuil1!N162,\".\")<=0,\"\",Feuil1!Q162)","v":""},{"$f":"IF(_xlfn.NUMBERVALUE(Feuil1!N162,\".\")<=0,\"\",_xlfn.NUMBERVALUE(Feuil1!N162,\".\"))","v":""},null,"",{"$nulls":3},"",0]
[null,{"$f":"IF(_xlfn.NUMBERVALUE(Feuil1!N163,\".\")<=0,\"\",Feuil1!C163)","v":""},{"$f":"IF(_xlfn.NUMBERVALUE(Feuil1!N163,\".\")<=0,\"\",Feuil1!Q163)","v":""},{"$f":"IF(_xlfn.NUMBERVALUE(Feuil1!N163,\".\")<=0,\"\",_xlfn.NUMBERVALUE(Feuil1!N163,\".\"))","v":""},null,"",{"$nulls":3},"",0]
[null,{"$f":"IF(_xlfn.NUMBERVALUE(Feuil1!N164,\".\")<=0,\"\",Feuil1!C164)","v":""},{"$f":"IF(_xlfn.NUMBERVALUE(Feuil1!N164,\".\")<=0,\"\",Feuil1!Q164)","v":""},{"$f":"IF(_xlfn.NUMBERVALUE(Feuil1!N164,\".\")<=0,\"\",_xlfn.NUMBERVALUE(Feuil1!N164,\".\"))","v":""},null,"",{"$nulls":3},"",0]
[null,{"$f":"IF(_xlfn.NUMBERVALUE(Feuil1!N165,\".\")<=0,\"\",Feuil1!C165)","v":""},{"$f":"IF(_xlfn.NUMBERVALUE(Feuil1!N165,\".\")<=0,\"\",Feuil1!Q165)","v":""},{"$f":"IF(_xlfn.NUMBERVALUE(Feuil1!N165,\".\")<=0,\"\",_xlfn.NUMBERVALUE(Feuil1!N165,\".\"))","v":""},null,"",{"$nulls":3},"",0]
[null,{"$f":"IF(_xlfn.NUMBERVALUE(Feuil1!N166,\".\")<=0,\"\",Feuil1!C166)","v":""},{"$f":"IF(_xlfn.NUMBERVALUE(Feuil1!N166,\".\")<=0,\"\",Feuil1!Q166)","v":""},{"$f":"IF(_xlfn.NUMBERVALUE(Feuil1!N166,\".\")<=0,\"\",_xlfn.NUMBERVALUE(Feuil1!N166,\".\"))","v":""},null,"",{"$nulls":3},"",0]
[null,{"$f":"IF(_xlfn.NUMBERVALUE(Feuil1!N167,\".\")<=0,\"\",Feuil1!C167)","v":""},{"$f":"IF(_xlfn.NUMBERVALUE(Feuil1!N167,\".\")<=0,\"\",Feuil1!Q167)","v":""},{"$f":"IF(_xlfn.NUMBERVALUE(Feuil1!N167,\".\")<=0,\"\",_xlfn.NUMBERVALUE(Feuil1!N167,\".\"))","v":""},null,"",{"$nulls":3},"",0]
[null,{"$f":"IF(_xlfn.NUMBERVALUE(Feuil1!N168,\".\")<=0,\"\",Feuil1!C168)","v":""},{"$f":"IF(_xlfn.NUMBERVALUE(Feuil1!N168,\".\")<=0,\"\",Feuil1!Q168)","v":""},{"$f":"IF(_xlfn.NUMBERVALUE(Feuil1!N168,\".\")<=0,\"\",_xlfn.NUMBERVALUE(Feuil1!N168,\".\"))","v":""},null,"",{"$nulls":3},"",0]
[null,{"$f":"IF(_xlfn.NUMBERVALUE(Feuil1!N169,\".\")<=0,\"\",Feuil1!C169)","v":""},{"$f":"IF(_xlfn.NUMBERVALUE(Feuil1!N169,\".\")<=0,\"\",Feuil1!Q169)","v":""},{"$f":"IF(_xlfn.NUMBERVALUE(Feuil1!N169,\".\")<=0,\"\",_xlfn.NUMBERVALUE(Feuil1!N169,\".\"))","v":""},null,"",{"$nulls":3},"",0]
[null,{"$f":"IF(_xlfn.NUMBERVALUE(Feuil1!N170,\".\")<=0,\"\",Feuil1!C170)","v":""},{"$f":"IF(_xlfn.NUMBERVALUE(Feuil1!N170,\".\")<=0,\"\",Feuil1!Q170)","v":""},{"$f":"IF(_xlfn.NUMBERVALUE(Feuil1!N170,\".\")<=0,\"\",_xlfn.NUMBERVALUE(Feuil1!N170,\".\"))","v":""},null,"",{"$nulls":3},"",0]
[null,{"$f":"IF(_xlfn.NUMBERVALUE(Feuil1!N171,\".\")<=0,\"\",Feuil1!C171)","v":""},{"$f":"IF(_xlfn.NUMBERVALUE(Feuil1!N171,\".\")<=0,\"\",Feuil1!Q171)","v":""},{"$f":"IF(_xlfn.NUMBERVALUE(Feuil1!N171,\".\")<=0,\"\",_xlfn.NUMBERVALUE(Feuil1!N171,\".\"))","v":""},null,"",{"$nulls":3},"",0]
[null,{"$f":"IF(_xlfn.NUMBERVALUE(Feuil1!N172,\".\")<=0,\"\",Feuil1!C172)","v":""},{"$f":"IF(_xlfn.NUMBERVALUE(Feuil1!N172,\".\")<=0,\"\",Feuil1!Q172)","v":""},{"$f":"IF(_xlfn.NUMBERVALUE(Feuil1!N172,\".\")<=0,\"\",_xlfn.NUMBERVALUE(Feuil1!N172,\".\"))","v":""},null,"",{"$nulls":3},"",0]
[null,{"$f":"IF(_xlfn.NUMBERVALUE(Feuil1!N173,\".\")<=0,\"\",Feuil1!C173)","v":""},{"$f":"IF(_xlfn.NUMBERVALUE(Feuil1!N173,\".\")<=0,\"\",Feuil1!Q173)","v":""},{"$f":"IF(_xlfn.NUMBERVALUE(Feuil1!N173,\".\")<=0,\"\",_xlfn.NUMBERVALUE(Feuil1!N173,\".\"))","v":""},null,"",{"$nulls":3},"",0]
[null,{"$f":"IF(_xlfn.NUMBERVALUE(Feuil1!N174,\".\")<=0,\"\",Feuil1!C174)","v":""},{"$f":"IF(_xlfn.NUMBERVALUE(Feuil1!N174,\".\")<=0,\"\",Feuil1!Q174)","v":""},{"$f":"IF(_xlfn.NUMBERVALUE(Feuil1!N174,\".\")<=0,\"\",_xlfn.NUMBERVALUE(Feuil1!N174,\".\"))","v":""},null,"",{"$nulls":3},"",0]
[null,{"$f":"IF(_xlfn.NUMBERVALUE(Feuil1!N175,\".\")<=0,\"\",Feuil1!C175)","v":""},{"$f":"IF(_xlfn.NUMBERVALUE(Feuil1!N175,\".\")<=0,\"\",Feuil1!Q175)","v":""},{"$f":"IF(_xlfn.NUMBERVALUE(Feuil1!N175,\".\")<=0,\"\",_xlfn.NUMBERVALUE(Feuil1!N175,\".\"))","v":""},null,"",{"$nulls":3},"",0]
[null,{"$f":"IF(_xlfn.NUMBERVALUE(Feuil1!N176,\".\")<=0,\"\",Feuil1!C176)","v":""},{"$f":"IF(_xlfn.NUMBERVALUE(Feuil1!N176,\".\")<=0,\"\",Feuil1!Q176)","v":""},{"$f":"IF(_xlfn.NUMBERVALUE(Feuil1!N176,\".\")<=0,\"\",_xlfn.NUMBERVALUE(Feuil1!N176,\".\"))","v":""},null,"",{"$nulls":3},"",0]
[null,{"$f":"IF(_xlfn.NUMBERVALUE(Feuil1!N177,\".\")<=0,\"\",Feuil1!C177)","v":""},{"$f":"IF(_xlfn.NUMBERVALUE(Feuil1!N177,\".\")<=0,\"\",Feuil1!Q177)","v":""},{"$f":"IF(_xlfn.NUMBERVALUE(Feuil1!N177,\".\")<=0,\"\",_xlfn.NUMBERVALUE(Feuil1!N177,\".\"))","v":""},null,"",{"$nulls":3},"",0]
[null,{"$f":"IF(_xlfn.NUMBERVALUE(Feuil1!N178,\".\")<=0,\"\",Feuil1!C178)","v":""},{"$f":"IF(_xlfn.NUMBERVALUE(Feuil1!N178,\".\")<=0,\"\",Feuil1!Q178)","v":""},{"$f":"IF(_xlfn.NUMBERVALUE(Feuil1!N178,\".\")<=0,\"\",_xlfn.NUMBERVALUE(Feuil1!N178,\".\"))","v":""},null,"",{"$nulls":3},"",0]
[null,{"$f":"IF(_xlfn.NUMBERVALUE(Feuil1!N179,\".\")<=0,\"\",Feuil1!C179)","v":""},{"$f":"IF(_xlfn.NUMBERVALUE(Feuil1!N179,\".\")<=0,\"\",Feuil1!Q179)","v":""},{"$f":"IF(_xlfn.NUMBERVALUE(Feuil1!N179,\".\")<=0,\"\",_xlfn.NUMBERVALUE(Feuil1!N179,\".\"))","v":""},null,"",{"$nulls":3},"",0]
[null,{"$f":"IF(_xlfn.NUMBERVALUE(Feuil1!N180,\".\")<=0,\"\",Feuil1!C180)","v":""},{"$f":"IF(_xlfn.NUMBERVALUE(Feuil1!N180,\".\")<=0,\"\",Feuil1!Q180)","v":""},{"$f":"IF(_xlfn.NUMBERVALUE(Feuil1!N180,\".\")<=0,\"\",_xlfn.NUMBERVALUE(Feuil1!N180,\".\"))","v":""},null,"",{"$nulls":3},"",0]
[null,{"$f":"IF(_xlfn.NUMBERVALUE(Feuil1!N181,\".\")<=0,\"\",Feuil1!C181)","v":""},{"$f":"IF(_xlfn.NUMBERVALUE(Feuil1!N181,\".\")<=0,\"\",Feuil1!Q181)","v":""},{"$f":"IF(_xlfn.NUMBERVALUE(Feuil1!N181,\".\")<=0,\"\",_xlfn.NUMBERVALUE(Feuil1!N181,\".\"))","v":""},null,"",{"$nulls":3},"",0]
[null,{"$f":"IF(_xlfn.NUMBERVALUE(Feuil1!N182,\".\")<=0,\"\",Feuil1!C182)","v":""},{"$f":"IF(_xlfn.NUMBERVALUE(Feuil1!N182,\".\")<=0,\"\",Feuil1!Q182)","v":""},{"$f":"IF(_xlfn.NUMBERVALUE(Feuil1!N182,\".\")<=0,\"\",_xlfn.NUMBERVALUE(Feuil1!N182,\".\"))","v":""},null,"",{"$nulls":3},"",0]
[null,{"$f":"IF(_xlfn.NUMBERVALUE(Feuil1!N183,\".\")<=0,\"\",Feuil1!C183)","v":""},{"$f":"IF(_xlfn.NUMBERVALUE(Feuil1!N183,\".\")<=0,\"\",Feuil1!Q183)","v":""},{"$f":"IF(_xlfn.NUMBERVALUE(Feuil1!N183,\".\")<=0,\"\",_xlfn.NUMBERVALUE(Feuil1!N183,\".\"))","v":""},null,"",{"$nulls":3},"",0]
[null,{"$f":"IF(_xlfn.NUMBERVALUE(Feuil1!N184,\".\")<=0,\"\",Feuil1!C184)","v":""},{"$f":"IF(_xlfn.NUMBERVALUE(Feuil1!N184,\".\")<=0,\"\",Feuil1!Q184)","v":""},{"$f":"IF(_xlfn.NUMBERVALUE(Feuil1!N184,\".\")<=0,\"\",_xlfn.NUMBERVALUE(Feuil1!N184,\".\"))","v":""},null,"",{"$nulls":3},"",0]
[null,{"$f":"IF(_xlfn.NUMBERVALUE(Feuil1!N185,\".\")<=0,\"\",Feuil1!C185)","v":""},{"$f":"IF(_xlfn.NUMBERVALUE(Feuil1!N185,\".\")<=0,\"\",Feuil1!Q185)","v":""},{"$f":"IF(_xlfn.NUMBERVALUE(Feuil1!N185,\".\")<=0,\"\",_xlfn.NUMBERVALUE(Feuil1!N185,\".\"))","v":""},null,"",{"$nulls":3},"",0]
[null,{"$f":"IF(_xlfn.NUMBERVALUE(Feuil1!N186,\".\")<=0,\"\",Feuil1!C186)","v":""},{"$f":"IF(_xlfn.NUMBERVALUE(Feuil1!N186,\".\")<=0,\"\",Feuil1!Q186)","v":""},{"$f":"IF(_xlfn.NUMBERVALUE(Feuil1!N186,\".\")<=0,\"\",_xlfn.NUMBERVALUE(Feuil1!N186,\".\"))","v":""},null,"",{"$nulls":3},"",0]
[null,{"$f":"IF(_xlfn.NUMBERVALUE(Feuil1!N187,\".\")<=0,\"\",Feuil1!C187)","v":""},{"$f":"IF(_xlfn.NUMBERVALUE(Feuil1!N187,\".\")<=0,\"\",Feuil1!Q187)","v":""},{"$f":"IF(_xlfn.NUMBERVALUE(Feuil1!N187,\".\")<=0,\"\",_xlfn.NUMBERVALUE(Feuil1!N187,\".\"))","v":""},null,"",{"$nulls":3},"",0]
[null,{"$f":"IF(_xlfn.NUMBERVALUE(Feuil1!N188,\".\")<=0,\"\",Feuil1!C188)","v":""},{"$f":"IF(_xlfn.NUMBERVALUE(Feuil1!N188,\".\")<=0,\"\",Feuil1!Q188)","v":""},{"$f":"IF(_xlfn.NUMBERVALUE(Feuil1!N188,\".\")<=0,\"\",_xlfn.NUMBERVALUE(Feuil1!N188,\".\"))","v":""},null,"",{"$nulls":3},"",0]
[null,{"$f":"IF(_xlfn.NUMBERVALUE(Feuil1!N189,\".\")<=0,\"\",Feuil1!C189)","v":""},{"$f":"IF(_xlfn.NUMBERVALUE(Feuil1!N189,\".\")<=0,\"\",Feuil1!Q189)","v":""},{"$f":"IF(_xlfn.NUMBERVALUE(Feuil1!N189,\".\")<=0,\"\",_xlfn.NUMBERVALUE(Feuil1!N189,\".\"))","v":""},null,"",{"$nulls":3},"",0]
[null,{"$f":"IF(_xlfn.NUMBERVALUE(Feuil1!N190,\".\")<=0,\"\",Feuil1!C190)","v":""},{"$f":"IF(_xlfn.NUMBERVALUE(Feuil1!N190,\".\")<=0,\"\",Feuil1!Q190)","v":""},{"$f":"IF(_xlfn.NUMBERVALUE(Feuil1!N190,\".\")<=0,\"\",_xlfn.NUMBERVALUE(Feuil1!N190,\".\"))","v":""},null,"",{"$nulls":3},"",0]
[null,{"$f":"IF(_xlfn.NUMBERVALUE(Feuil1!N191,\".\")<=0,\"\",Feuil1!C191)","v":""},{"$f":"IF(_xlfn.NUMBERVALUE(Feuil1!N191,\".\")<=0,\"\",Feuil1!Q191)","v":""},{"$f":"IF(_xlfn.NUMBERVALUE(Feuil1!N191,\".\")<=0,\"\",_xlfn.NUMBERVALUE(Feuil1!N191,\".\"))","v":""},null,"",{"$nulls":3},"",0]
[null,{"$f":"IF(_xlfn.NUMBERVALUE(Feuil1!N192,\".\")<=0,\"\",Feuil1!C192)","v":""},{"$f":"IF(_xlfn.NUMBERVALUE(Feuil1!N192,\".\")<=0,\"\",Feuil1!Q192)","v":""},{"$f":"IF(_xlfn.NUMBERVALUE(Feuil1!N192,\".\")<=0,\"\",_xlfn.NUMBERVALUE(Feuil1!N192,\".\"))","v":""},null,"",{"$nulls":3},"",0]
[null,{"$f":"IF(_xlfn.NUMBERVALUE(Feuil1!N193,\".\")<=0,\"\",Feuil1!C193)","v":""},{"$f":"IF(_xlfn.NUMBERVALUE(Feuil1!N193,\".\")<=0,\"\",Feuil1!Q193)","v":""},{"$f":"IF(_xlfn.NUMBERVALUE(Feuil1!N193,\".\")<=0,\"\",_xlfn.NUMBERVALUE(Feuil1!N193,\".\"))","v":""},null,"",{"$nulls":3},"",0]
[null,{"$f":"IF(_xlfn.NUMBERVALUE(Feuil1!N194,\".\")<=0,\"\",Feuil1!C194)","v":""},{"$f":"IF(_xlfn.NUMBERVALUE(Feuil1!N194,\".\")<=0,\"\",Feuil1!Q194)","v":""},{"$f":"IF(_xlfn.NUMBERVALUE(Feuil1!N194,\".\")<=0,\"\",_xlfn.NUMBERVALUE(Feuil1!N194,\".\"))","v":""},null,"",{"$nulls":3},"",0]
[null,{"$f":"IF(_xlfn.NUMBERVALUE(Feuil1!N195,\".\")<=0,\"\",Feuil1!C195)","v":""},{"$f":"IF(_xlfn.NUMBERVALUE(Feuil1!N195,\".\")<=0,\"\",Feuil1!Q195)","v":""},{"$f":"IF(_xlfn.NUMBERVALUE(Feuil1!N195,\".\")<=0,\"\",_xlfn.NUMBERVALUE(Feuil1!N195,\".\"))","v":""},null,"",{"$nulls":3},"",0]
[null,{"$f":"IF(_xlfn.NUMBERVALUE(Feuil1!N196,\".\")<=0,\"\",Feuil1!C196)","v":""},{"$f":"IF(_xlfn.NUMBERVALUE(Feuil1!N196,\".\")<=0,\"\",Feuil1!Q196)","v":""},{"$f":"IF(_xlfn.NUMBERVALUE(Feuil1!N196,\".\")<=0,\"\",_xlfn.NUMBERVALUE(Feuil1!N196,\".\"))","v":""},null,"",{"$nulls":3},{"$f":"IF(D214<>\"\",IF(E214=\"\",\"Finding Nbr\",IF(F214=\"\",\"Add Nature\",IF(G214=\"\",\"Add Source\",\"Ok\"))),IF(F214<>\"\",\"remove Nature\",IF(G214<>\"\",\"remove Source\",\"\")))","v":""},{"$f":"IF(J214=\"Ok\",0,IF(J214=\"\",0,1))","v":0}]
[null,{"$f":"IF(_xlfn.NUMBERVALUE(Feuil1!N197,\".\")<=0,\"\",Feuil1!C197)","v":""},{"$f":"IF(_xlfn.NUMBERVALUE(Feuil1!N197,\".\")<=0,\"\",Feuil1!Q197)","v":""},{"$f":"IF(_xlfn.NUMBERVALUE(Feuil1!N197,\".\")<=0,\"\",_xlfn.NUMBERVALUE(Feuil1!N197,\".\"))","v":""},null,{"$f":"IF(G215=\"Mandatory Replacement\",\"Mandatory replacement\",IF(G215=\"SUP\",\"Incorrect / Suspected unapproved\",\"\"))","v":""},{"$nulls":3},"",0]
[null,{"$f":"IF(_xlfn.NUMBERVALUE(Feuil1!N198,\".\")<=0,\"\",Feuil1!C198)","v":""},{"$f":"IF(_xlfn.NUMBERVALUE(Feuil1!N198,\".\")<=0,\"\",Feuil1!Q198)","v":""},{"$f":"IF(_xlfn.NUMBERVALUE(Feuil1!N198,\".\")<=0,\"\",_xlfn.NUMBERVALUE(Feuil1!N198,\".\"))","v":""},null,"",{"$nulls":3},"",0]
[null,{"$f":"IF(_xlfn.NUMBERVALUE(Feuil1!N199,\".\")<=0,\"\",Feuil1!C199)","v":""},{"$f":"IF(_xlfn.NUMBERVALUE(Feuil1!N199,\".\")<=0,\"\",Feuil1!Q199)","v":""},{"$f":"IF(_xlfn.NUMBERVALUE(Feuil1!N199,\".\")<=0,\"\",_xlfn.NUMBERVALUE(Feuil1!N199,\".\"))","v":""},null,"",{"$nulls":3},"",0]
[null,{"$f":"IF(_xlfn.NUMBERVALUE(Feuil1!N200,\".\")<=0,\"\",Feuil1!C200)","v":""},{"$f":"IF(_xlfn.NUMBERVALUE(Feuil1!N200,\".\")<=0,\"\",Feuil1!Q200)","v":""},{"$f":"IF(_xlfn.NUMBERVALUE(Feuil1!N200,\".\")<=0,\"\",_xlfn.NUMBERVALUE(Feuil1!N200,\".\"))","v":""},null,"",{"$nulls":3},"",0]
[null,{"$f":"IF(_xlfn.NUMBERVALUE(Feuil1!N201,\".\")<=0,\"\",Feuil1!C201)","v":""},{"$f":"IF(_xlfn.NUMBERVALUE(Feuil1!N201,\".\")<=0,\"\",Feuil1!Q201)","v":""},{"$f":"IF(_xlfn.NUMBERVALUE(Feuil1!N201,\".\")<=0,\"\",_xlfn.NUMBERVALUE(Feuil1!N201,\".\"))","v":""},null,"",{"$nulls":3},"",0]
[null,{"$f":"IF(_xlfn.NUMBERVALUE(Feuil1!N202,\".\")<=0,\"\",Feuil1!C202)","v":""},{"$f":"IF(_xlfn.NUMBERVALUE(Feuil1!N202,\".\")<=0,\"\",Feuil1!Q202)","v":""},{"$f":"IF(_xlfn.NUMBERVALUE(Feuil1!N202,\".\")<=0,\"\",_xlfn.NUMBERVALUE(Feuil1!N202,\".\"))","v":""},null,"",{"$nulls":3},"",0]
[null,{"$f":"IF(_xlfn.NUMBERVALUE(Feuil1!N203,\".\")<=0,\"\",Feuil1!C203)","v":""},{"$f":"IF(_xlfn.NUMBERVALUE(Feuil1!N203,\".\")<=0,\"\",Feuil1!Q203)","v":""},{"$f":"IF(_xlfn.NUMBERVALUE(Feuil1!N203,\".\")<=0,\"\",_xlfn.NUMBERVALUE(Feuil1!N203,\".\"))","v":""},null,"",{"$nulls":3},"",0]
[null,{"$f":"IF(_xlfn.NUMBERVALUE(Feuil1!N204,\".\")<=0,\"\",Feuil1!C204)","v":""},{"$f":"IF(_xlfn.NUMBERVALUE(Feuil1!N204,\".\")<=0,\"\",Feuil1!Q204)","v":""},{"$f":"IF(_xlfn.NUMBERVALUE(Feuil1!N204,\".\")<=0,\"\",_xlfn.NUMBERVALUE(Feuil1!N204,\".\"))","v":""},null,"",{"$nulls":3},"",0]
[null,{"$f":"IF(_xlfn.NUMBERVALUE(Feuil1!N205,\".\")<=0,\"\",Feuil1!C205)","v":""},{"$f":"IF(_xlfn.NUMBERVALUE(Feuil1!N205,\".\")<=0,\"\",Feuil1!Q205)","v":""},{"$f":"IF(_xlfn.NUMBERVALUE(Feuil1!N205,\".\")<=0,\"\",_xlfn.NUMBERVALUE(Feuil1!N205,\".\"))","v":""},null,"",{"$nulls":3},"",0]
[null,{"$f":"IF(_xlfn.NUMBERVALUE(Feuil1!N206,\".\")<=0,\"\",Feuil1!C206)","v":""},{"$f":"IF(_xlfn.NUMBERVALUE(Feuil1!N206,\".\")<=0,\"\",Feuil1!Q206)","v":""},{"$f":"IF(_xlfn.NUMBERVALUE(Feuil1!N206,\".\")<=0,\"\",_xlfn.NUMBERVALUE(Feuil1!N206,\".\"))","v":""},null,"",{"$nulls":3},"",0]
[null,{"$f":"IF(_xlfn.NUMBERVALUE(Feuil1!N207,\".\")<=0,\"\",Feuil1!C207)","v":""},{"$f":"IF(_xlfn.NUMBERVALUE(Feuil1!N207,\".\")<=0,\"\",Feuil1!Q207)","v":""},{"$f":"IF(_xlfn.NUMBERVALUE(Feuil1!N207,\".\")<=0,\"\",_xlfn.NUMBERVALUE(Feuil1!N207,\".\"))","v":""},null,"",{"$nulls":3},"",0]
[null,{"$f":"IF(_xlfn.NUMBERVALUE(Feuil1!N208,\".\")<=0,\"\",Feuil1!C208)","v":""},{"$f":"IF(_xlfn.NUMBERVALUE(Feuil1!N208,\".\")<=0,\"\",Feuil1!Q208)","v":""},{"$f":"IF(_xlfn.NUMBERVALUE(Feuil1!N208,\".\")<=0,\"\",_xlfn.NUMBERVALUE(Feuil1!N208,\".\"))","v":""},null,"",{"$nulls":3},"",0]
[null,{"$f":"IF(_xlfn.NUMBERVALUE(Feuil1!N209,\".\")<=0,\"\",Feuil1!C209)","v":""},{"$f":"IF(_xlfn.NUMBERVALUE(Feuil1!N209,\".\")<=0,\"\",Feuil1!Q209)","v":""},{"$f":"IF(_xlfn.NUMBERVALUE(Feuil1!N209,\".\")<=0,\"\",_xlfn.NUMBERVALUE(Feuil1!N209,\".\"))","v":""},null,"",{"$nulls":3},"",0]
[null,{"$f":"IF(_xlfn.NUMBERVALUE(Feuil1!N210,\".\")<=0,\"\",Feuil1!C210)","v":""},{"$f":"IF(_xlfn.NUMBERVALUE(Feuil1!N210,\".\")<=0,\"\",Feuil1!Q210)","v":""},{"$f":"IF(_xlfn.NUMBERVALUE(Feuil1!N210,\".\")<=0,\"\",_xlfn.NUMBERVALUE(Feuil1!N210,\".\"))","v":""},null,"",{"$nulls":3},"",0]
[null,{"$f":"IF(_xlfn.NUMBERVALUE(Feuil1!N211,\".\")<=0,\"\",Feuil1!C211)","v":""},{"$f":"IF(_xlfn.NUMBERVALUE(Feuil1!N211,\".\")<=0,\"\",Feuil1!Q211)","v":""},{"$f":"IF(_xlfn.NUMBERVALUE(Feuil1!N211,\".\")<=0,\"\",_xlfn.NUMBERVALUE(Feuil1!N211,\".\"))","v":""},null,"",{"$nulls":3},"",0]
[null,{"$f":"IF(_xlfn.NUMBERVALUE(Feuil1!N212,\".\")<=0,\"\",Feuil1!C212)","v":""},{"$f":"IF(_xlfn.NUMBERVALUE(Feuil1!N212,\".\")<=0,\"\",Feuil1!Q212)","v":""},{"$f":"IF(_xlfn.NUMBERVALUE(Feuil1!N212,\".\")<=0,\"\",_xlfn.NUMBERVALUE(Feuil1!N212,\".\"))","v":""},null,"",{"$nulls":3},"",0]
[null,{"$f":"IF(_xlfn.NUMBERVALUE(Feuil1!N213,\".\")<=0,\"\",Feuil1!C213)","v":""},{"$f":"IF(_xlfn.NUMBERVALUE(Feuil1!N213,\".\")<=0,\"\",Feuil1!Q213)","v":""},{"$f":"IF(_xlfn.NUMBERVALUE(Feuil1!N213,\".\")<=0,\"\",_xlfn.NUMBERVALUE(Feuil1!N213,\".\"))","v":""},null,"",{"$nulls":3},"",0]
[null,{"$f":"IF(_xlfn.NUMBERVALUE(Feuil1!N214,\".\")<=0,\"\",Feuil1!C214)","v":""},{"$f":"IF(_xlfn.NUMBERVALUE(Feuil1!N214,\".\")<=0,\"\",Feuil1!Q214)","v":""},{"$f":"IF(_xlfn.NUMBERVALUE(Feuil1!N214,\".\")<=0,\"\",_xlfn.NUMBERVALUE(Feuil1!N214,\".\"))","v":""},null,"",{"$nulls":3},"",0]
[null,{"$f":"IF(_xlfn.NUMBERVALUE(Feuil1!N215,\".\")<=0,\"\",Feuil1!C215)","v":""},{"$f":"IF(_xlfn.NUMBERVALUE(Feuil1!N215,\".\")<=0,\"\",Feuil1!Q215)","v":""},{"$f":"IF(_xlfn.NUMBERVALUE(Feuil1!N215,\".\")<=0,\"\",_xlfn.NUMBERVALUE(Feuil1!N215,\".\"))","v":""},null,"",{"$nulls":3},"",0]
[null,{"$f":"IF(_xlfn.NUMBERVALUE(Feuil1!N216,\".\")<=0,\"\",Feuil1!C216)","v":""},{"$f":"IF(_xlfn.NUMBERVALUE(Feuil1!N216,\".\")<=0,\"\",Feuil1!Q216)","v":""},{"$f":"IF(_xlfn.NUMBERVALUE(Feuil1!N216,\".\")<=0,\"\",_xlfn.NUMBERVALUE(Feuil1!N216,\".\"))","v":""},null,"",{"$nulls":3},"",0]
[null,{"$f":"IF(_xlfn.NUMBERVALUE(Feuil1!N217,\".\")<=0,\"\",Feuil1!C217)","v":""},{"$f":"IF(_xlfn.NUMBERVALUE(Feuil1!N217,\".\")<=0,\"\",Feuil1!Q217)","v":""},{"$f":"IF(_xlfn.NUMBERVALUE(Feuil1!N217,\".\")<=0,\"\",_xlfn.NUMBERVALUE(Feuil1!N217,\".\"))","v":""},null,"",{"$nulls":3},"",0]
[null,{"$f":"IF(_xlfn.NUMBERVALUE(Feuil1!N218,\".\")<=0,\"\",Feuil1!C218)","v":""},{"$f":"IF(_xlfn.NUMBERVALUE(Feuil1!N218,\".\")<=0,\"\",Feuil1!Q218)","v":""},{"$f":"IF(_xlfn.NUMBERVALUE(Feuil1!N218,\".\")<=0,\"\",_xlfn.NUMBERVALUE(Feuil1!N218,\".\"))","v":""},null,"",{"$nulls":3},"",0]
[null,{"$f":"IF(_xlfn.NUMBERVALUE(Feuil1!N219,\".\")<=0,\"\",Feuil1!C219)","v":""},{"$f":"IF(_xlfn.NUMBERVALUE(Feuil1!N219,\".\")<=0,\"\",Feuil1!Q219)","v":""},{"$f":"IF(_xlfn.NUMBERVALUE(Feuil1!N219,\".\")<=0,\"\",_xlfn.NUMBERVALUE(Feuil1!N219,\".\"))","v":""},null,"",{"$nulls":3},"",0]
[null,{"$f":"IF(_xlfn.NUMBERVALUE(Feuil1!N220,\".\")<=0,\"\",Feuil1!C220)","v":""},{"$f":"IF(_xlfn.NUMBERVALUE(Feuil1!N220,\".\")<=0,\"\",Feuil1!Q220)","v":""},{"$f":"IF(_xlfn.NUMBERVALUE(Feuil1!N220,\".\")<=0,\"\",_xlfn.NUMBERVALUE(Feuil1!N220,\".\"))","v":""},null,"",{"$nulls":3},"",0]
[null,{"$f":"IF(_xlfn.NUMBERVALUE(Feuil1!N221,\".\")<=0,\"\",Feuil1!C221)","v":""},{"$f":"IF(_xlfn.NUMBERVALUE(Feuil1!N221,\".\")<=0,\"\",Feuil1!Q221)","v":""},{"$f":"IF(_xlfn.NUMBERVALUE(Feuil1!N221,\".\")<=0,\"\",_xlfn.NUMBERVALUE(Feuil1!N221,\".\"))","v":""},null,"",{"$nulls":3},"",0]
[null,{"$f":"IF(_xlfn.NUMBERVALUE(Feuil1!N222,\".\")<=0,\"\",Feuil1!C222)","v":""},{"$f":"IF(_xlfn.NUMBERVALUE(Feuil1!N222,\".\")<=0,\"\",Feuil1!Q222)","v":""},{"$f":"IF(_xlfn.NUMBERVALUE(Feuil1!N222,\".\")<=0,\"\",_xlfn.NUMBERVALUE(Feuil1!N222,\".\"))","v":""},null,"",{"$nulls":3},"",0]
[null,{"$f":"IF(_xlfn.NUMBERVALUE(Feuil1!N223,\".\")<=0,\"\",Feuil1!C223)","v":""},{"$f":"IF(_xlfn.NUMBERVALUE(Feuil1!N223,\".\")<=0,\"\",Feuil1!Q223)","v":""},{"$f":"IF(_xlfn.NUMBERVALUE(Feuil1!N223,\".\")<=0,\"\",_xlfn.NUMBERVALUE(Feuil1!N223,\".\"))","v":""},null,"",{"$nulls":3},"",0]
[null,{"$f":"IF(_xlfn.NUMBERVALUE(Feuil1!N224,\".\")<=0,\"\",Feuil1!C224)","v":""},{"$f":"IF(_xlfn.NUMBERVALUE(Feuil1!N224,\".\")<=0,\"\",Feuil1!Q224)","v":""},{"$f":"IF(_xlfn.NUMBERVALUE(Feuil1!N224,\".\")<=0,\"\",_xlfn.NUMBERVALUE(Feuil1!N224,\".\"))","v":""},null,"",{"$nulls":3},"",0]
[null,{"$f":"IF(_xlfn.NUMBERVALUE(Feuil1!N225,\".\")<=0,\"\",Feuil1!C225)","v":""},{"$f":"IF(_xlfn.NUMBERVALUE(Feuil1!N225,\".\")<=0,\"\",Feuil1!Q225)","v":""},{"$f":"IF(_xlfn.NUMBERVALUE(Feuil1!N225,\".\")<=0,\"\",_xlfn.NUMBERVALUE(Feuil1!N225,\".\"))","v":""},null,"",{"$nulls":3},"",0]
[null,{"$f":"IF(_xlfn.NUMBERVALUE(Feuil1!N226,\".\")<=0,\"\",Feuil1!C226)","v":""},{"$f":"IF(_xlfn.NUMBERVALUE(Feuil1!N226,\".\")<=0,\"\",Feuil1!Q226)","v":""},{"$f":"IF(_xlfn.NUMBERVALUE(Feuil1!N226,\".\")<=0,\"\",_xlfn.NUMBERVALUE(Feuil1!N226,\".\"))","v":""},null,"",{"$nulls":3},"",0]
[null,{"$f":"IF(_xlfn.NUMBERVALUE(Feuil1!N227,\".\")<=0,\"\",Feuil1!C227)","v":""},{"$f":"IF(_xlfn.NUMBERVALUE(Feuil1!N227,\".\")<=0,\"\",Feuil1!Q227)","v":""},{"$f":"IF(_xlfn.NUMBERVALUE(Feuil1!N227,\".\")<=0,\"\",_xlfn.NUMBERVALUE(Feuil1!N227,\".\"))","v":""},null,"",{"$nulls":3},"",0]
[null,{"$f":"IF(_xlfn.NUMBERVALUE(Feuil1!N228,\".\")<=0,\"\",Feuil1!C228)","v":""},{"$f":"IF(_xlfn.NUMBERVALUE(Feuil1!N228,\".\")<=0,\"\",Feuil1!Q228)","v":""},{"$f":"IF(_xlfn.NUMBERVALUE(Feuil1!N228,\".\")<=0,\"\",_xlfn.NUMBERVALUE(Feuil1!N228,\".\"))","v":""},null,"",{"$nulls":3},"",0]
[null,{"$f":"IF(_xlfn.NUMBERVALUE(Feuil1!N229,\".\")<=0,\"\",Feuil1!C229)","v":""},{"$f":"IF(_xlfn.NUMBERVALUE(Feuil1!N229,\".\")<=0,\"\",Feuil1!Q229)","v":""},{"$f":"IF(_xlfn.NUMBERVALUE(Feuil1!N229,\".\")<=0,\"\",_xlfn.NUMBERVALUE(Feuil1!N229,\".\"))","v":""},null,"",{"$nulls":3},"",0]
[null,{"$f":"IF(_xlfn.NUMBERVALUE(Feuil1!N230,\".\")<=0,\"\",Feuil1!C230)","v":""},{"$f":"IF(_xlfn.NUMBERVALUE(Feuil1!N230,\".\")<=0,\"\",Feuil1!Q230)","v":""},{"$f":"IF(_xlfn.NUMBERVALUE(Feuil1!N230,\".\")<=0,\"\",_xlfn.NUMBERVALUE(Feuil1!N230,\".\"))","v":""},null,"",{"$nulls":3},"",0]
[null,{"$f":"IF(_xlfn.NUMBERVALUE(Feuil1!N231,\".\")<=0,\"\",Feuil1!C231)","v":""},{"$f":"IF(_xlfn.NUMBERVALUE(Feuil1!N231,\".\")<=0,\"\",Feuil1!Q231)","v":""},{"$f":"IF(_xlfn.NUMBERVALUE(Feuil1!N231,\".\")<=0,\"\",_xlfn.NUMBERVALUE(Feuil1!N231,\".\"))","v":""},null,"",{"$nulls":3},"",0]
[null,{"$f":"IF(_xlfn.NUMBERVALUE(Feuil1!N232,\".\")<=0,\"\",Feuil1!C232)","v":""},{"$f":"IF(_xlfn.NUMBERVALUE(Feuil1!N232,\".\")<=0,\"\",Feuil1!Q232)","v":""},{"$f":"IF(_xlfn.NUMBERVALUE(Feuil1!N232,\".\")<=0,\"\",_xlfn.NUMBERVALUE(Feuil1!N232,\".\"))","v":""},null,"",{"$nulls":3},"",0]
[null,{"$f":"IF(_xlfn.NUMBERVALUE(Feuil1!N233,\".\")<=0,\"\",Feuil1!C233)","v":""},{"$f":"IF(_xlfn.NUMBERVALUE(Feuil1!N233,\".\")<=0,\"\",Feuil1!Q233)","v":""},{"$f":"IF(_xlfn.NUMBERVALUE(Feuil1!N233,\".\")<=0,\"\",_xlfn.NUMBERVALUE(Feuil1!N233,\".\"))","v":""},null,"",{"$nulls":3},"",0]
[null,{"$f":"IF(_xlfn.NUMBERVALUE(Feuil1!N234,\".\")<=0,\"\",Feuil1!C234)","v":""},{"$f":"IF(_xlfn.NUMBERVALUE(Feuil1!N234,\".\")<=0,\"\",Feuil1!Q234)","v":""},{"$f":"IF(_xlfn.NUMBERVALUE(Feuil1!N234,\".\")<=0,\"\",_xlfn.NUMBERVALUE(Feuil1!N234,\".\"))","v":""},null,"",{"$nulls":3},"",0]
[null,{"$f":"IF(_xlfn.NUMBERVALUE(Feuil1!N235,\".\")<=0,\"\",Feuil1!C235)","v":""},{"$f":"IF(_xlfn.NUMBERVALUE(Feuil1!N235,\".\")<=0,\"\",Feuil1!Q235)","v":""},{"$f":"IF(_xlfn.NUMBERVALUE(Feuil1!N235,\".\")<=0,\"\",_xlfn.NUMBERVALUE(Feuil1!N235,\".\"))","v":""},null,"",{"$nulls":3},"",0]
[null,{"$f":"IF(_xlfn.NUMBERVALUE(Feuil1!N236,\".\")<=0,\"\",Feuil1!C236)","v":""},{"$f":"IF(_xlfn.NUMBERVALUE(Feuil1!N236,\".\")<=0,\"\",Feuil1!Q236)","v":""},{"$f":"IF(_xlfn.NUMBERVALUE(Feuil1!N236,\".\")<=0,\"\",_xlfn.NUMBERVALUE(Feuil1!N236,\".\"))","v":""},null,"",{"$nulls":3},"",0]
[null,{"$f":"IF(_xlfn.NUMBERVALUE(Feuil1!N237,\".\")<=0,\"\",Feuil1!C237)","v":""},{"$f":"IF(_xlfn.NUMBERVALUE(Feuil1!N237,\".\")<=0,\"\",Feuil1!Q237)","v":""},{"$f":"IF(_xlfn.NUMBERVALUE(Feuil1!N237,\".\")<=0,\"\",_xlfn.NUMBERVALUE(Feuil1!N237,\".\"))","v":""},null,"",{"$nulls":3},"",0]
[null,{"$f":"IF(_xlfn.NUMBERVALUE(Feuil1!N238,\".\")<=0,\"\",Feuil1!C238)","v":""},{"$f":"IF(_xlfn.NUMBERVALUE(Feuil1!N238,\".\")<=0,\"\",Feuil1!Q238)","v":""},{"$f":"IF(_xlfn.NUMBERVALUE(Feuil1!N238,\".\")<=0,\"\",_xlfn.NUMBERVALUE(Feuil1!N238,\".\"))","v":""},null,"",{"$nulls":3},"",0]
[null,{"$f":"IF(_xlfn.NUMBERVALUE(Feuil1!N239,\".\")<=0,\"\",Feuil1!C239)","v":""},{"$f":"IF(_xlfn.NUMBERVALUE(Feuil1!N239,\".\")<=0,\"\",Feuil1!Q239)","v":""},{"$f":"IF(_xlfn.NUMBERVALUE(Feuil1!N239,\".\")<=0,\"\",_xlfn.NUMBERVALUE(Feuil1!N239,\".\"))","v":""},null,"",{"$nulls":3},"",0]
[null,{"$f":"IF(_xlfn.NUMBERVALUE(Feuil1!N240,\".\")<=0,\"\",Feuil1!C240)","v":""},{"$f":"IF(_xlfn.NUMBERVALUE(Feuil1!N240,\".\")<=0,\"\",Feuil1!Q240)","v":""},{"$f":"IF(_xlfn.NUMBERVALUE(Feuil1!N240,\".\")<=0,\"\",_xlfn.NUMBERVALUE(Feuil1!N240,\".\"))","v":""},null,"",{"$nulls":3},"",0]
[null,{"$f":"IF(_xlfn.NUMBERVALUE(Feuil1!N241,\".\")<=0,\"\",Feuil1!C241)","v":""},{"$f":"IF(_xlfn.NUMBERVALUE(Feuil1!N241,\".\")<=0,\"\",Feuil1!Q241)","v":""},{"$f":"IF(_xlfn.NUMBERVALUE(Feuil1!N241,\".\")<=0,\"\",_xlfn.NUMBERVALUE(Feuil1!N241,\".\"))","v":""},null,"",{"$nulls":3},"",0]
[null,{"$f":"IF(_xlfn.NUMBERVALUE(Feuil1!N242,\".\")<=0,\"\",Feuil1!C242)","v":""},{"$f":"IF(_xlfn.NUMBERVALUE(Feuil1!N242,\".\")<=0,\"\",Feuil1!Q242)","v":""},{"$f":"IF(_xlfn.NUMBERVALUE(Feuil1!N242,\".\")<=0,\"\",_xlfn.NUMBERVALUE(Feuil1!N242,\".\"))","v":""},null,"",{"$nulls":3},"",0]
[null,{"$f":"IF(_xlfn.NUMBERVALUE(Feuil1!N243,\".\")<=0,\"\",Feuil1!C243)","v":""},{"$f":"IF(_xlfn.NUMBERVALUE(Feuil1!N243,\".\")<=0,\"\",Feuil1!Q243)","v":""},{"$f":"IF(_xlfn.NUMBERVALUE(Feuil1!N243,\".\")<=0,\"\",_xlfn.NUMBERVALUE(Feuil1!N243,\".\"))","v":""},null,"",{"$nulls":3},"",0]
[null,{"$f":"IF(_xlfn.NUMBERVALUE(Feuil1!N244,\".\")<=0,\"\",Feuil1!C244)","v":""},{"$f":"IF(_xlfn.NUMBERVALUE(Feuil1!N244,\".\")<=0,\"\",Feuil1!Q244)","v":""},{"$f":"IF(_xlfn.NUMBERVALUE(Feuil1!N244,\".\")<=0,\"\",_xlfn.NUMBERVALUE(Feuil1!N244,\".\"))","v":""},null,"",{"$nulls":3},"",0]
[null,{"$f":"IF(_xlfn.NUMBERVALUE(Feuil1!N245,\".\")<=0,\"\",Feuil1!C245)","v":""},{"$f":"IF(_xlfn.NUMBERVALUE(Feuil1!N245,\".\")<=0,\"\",Feuil1!Q245)","v":""},{"$f":"IF(_xlfn.NUMBERVALUE(Feuil1!N245,\".\")<=0,\"\",_xlfn.NUMBERVALUE(Feuil1!N245,\".\"))","v":""},null,"",{"$nulls":3},"",0]
[null,{"$f":"IF(_xlfn.NUMBERVALUE(Feuil1!N246,\".\")<=0,\"\",Feuil1!C246)","v":""},{"$f":"IF(_xlfn.NUMBERVALUE(Feuil1!N246,\".\")<=0,\"\",Feuil1!Q246)","v":""},{"$f":"IF(_xlfn.NUMBERVALUE(Feuil1!N246,\".\")<=0,\"\",_xlfn.NUMBERVALUE(Feuil1!N246,\".\"))","v":""},null,"",{"$nulls":3},"",0]
[null,{"$f":"IF(_xlfn.NUMBERVALUE(Feuil1!N247,\".\")<=0,\"\",Feuil1!C247)","v":""},{"$f":"IF(_xlfn.NUMBERVALUE(Feuil1!N247,\".\")<=0,\"\",Feuil1!Q247)","v":""},{"$f":"IF(_xlfn.NUMBERVALUE(Feuil1!N247,\".\")<=0,\"\",_xlfn.NUMBERVALUE(Feuil1!N247,\".\"))","v":""},null,"",{"$nulls":3},"",0]
[null,{"$f":"IF(_xlfn.NUMBERVALUE(Feuil1!N248,\".\")<=0,\"\",Feuil1!C248)","v":""},{"$f":"IF(_xlfn.NUMBERVALUE(Feuil1!N248,\".\")<=0,\"\",Feuil1!Q248)","v":""},{"$f":"IF(_xlfn.NUMBERVALUE(Feuil1!N248,\".\")<=0,\"\",_xlfn.NUMBERVALUE(Feuil1!N248,\".\"))","v":""},null,"",{"$nulls":3},"",0]
[null,{"$f":"IF(_xlfn.NUMBERVALUE(Feuil1!N249,\".\")<=0,\"\",Feuil1!C249)","v":""},{"$f":"IF(_xlfn.NUMBERVALUE(Feuil1!N249,\".\")<=0,\"\",Feuil1!Q249)","v":""},{"$f":"IF(_xlfn.NUMBERVALUE(Feuil1!N249,\".\")<=0,\"\",_xlfn.NUMBERVALUE(Feuil1!N249,\".\"))","v":""},null,"",{"$nulls":3},"",0]
[null,{"$f":"IF(_xlfn.NUMBERVALUE(Feuil1!N250,\".\")<=0,\"\",Feuil1!C250)","v":""},{"$f":"IF(_xlfn.NUMBERVALUE(Feuil1!N250,\".\")<=0,\"\",Feuil1!Q250)","v":""},{"$f":"IF(_xlfn.NUMBERVALUE(Feuil1!N250,\".\")<=0,\"\",_xlfn.NUMBERVALUE(Feuil1!N250,\".\"))","v":""},null,"",{"$nulls":3},"",0]
[null,{"$f":"IF(_xlfn.NUMBERVALUE(Feuil1!N251,\".\")<=0,\"\",Feuil1!C251)","v":""},{"$f":"IF(_xlfn.NUMBERVALUE(Feuil1!N251,\".\")<=0,\"\",Feuil1!Q251)","v":""},{"$f":"IF(_xlfn.NUMBERVALUE(Feuil1!N251,\".\")<=0,\"\",_xlfn.NUMBERVALUE(Feuil1!N251,\".\"))","v":""},null,"",{"$nulls":3},"",0]
[null,{"$f":"IF(_xlfn.NUMBERVALUE(Feuil1!N252,\".\")<=0,\"\",Feuil1!C252)","v":""},{"$f":"IF(_xlfn.NUMBERVALUE(Feuil1!N252,\".\")<=0,\"\",Feuil1!Q252)","v":""},{"$f":"IF(_xlfn.NUMBERVALUE(Feuil1!N252,\".\")<=0,\"\",_xlfn.NUMBERVALUE(Feuil1!N252,\".\"))","v":""},null,"",{"$nulls":3},"",0]
[null,{"$f":"IF(_xlfn.NUMBERVALUE(Feuil1!N253,\".\")<=0,\"\",Feuil1!C253)","v":""},{"$f":"IF(_xlfn.NUMBERVALUE(Feuil1!N253,\".\")<=0,\"\",Feuil1!Q253)","v":""},{"$f":"IF(_xlfn.NUMBERVALUE(Feuil1!N253,\".\")<=0,\"\",_xlfn.NUMBERVALUE(Feuil1!N253,\".\"))","v":""},null,"",{"$nulls":3},"",0]
[null,{"$f":"IF(_xlfn.NUMBERVALUE(Feuil1!N254,\".\")<=0,\"\",Feuil1!C254)","v":""},{"$f":"IF(_xlfn.NUMBERVALUE(Feuil1!N254,\".\")<=0,\"\",Feuil1!Q254)","v":""},{"$f":"IF(_xlfn.NUMBERVALUE(Feuil1!N254,\".\")<=0,\"\",_xlfn.NUMBERVALUE(Feuil1!N254,\".\"))","v":""},null,"",{"$nulls":3},"",0]
[null,{"$f":"IF(_xlfn.NUMBERVALUE(Feuil1!N255,\".\")<=0,\"\",Feuil1!C255)","v":""},{"$f":"IF(_xlfn.NUMBERVALUE(Feuil1!N255,\".\")<=0,\"\",Feuil1!Q255)","v":""},{"$f":"IF(_xlfn.NUMBERVALUE(Feuil1!N255,\".\")<=0,\"\",_xlfn.NUMBERVALUE(Feuil1!N255,\".\"))","v":""},null,"",{"$nulls":3},"",0]
[null,{"$f":"IF(_xlfn.NUMBERVALUE(Feuil1!N256,\".\")<=0,\"\",Feuil1!C256)","v":""},{"$f":"IF(_xlfn.NUMBERVALUE(Feuil1!N256,\".\")<=0,\"\",Feuil1!Q256)","v":""},{"$f":"IF(_xlfn.NUMBERVALUE(Feuil1!N256,\".\")<=0,\"\",_xlfn.NUMBERVALUE(Feuil1!N256,\".\"))","v":""},null,"",{"$nulls":3},"",0]
[null,{"$f":"IF(_xlfn.NUMBERVALUE(Feuil1!N257,\".\")<=0,\"\",Feuil1!C257)","v":""},{"$f":"IF(_xlfn.NUMBERVALUE(Feuil1!N257,\".\")<=0,\"\",Feuil1!Q257)","v":""},{"$f":"IF(_xlfn.NUMBERVALUE(Feuil1!N257,\".\")<=0,\"\",_xlfn.NUMBERVALUE(Feuil1!N257,\".\"))","v":""},null,"",{"$nulls":3},"",0]
[null,{"$f":"IF(_xlfn.NUMBERVALUE(Feuil1!N258,\".\")<=0,\"\",Feuil1!C258)","v":""},{"$f":"IF(_xlfn.NUMBERVALUE(Feuil1!N258,\".\")<=0,\"\",Feuil1!Q258)","v":""},{"$f":"IF(_xlfn.NUMBERVALUE(Feuil1!N258,\".\")<=0,\"\",_xlfn.NUMBERVALUE(Feuil1!N258,\".\"))","v":""},null,"",{"$nulls":3},"",0]
[null,{"$f":"IF(_xlfn.NUMBERVALUE(Feuil1!N259,\".\")<=0,\"\",Feuil1!C259)","v":""},{"$f":"IF(_xlfn.NUMBERVALUE(Feuil1!N259,\".\")<=0,\"\",Feuil1!Q259)","v":""},{"$f":"IF(_xlfn.NUMBERVALUE(Feuil1!N259,\".\")<=0,\"\",_xlfn.NUMBERVALUE(Feuil1!N259,\".\"))","v":""},null,"",{"$nulls":3},"",0]
[null,{"$f":"IF(_xlfn.NUMBERVALUE(Feuil1!N260,\".\")<=0,\"\",Feuil1!C260)","v":""},{"$f":"IF(_xlfn.NUMBERVALUE(Feuil1!N260,\".\")<=0,\"\",Feuil1!Q260)","v":""},{"$f":"IF(_xlfn.NUMBERVALUE(Feuil1!N260,\".\")<=0,\"\",_xlfn.NUMBERVALUE(Feuil1!N260,\".\"))","v":""},null,"",{"$nulls":3},{"$f":"IF(D278<>\"\",IF(E278=\"\",\"Finding Nbr\",IF(F278=\"\",\"Add Nature\",IF(G278=\"\",\"Add Source\",\"Ok\"))),IF(F278<>\"\",\"remove Nature\",IF(G278<>\"\",\"remove Source\",\"\")))","v":""},{"$f":"IF(J278=\"Ok\",0,IF(J278=\"\",0,1))","v":0}]
[null,{"$f":"IF(_xlfn.NUMBERVALUE(Feuil1!N261,\".\")<=0,\"\",Feuil1!C261)","v":""},{"$f":"IF(_xlfn.NUMBERVALUE(Feuil1!N261,\".\")<=0,\"\",Feuil1!Q261)","v":""},{"$f":"IF(_xlfn.NUMBERVALUE(Feuil1!N261,\".\")<=0,\"\",_xlfn.NUMBERVALUE(Feuil1!N261,\".\"))","v":""},null,{"$f":"IF(G279=\"Mandatory Replacement\",\"Mandatory replacement\",IF(G279=\"SUP\",\"Incorrect / Suspected unapproved\",\"\"))","v":""},{"$nulls":3},"",0]
[null,{"$f":"IF(_xlfn.NUMBERVALUE(Feuil1!N262,\".\")<=0,\"\",Feuil1!C262)","v":""},{"$f":"IF(_xlfn.NUMBERVALUE(Feuil1!N262,\".\")<=0,\"\",Feuil1!Q262)","v":""},{"$f":"IF(_xlfn.NUMBERVALUE(Feuil1!N262,\".\")<=0,\"\",_xlfn.NUMBERVALUE(Feuil1!N262,\".\"))","v":""},null,"",{"$nulls":3},"",0]
[null,{"$f":"IF(_xlfn.NUMBERVALUE(Feuil1!N263,\".\")<=0,\"\",Feuil1!C263)","v":""},{"$f":"IF(_xlfn.NUMBERVALUE(Feuil1!N263,\".\")<=0,\"\",Feuil1!Q263)","v":""},{"$f":"IF(_xlfn.NUMBERVALUE(Feuil1!N263,\".\")<=0,\"\",_xlfn.NUMBERVALUE(Feuil1!N263,\".\"))","v":""},null,"",{"$nulls":3},"",0]
[null,{"$f":"IF(_xlfn.NUMBERVALUE(Feuil1!N264,\".\")<=0,\"\",Feuil1!C264)","v":""},{"$f":"IF(_xlfn.NUMBERVALUE(Feuil1!N264,\".\")<=0,\"\",Feuil1!Q264)","v":""},{"$f":"IF(_xlfn.NUMBERVALUE(Feuil1!N264,\".\")<=0,\"\",_xlfn.NUMBERVALUE(Feuil1!N264,\".\"))","v":""},null,"",{"$nulls":3},"",0]
[null,{"$f":"IF(_xlfn.NUMBERVALUE(Feuil1!N265,\".\")<=0,\"\",Feuil1!C265)","v":""},{"$f":"IF(_xlfn.NUMBERVALUE(Feuil1!N265,\".\")<=0,\"\",Feuil1!Q265)","v":""},{"$f":"IF(_xlfn.NUMBERVALUE(Feuil1!N265,\".\")<=0,\"\",_xlfn.NUMBERVALUE(Feuil1!N265,\".\"))","v":""},null,"",{"$nulls":3},"",0]
[null,{"$f":"IF(_xlfn.NUMBERVALUE(Feuil1!N266,\".\")<=0,\"\",Feuil1!C266)","v":""},{"$f":"IF(_xlfn.NUMBERVALUE(Feuil1!N266,\".\")<=0,\"\",Feuil1!Q266)","v":""},{"$f":"IF(_xlfn.NUMBERVALUE(Feuil1!N266,\".\")<=0,\"\",_xlfn.NUMBERVALUE(Feuil1!N266,\".\"))","v":""},null,"",{"$nulls":3},"",0]
[null,{"$f":"IF(_xlfn.NUMBERVALUE(Feuil1!N267,\".\")<=0,\"\",Feuil1!C267)","v":""},{"$f":"IF(_xlfn.NUMBERVALUE(Feuil1!N267,\".\")<=0,\"\",Feuil1!Q267)","v":""},{"$f":"IF(_xlfn.NUMBERVALUE(Feuil1!N267,\".\")<=0,\"\",_xlfn.NUMBERVALUE(Feuil1!N267,\".\"))","v":""},null,"",{"$nulls":3},"",0]
[null,{"$f":"IF(_xlfn.NUMBERVALUE(Feuil1!N268,\".\")<=0,\"\",Feuil1!C268)","v":""},{"$f":"IF(_xlfn.NUMBERVALUE(Feuil1!N268,\".\")<=0,\"\",Feuil1!Q268)","v":""},{"$f":"IF(_xlfn.NUMBERVALUE(Feuil1!N268,\".\")<=0,\"\",_xlfn.NUMBERVALUE(Feuil1!N268,\".\"))","v":""},null,"",{"$nulls":3},"",0]
[null,{"$f":"IF(_xlfn.NUMBERVALUE(Feuil1!N269,\".\")<=0,\"\",Feuil1!C269)","v":""},{"$f":"IF(_xlfn.NUMBERVALUE(Feuil1!N269,\".\")<=0,\"\",Feuil1!Q269)","v":""},{"$f":"IF(_xlfn.NUMBERVALUE(Feuil1!N269,\".\")<=0,\"\",_xlfn.NUMBERVALUE(Feuil1!N269,\".\"))","v":""},null,"",{"$nulls":3},"",0]
[null,{"$f":"IF(_xlfn.NUMBERVALUE(Feuil1!N270,\".\")<=0,\"\",Feuil1!C270)","v":""},{"$f":"IF(_xlfn.NUMBERVALUE(Feuil1!N270,\".\")<=0,\"\",Feuil1!Q270)","v":""},{"$f":"IF(_xlfn.NUMBERVALUE(Feuil1!N270,\".\")<=0,\"\",_xlfn.NUMBERVALUE(Feuil1!N270,\".\"))","v":""},null,"",{"$nulls":3},"",0]
[null,{"$f":"IF(_xlfn.NUMBERVALUE(Feuil1!N271,\".\")<=0,\"\",Feuil1!C271)","v":""},{"$f":"IF(_xlfn.NUMBERVALUE(Feuil1!N271,\".\")<=0,\"\",Feuil1!Q271)","v":""},{"$f":"IF(_xlfn.NUMBERVALUE(Feuil1!N271,\".\")<=0,\"\",_xlfn.NUMBERVALUE(Feuil1!N271,\".\"))","v":""},null,"",{"$nulls":3},"",0]
[null,{"$f":"IF(_xlfn.NUMBERVALUE(Feuil1!N272,\".\")<=0,\"\",Feuil1!C272)","v":""},{"$f":"IF(_xlfn.NUMBERVALUE(Feuil1!N272,\".\")<=0,\"\",Feuil1!Q272)","v":""},{"$f":"IF(_xlfn.NUMBERVALUE(Feuil1!N272,\".\")<=0,\"\",_xlfn.NUMBERVALUE(Feuil1!N272,\".\"))","v":""},null,"",{"$nulls":3},"",0]
[null,{"$f":"IF(_xlfn.NUMBERVALUE(Feuil1!N273,\".\")<=0,\"\",Feuil1!C273)","v":""},{"$f":"IF(_xlfn.NUMBERVALUE(Feuil1!N273,\".\")<=0,\"\",Feuil1!Q273)","v":""},{"$f":"IF(_xlfn.NUMBERVALUE(Feuil1!N273,\".\")<=0,\"\",_xlfn.NUMBERVALUE(Feuil1!N273,\".\"))","v":""},null,"",{"$nulls":3},"",0]
[null,{"$f":"IF(_xlfn.NUMBERVALUE(Feuil1!N274,\".\")<=0,\"\",Feuil1!C274)","v":""},{"$f":"IF(_xlfn.NUMBERVALUE(Feuil1!N274,\".\")<=0,\"\",Feuil1!Q274)","v":""},{"$f":"IF(_xlfn.NUMBERVALUE(Feuil1!N274,\".\")<=0,\"\",_xlfn.NUMBERVALUE(Feuil1!N274,\".\"))","v":""},null,"",{"$nulls":3},"",0]
[null,{"$f":"IF(_xlfn.NUMBERVALUE(Feuil1!N275,\".\")<=0,\"\",Feuil1!C275)","v":""},{"$f":"IF(_xlfn.NUMBERVALUE(Feuil1!N275,\".\")<=0,\"\",Feuil1!Q275)","v":""},{"$f":"IF(_xlfn.NUMBERVALUE(Feuil1!N275,\".\")<=0,\"\",_xlfn.NUMBERVALUE(Feuil1!N275,\".\"))","v":""},null,"",{"$nulls":3},"",0]
[null,{"$f":"IF(_xlfn.NUMBERVALUE(Feuil1!N276,\".\")<=0,\"\",Feuil1!C276)","v":""},{"$f":"IF(_xlfn.NUMBERVALUE(Feuil1!N276,\".\")<=0,\"\",Feuil1!Q276)","v":""},{"$f":"IF(_xlfn.NUMBERVALUE(Feuil1!N276,\".\")<=0,\"\",_xlfn.NUMBERVALUE(Feuil1!N276,\".\"))","v":""},null,"",{"$nulls":3},"",0]
[null,{"$f":"IF(_xlfn.NUMBERVALUE(Feuil1!N277,\".\")<=0,\"\",Feuil1!C277)","v":""},{"$f":"IF(_xlfn.NUMBERVALUE(Feuil1!N277,\".\")<=0,\"\",Feuil1!Q277)","v":""},{"$f":"IF(_xlfn.NUMBERVALUE(Feuil1!N277,\".\")<=0,\"\",_xlfn.NUMBERVALUE(Feuil1!N277,\".\"))","v":""},null,"",{"$nulls":3},"",0]
[null,{"$f":"IF(_xlfn.NUMBERVALUE(Feuil1!N278,\".\")<=0,\"\",Feuil1!C278)","v":""},{"$f":"IF(_xlfn.NUMBERVALUE(Feuil1!N278,\".\")<=0,\"\",Feuil1!Q278)","v":""},{"$f":"IF(_xlfn.NUMBERVALUE(Feuil1!N278,\".\")<=0,\"\",_xlfn.NUMBERVALUE(Feuil1!N278,\".\"))","v":""},null,"",{"$nulls":3},"",0]
[null,{"$f":"IF(_xlfn.NUMBERVALUE(Feuil1!N279,\".\")<=0,\"\",Feuil1!C279)","v":""},{"$f":"IF(_xlfn.NUMBERVALUE(Feuil1!N279,\".\")<=0,\"\",Feuil1!Q279)","v":""},{"$f":"IF(_xlfn.NUMBERVALUE(Feuil1!N279,\".\")<=0,\"\",_xlfn.NUMBERVALUE(Feuil1!N279,\".\"))","v":""},null,"",{"$nulls":3},"",0]
[null,{"$f":"IF(_xlfn.NUMBERVALUE(Feuil1!N280,\".\")<=0,\"\",Feuil1!C280)","v":""},{"$f":"IF(_xlfn.NUMBERVALUE(Feuil1!N280,\".\")<=0,\"\",Feuil1!Q280)","v":""},{"$f":"IF(_xlfn.NUMBERVALUE(Feuil1!N280,\".\")<=0,\"\",_xlfn.NUMBERVALUE(Feuil1!N280,\".\"))","v":""},null,"",{"$nulls":3},"",0]
[null,{"$f":"IF(_xlfn.NUMBERVALUE(Feuil1!N281,\".\")<=0,\"\",Feuil1!C281)","v":""},{"$f":"IF(_xlfn.NUMBERVALUE(Feuil1!N281,\".\")<=0,\"\",Feuil1!Q281)","v":""},{"$f":"IF(_xlfn.NUMBERVALUE(Feuil1!N281,\".\")<=0,\"\",_xlfn.NUMBERVALUE(Feuil1!N281,\".\"))","v":""},null,"",{"$nulls":3},"",0]
[null,{"$f":"IF(_xlfn.NUMBERVALUE(Feuil1!N282,\".\")<=0,\"\",Feuil1!C282)","v":""},{"$f":"IF(_xlfn.NUMBERVALUE(Feuil1!N282,\".\")<=0,\"\",Feuil1!Q282)","v":""},{"$f":"IF(_xlfn.NUMBERVALUE(Feuil1!N282,\".\")<=0,\"\",_xlfn.NUMBERVALUE(Feuil1!N282,\".\"))","v":""},null,"",{"$nulls":3},"",0]
[null,{"$f":"IF(_xlfn.NUMBERVALUE(Feuil1!N283,\".\")<=0,\"\",Feuil1!C283)","v":""},{"$f":"IF(_xlfn.NUMBERVALUE(Feuil1!N283,\".\")<=0,\"\",Feuil1!Q283)","v":""},{"$f":"IF(_xlfn.NUMBERVALUE(Feuil1!N283,\".\")<=0,\"\",_xlfn.NUMBERVALUE(Feuil1!N283,\".\"))","v":""},null,"",{"$nulls":3},"",0]
[null,{"$f":"IF(_xlfn.NUMBERVALUE(Feuil1!N284,\".\")<=0,\"\",Feuil1!C284)","v":""},{"$f":"IF(_xlfn.NUMBERVALUE(Feuil1!N284,\".\")<=0,\"\",Feuil1!Q284)","v":""},{"$f":"IF(_xlfn.NUMBERVALUE(Feuil1!N284,\".\")<=0,\"\",_xlfn.NUMBERVALUE(Feuil1!N284,\".\"))","v":""},null,"",{"$nulls":3},"",0]
[null,{"$f":"IF(_xlfn.NUMBERVALUE(Feuil1!N285,\".\")<=0,\"\",Feuil1!C285)","v":""},{"$f":"IF(_xlfn.NUMBERVALUE(Feuil1!N285,\".\")<=0,\"\",Feuil1!Q285)","v":""},{"$f":"IF(_xlfn.NUMBERVALUE(Feuil1!N285,\".\")<=0,\"\",_xlfn.NUMBERVALUE(Feuil1!N285,\".\"))","v":""},null,"",{"$nulls":3},"",0]
[null,{"$f":"IF(_xlfn.NUMBERVALUE(Feuil1!N286,\".\")<=0,\"\",Feuil1!C286)","v":""},{"$f":"IF(_xlfn.NUMBERVALUE(Feuil1!N286,\".\")<=0,\"\",Feuil1!Q286)","v":""},{"$f":"IF(_xlfn.NUMBERVALUE(Feuil1!N286,\".\")<=0,\"\",_xlfn.NUMBERVALUE(Feuil1!N286,\".\"))","v":""},null,"",{"$nulls":3},"",0]
[null,{"$f":"IF(_xlfn.NUMBERVALUE(Feuil1!N287,\".\")<=0,\"\",Feuil1!C287)","v":""},{"$f":"IF(_xlfn.NUMBERVALUE(Feuil1!N287,\".\")<=0,\"\",Feuil1!Q287)","v":""},{"$f":"IF(_xlfn.NUMBERVALUE(Feuil1!N287,\".\")<=0,\"\",_xlfn.NUMBERVALUE(Feuil1!N287,\".\"))","v":""},null,"",{"$nulls":3},"",0]
[null,{"$f":"IF(_xlfn.NUMBERVALUE(Feuil1!N288,\".\")<=0,\"\",Feuil1!C288)","v":""},{"$f":"IF(_xlfn.NUMBERVALUE(Feuil1!N288,\".\")<=0,\"\",Feuil1!Q288)","v":""},{"$f":"IF(_xlfn.NUMBERVALUE(Feuil1!N288,\".\")<=0,\"\",_xlfn.NUMBERVALUE(Feuil1!N288,\".\"))","v":""},null,"",{"$nulls":3},"",0]
[null,{"$f":"IF(_xlfn.NUMBERVALUE(Feuil1!N289,\".\")<=0,\"\",Feuil1!C289)","v":""},{"$f":"IF(_xlfn.NUMBERVALUE(Feuil1!N289,\".\")<=0,\"\",Feuil1!Q289)","v":""},{"$f":"IF(_xlfn.NUMBERVALUE(Feuil1!N289,\".\")<=0,\"\",_xlfn.NUMBERVALUE(Feuil1!N289,\".\"))","v":""},null,"",{"$nulls":3},"",0]
[null,{"$f":"IF(_xlfn.NUMBERVALUE(Feuil1!N290,\".\")<=0,\"\",Feuil1!C290)","v":""},{"$f":"IF(_xlfn.NUMBERVALUE(Feuil1!N290,\".\")<=0,\"\",Feuil1!Q290)","v":""},{"$f":"IF(_xlfn.NUMBERVALUE(Feuil1!N290,\".\")<=0,\"\",_xlfn.NUMBERVALUE(Feuil1!N290,\".\"))","v":""},null,"",{"$nulls":3},"",0]
[null,{"$f":"IF(_xlfn.NUMBERVALUE(Feuil1!N291,\".\")<=0,\"\",Feuil1!C291)","v":""},{"$f":"IF(_xlfn.NUMBERVALUE(Feuil1!N291,\".\")<=0,\"\",Feuil1!Q291)","v":""},{"$f":"IF(_xlfn.NUMBERVALUE(Feuil1!N291,\".\")<=0,\"\",_xlfn.NUMBERVALUE(Feuil1!N291,\".\"))","v":""},null,"",{"$nulls":3},"",0]
[null,{"$f":"IF(_xlfn.NUMBERVALUE(Feuil1!N292,\".\")<=0,\"\",Feuil1!C292)","v":""},{"$f":"IF(_xlfn.NUMBERVALUE(Feuil1!N292,\".\")<=0,\"\",Feuil1!Q292)","v":""},{"$f":"IF(_xlfn.NUMBERVALUE(Feuil1!N292,\".\")<=0,\"\",_xlfn.NUMBERVALUE(Feuil1!N292,\".\"))","v":""},null,"",{"$nulls":3},"",0]
[null,{"$f":"IF(_xlfn.NUMBERVALUE(Feuil1!N293,\".\")<=0,\"\",Feuil1!C293)","v":""},{"$f":"IF(_xlfn.NUMBERVALUE(Feuil1!N293,\".\")<=0,\"\",Feuil1!Q293)","v":""},{"$f":"IF(_xlfn.NUMBERVALUE(Feuil1!N293,\".\")<=0,\"\",_xlfn.NUMBERVALUE(Feuil1!N293,\".\"))","v":""},null,"",{"$nulls":3},"",0]
[null,{"$f":"IF(_xlfn.NUMBERVALUE(Feuil1!N294,\".\")<=0,\"\",Feuil1!C294)","v":""},{"$f":"IF(_xlfn.NUMBERVALUE(Feuil1!N294,\".\")<=0,\"\",Feuil1!Q294)","v":""},{"$f":"IF(_xlfn.NUMBERVALUE(Feuil1!N294,\".\")<=0,\"\",_xlfn.NUMBERVALUE(Feuil1!N294,\".\"))","v":""},null,"",{"$nulls":3},"",0]
[null,{"$f":"IF(_xlfn.NUMBERVALUE(Feuil1!N295,\".\")<=0,\"\",Feuil1!C295)","v":""},{"$f":"IF(_xlfn.NUMBERVALUE(Feuil1!N295,\".\")<=0,\"\",Feuil1!Q295)","v":""},{"$f":"IF(_xlfn.NUMBERVALUE(Feuil1!N295,\".\")<=0,\"\",_xlfn.NUMBERVALUE(Feuil1!N295,\".\"))","v":""},null,"",{"$nulls":3},"",0]
[null,{"$f":"IF(_xlfn.NUMBERVALUE(Feuil1!N296,\".\")<=0,\"\",Feuil1!C296)","v":""},{"$f":"IF(_xlfn.NUMBERVALUE(Feuil1!N296,\".\")<=0,\"\",Feuil1!Q296)","v":""},{"$f":"IF(_xlfn.NUMBERVALUE(Feuil1!N296,\".\")<=0,\"\",_xlfn.NUMBERVALUE(Feuil1!N296,\".\"))","v":""},null,"",{"$nulls":3},"",0]
[null,{"$f":"IF(_xlfn.NUMBERVALUE(Feuil1!N297,\".\")<=0,\"\",Feuil1!C297)","v":""},{"$f":"IF(_xlfn.NUMBERVALUE(Feuil1!N297,\".\")<=0,\"\",Feuil1!Q297)","v":""},{"$f":"IF(_xlfn.NUMBERVALUE(Feuil1!N297,\".\")<=0,\"\",_xlfn.NUMBERVALUE(Feuil1!N297,\".\"))","v":""},null,"",{"$nulls":3},"",0]
[null,{"$f":"IF(_xlfn.NUMBERVALUE(Feuil1!N298,\".\")<=0,\"\",Feuil1!C298)","v":""},{"$f":"IF(_xlfn.NUMBERVALUE(Feuil1!N298,\".\")<=0,\"\",Feuil1!Q298)","v":""},{"$f":"IF(_xlfn.NUMBERVALUE(Feuil1!N298,\".\")<=0,\"\",_xlfn.NUMBERVALUE(Feuil1!N298,\".\"))","v":""},null,"",{"$nulls":3},"",0]
[null,{"$f":"IF(_xlfn.NUMBERVALUE(Feuil1!N299,\".\")<=0,\"\",Feuil1!C299)","v":""},{"$f":"IF(_xlfn.NUMBERVALUE(Feuil1!N299,\".\")<=0,\"\",Feuil1!Q299)","v":""},{"$f":"IF(_xlfn.NUMBERVALUE(Feuil1!N299,\".\")<=0,\"\",_xlfn.NUMBERVALUE(Feuil1!N299,\".\"))","v":""},null,"",{"$nulls":3},"",0]
[null,{"$f":"IF(_xlfn.NUMBERVALUE(Feuil1!N300,\".\")<=0,\"\",Feuil1!C300)","v":""},{"$f":"IF(_xlfn.NUMBERVALUE(Feuil1!N300,\".\")<=0,\"\",Feuil1!Q300)","v":""},{"$f":"IF(_xlfn.NUMBERVALUE(Feuil1!N300,\".\")<=0,\"\",_xlfn.NUMBERVALUE(Feuil1!N300,\".\"))","v":""},null,"",{"$nulls":3},"",0]
[null,{"$f":"IF(_xlfn.NUMBERVALUE(Feuil1!N301,\".\")<=0,\"\",Feuil1!C301)","v":""},{"$f":"IF(_xlfn.NUMBERVALUE(Feuil1!N301,\".\")<=0,\"\",Feuil1!Q301)","v":""},{"$f":"IF(_xlfn.NUMBERVALUE(Feuil1!N301,\".\")<=0,\"\",_xlfn.NUMBERVALUE(Feuil1!N301,\".\"))","v":""},null,"",{"$nulls":3},"",0]
[null,{"$f":"IF(_xlfn.NUMBERVALUE(Feuil1!N302,\".\")<=0,\"\",Feuil1!C302)","v":""},{"$f":"IF(_xlfn.NUMBERVALUE(Feuil1!N302,\".\")<=0,\"\",Feuil1!Q302)","v":""},{"$f":"IF(_xlfn.NUMBERVALUE(Feuil1!N302,\".\")<=0,\"\",_xlfn.NUMBERVALUE(Feuil1!N302,\".\"))","v":""},null,"",{"$nulls":3},"",0]
[null,{"$f":"IF(_xlfn.NUMBERVALUE(Feuil1!N303,\".\")<=0,\"\",Feuil1!C303)","v":""},{"$f":"IF(_xlfn.NUMBERVALUE(Feuil1!N303,\".\")<=0,\"\",Feuil1!Q303)","v":""},{"$f":"IF(_xlfn.NUMBERVALUE(Feuil1!N303,\".\")<=0,\"\",_xlfn.NUMBERVALUE(Feuil1!N303,\".\"))","v":""},null,"",{"$nulls":3},"",0]
[null,{"$f":"IF(_xlfn.NUMBERVALUE(Feuil1!N304,\".\")<=0,\"\",Feuil1!C304)","v":""},{"$f":"IF(_xlfn.NUMBERVALUE(Feuil1!N304,\".\")<=0,\"\",Feuil1!Q304)","v":""},{"$f":"IF(_xlfn.NUMBERVALUE(Feuil1!N304,\".\")<=0,\"\",_xlfn.NUMBERVALUE(Feuil1!N304,\".\"))","v":""},null,"",{"$nulls":3},"",0]
[null,{"$f":"IF(_xlfn.NUMBERVALUE(Feuil1!N305,\".\")<=0,\"\",Feuil1!C305)","v":""},{"$f":"IF(_xlfn.NUMBERVALUE(Feuil1!N305,\".\")<=0,\"\",Feuil1!Q305)","v":""},{"$f":"IF(_xlfn.NUMBERVALUE(Feuil1!N305,\".\")<=0,\"\",_xlfn.NUMBERVALUE(Feuil1!N305,\".\"))","v":""},null,"",{"$nulls":3},"",0]
[null,{"$f":"IF(_xlfn.NUMBERVALUE(Feuil1!N306,\".\")<=0,\"\",Feuil1!C306)","v":""},{"$f":"IF(_xlfn.NUMBERVALUE(Feuil1!N306,\".\")<=0,\"\",Feuil1!Q306)","v":""},{"$f":"IF(_xlfn.NUMBERVALUE(Feuil1!N306,\".\")<=0,\"\",_xlfn.NUMBERVALUE(Feuil1!N306,\".\"))","v":""},null,"",{"$nulls":3},"",0]
[null,{"$f":"IF(_xlfn.NUMBERVALUE(Feuil1!N307,\".\")<=0,\"\",Feuil1!C307)","v":""},{"$f":"IF(_xlfn.NUMBERVALUE(Feuil1!N307,\".\")<=0,\"\",Feuil1!Q307)","v":""},{"$f":"IF(_xlfn.NUMBERVALUE(Feuil1!N307,\".\")<=0,\"\",_xlfn.NUMBERVALUE(Feuil1!N307,\".\"))","v":""},null,"",{"$nulls":3},"",0]
[null,{"$f":"IF(_xlfn.NUMBERVALUE(Feuil1!N308,\".\")<=0,\"\",Feuil1!C308)","v":""},{"$f":"IF(_xlfn.NUMBERVALUE(Feuil1!N308,\".\")<=0,\"\",Feuil1!Q308)","v":""},{"$f":"IF(_xlfn.NUMBERVALUE(Feuil1!N308,\".\")<=0,\"\",_xlfn.NUMBERVALUE(Feuil1!N308,\".\"))","v":""},null,"",{"$nulls":3},"",0]
[null,{"$f":"IF(_xlfn.NUMBERVALUE(Feuil1!N309,\".\")<=0,\"\",Feuil1!C309)","v":""},{"$f":"IF(_xlfn.NUMBERVALUE(Feuil1!N309,\".\")<=0,\"\",Feuil1!Q309)","v":""},{"$f":"IF(_xlfn.NUMBERVALUE(Feuil1!N309,\".\")<=0,\"\",_xlfn.NUMBERVALUE(Feuil1!N309,\".\"))","v":""},null,"",{"$nulls":3},"",0]
[null,{"$f":"IF(_xlfn.NUMBERVALUE(Feuil1!N310,\".\")<=0,\"\",Feuil1!C310)","v":""},{"$f":"IF(_xlfn.NUMBERVALUE(Feuil1!N310,\".\")<=0,\"\",Feuil1!Q310)","v":""},{"$f":"IF(_xlfn.NUMBERVALUE(Feuil1!N310,\".\")<=0,\"\",_xlfn.NUMBERVALUE(Feuil1!N310,\".\"))","v":""},null,"",{"$nulls":3},"",0]
[null,{"$f":"IF(_xlfn.NUMBERVALUE(Feuil1!N311,\".\")<=0,\"\",Feuil1!C311)","v":""},{"$f":"IF(_xlfn.NUMBERVALUE(Feuil1!N311,\".\")<=0,\"\",Feuil1!Q311)","v":""},{"$f":"IF(_xlfn.NUMBERVALUE(Feuil1!N311,\".\")<=0,\"\",_xlfn.NUMBERVALUE(Feuil1!N311,\".\"))","v":""},null,"",{"$nulls":3},"",0]
[null,{"$f":"IF(_xlfn.NUMBERVALUE(Feuil1!N312,\".\")<=0,\"\",Feuil1!C312)","v":""},{"$f":"IF(_xlfn.NUMBERVALUE(Feuil1!N312,\".\")<=0,\"\",Feuil1!Q312)","v":""},{"$f":"IF(_xlfn.NUMBERVALUE(Feuil1!N312,\".\")<=0,\"\",_xlfn.NUMBERVALUE(Feuil1!N312,\".\"))","v":""},null,"",{"$nulls":3},"",0]
[null,{"$f":"IF(_xlfn.NUMBERVALUE(Feuil1!N313,\".\")<=0,\"\",Feuil1!C313)","v":""},{"$f":"IF(_xlfn.NUMBERVALUE(Feuil1!N313,\".\")<=0,\"\",Feuil1!Q313)","v":""},{"$f":"IF(_xlfn.NUMBERVALUE(Feuil1!N313,\".\")<=0,\"\",_xlfn.NUMBERVALUE(Feuil1!N313,\".\"))","v":""},null,"",{"$nulls":3},"",0]
[null,{"$f":"IF(_xlfn.NUMBERVALUE(Feuil1!N314,\".\")<=0,\"\",Feuil1!C314)","v":""},{"$f":"IF(_xlfn.NUMBERVALUE(Feuil1!N314,\".\")<=0,\"\",Feuil1!Q314)","v":""},{"$f":"IF(_xlfn.NUMBERVALUE(Feuil1!N314,\".\")<=0,\"\",_xlfn.NUMBERVALUE(Feuil1!N314,\".\"))","v":""},null,"",{"$nulls":3},"",0]
[null,{"$f":"IF(_xlfn.NUMBERVALUE(Feuil1!N315,\".\")<=0,\"\",Feuil1!C315)","v":""},{"$f":"IF(_xlfn.NUMBERVALUE(Feuil1!N315,\".\")<=0,\"\",Feuil1!Q315)","v":""},{"$f":"IF(_xlfn.NUMBERVALUE(Feuil1!N315,\".\")<=0,\"\",_xlfn.NUMBERVALUE(Feuil1!N315,\".\"))","v":""},null,"",{"$nulls":3},"",0]
[null,{"$f":"IF(_xlfn.NUMBERVALUE(Feuil1!N316,\".\")<=0,\"\",Feuil1!C316)","v":""},{"$f":"IF(_xlfn.NUMBERVALUE(Feuil1!N316,\".\")<=0,\"\",Feuil1!Q316)","v":""},{"$f":"IF(_xlfn.NUMBERVALUE(Feuil1!N316,\".\")<=0,\"\",_xlfn.NUMBERVALUE(Feuil1!N316,\".\"))","v":""},null,"",{"$nulls":3},"",0]
[null,{"$f":"IF(_xlfn.NUMBERVALUE(Feuil1!N317,\".\")<=0,\"\",Feuil1!C317)","v":""},{"$f":"IF(_xlfn.NUMBERVALUE(Feuil1!N317,\".\")<=0,\"\",Feuil1!Q317)","v":""},{"$f":"IF(_xlfn.NUMBERVALUE(Feuil1!N317,\".\")<=0,\"\",_xlfn.NUMBERVALUE(Feuil1!N317,\".\"))","v":""},null,"",{"$nulls":3},"",0]
[null,{"$f":"IF(_xlfn.NUMBERVALUE(Feuil1!N318,\".\")<=0,\"\",Feuil1!C318)","v":""},{"$f":"IF(_xlfn.NUMBERVALUE(Feuil1!N318,\".\")<=0,\"\",Feuil1!Q318)","v":""},{"$f":"IF(_xlfn.NUMBERVALUE(Feuil1!N318,\".\")<=0,\"\",_xlfn.NUMBERVALUE(Feuil1!N318,\".\"))","v":""},null,"",{"$nulls":3},"",0]
[null,{"$f":"IF(_xlfn.NUMBERVALUE(Feuil1!N319,\".\")<=0,\"\",Feuil1!C319)","v":""},{"$f":"IF(_xlfn.NUMBERVALUE(Feuil1!N319,\".\")<=0,\"\",Feuil1!Q319)","v":""},{"$f":"IF(_xlfn.NUMBERVALUE(Feuil1!N319,\".\")<=0,\"\",_xlfn.NUMBERVALUE(Feuil1!N319,\".\"))","v":""},null,"",{"$nulls":3},"",0]
[null,{"$f":"IF(_xlfn.NUMBERVALUE(Feuil1!N320,\".\")<=0,\"\",Feuil1!C320)","v":""},{"$f":"IF(_xlfn.NUMBERVALUE(Feuil1!N320,\".\")<=0,\"\",Feuil1!Q320)","v":""},{"$f":"IF(_xlfn.NUMBERVALUE(Feuil1!N320,\".\")<=0,\"\",_xlfn.NUMBERVALUE(Feuil1!N320,\".\"))","v":""},null,"",{"$nulls":3},"",0]
[null,{"$f":"IF(_xlfn.NUMBERVALUE(Feuil1!N321,\".\")<=0,\"\",Feuil1!C321)","v":""},{"$f":"IF(_xlfn.NUMBERVALUE(Feuil1!N321,\".\")<=0,\"\",Feuil1!Q321)","v":""},{"$f":"IF(_xlfn.NUMBERVALUE(Feuil1!N321,\".\")<=0,\"\",_xlfn.NUMBERVALUE(Feuil1!N321,\".\"))","v":""},null,"",{"$nulls":3},"",0]
[null,{"$f":"IF(_xlfn.NUMBERVALUE(Feuil1!N322,\".\")<=0,\"\",Feuil1!C322)","v":""},{"$f":"IF(_xlfn.NUMBERVALUE(Feuil1!N322,\".\")<=0,\"\",Feuil1!Q322)","v":""},{"$f":"IF(_xlfn.NUMBERVALUE(Feuil1!N322,\".\")<=0,\"\",_xlfn.NUMBERVALUE(Feuil1!N322,\".\"))","v":""},null,"",{"$nulls":3},"",0]
[null,{"$f":"IF(_xlfn.NUMBERVALUE(Feuil1!N323,\".\")<=0,\"\",Feuil1!C323)","v":""},{"$f":"IF(_xlfn.NUMBERVALUE(Feuil1!N323,\".\")<=0,\"\",Feuil1!Q323)","v":""},{"$f":"IF(_xlfn.NUMBERVALUE(Feuil1!N323,\".\")<=0,\"\",_xlfn.NUMBERVALUE(Feuil1!N323,\".\"))","v":""},null,"",{"$nulls":3},"",0]
[null,{"$f":"IF(_xlfn.NUMBERVALUE(Feuil1!N324,\".\")<=0,\"\",Feuil1!C324)","v":""},{"$f":"IF(_xlfn.NUMBERVALUE(Feuil1!N324,\".\")<=0,\"\",Feuil1!Q324)","v":""},{"$f":"IF(_xlfn.NUMBERVALUE(Feuil1!N324,\".\")<=0,\"\",_xlfn.NUMBERVALUE(Feuil1!N324,\".\"))","v":""},null,"",{"$nulls":3},{"$f":"IF(D342<>\"\",IF(E342=\"\",\"Finding Nbr\",IF(F342=\"\",\"Add Nature\",IF(G342=\"\",\"Add Source\",\"Ok\"))),IF(F342<>\"\",\"remove Nature\",IF(G342<>\"\",\"remove Source\",\"\")))","v":""},{"$f":"IF(J342=\"Ok\",0,IF(J342=\"\",0,1))","v":0}]
[null,{"$f":"IF(_xlfn.NUMBERVALUE(Feuil1!N325,\".\")<=0,\"\",Feuil1!C325)","v":""},{"$f":"IF(_xlfn.NUMBERVALUE(Feuil1!N325,\".\")<=0,\"\",Feuil1!Q325)","v":""},{"$f":"IF(_xlfn.NUMBERVALUE(Feuil1!N325,\".\")<=0,\"\",_xlfn.NUMBERVALUE(Feuil1!N325,\".\"))","v":""},null,{"$f":"IF(G343=\"Mandatory Replacement\",\"Mandatory replacement\",IF(G343=\"SUP\",\"Incorrect / Suspected unapproved\",\"\"))","v":""},{"$nulls":3},"",0]
[null,{"$f":"IF(_xlfn.NUMBERVALUE(Feuil1!N326,\".\")<=0,\"\",Feuil1!C326)","v":""},{"$f":"IF(_xlfn.NUMBERVALUE(Feuil1!N326,\".\")<=0,\"\",Feuil1!Q326)","v":""},{"$f":"IF(_xlfn.NUMBERVALUE(Feuil1!N326,\".\")<=0,\"\",_xlfn.NUMBERVALUE(Feuil1!N326,\".\"))","v":""},null,"",{"$nulls":3},"",0]
[null,{"$f":"IF(_xlfn.NUMBERVALUE(Feuil1!N327,\".\")<=0,\"\",Feuil1!C327)","v":""},{"$f":"IF(_xlfn.NUMBERVALUE(Feuil1!N327,\".\")<=0,\"\",Feuil1!Q327)","v":""},{"$f":"IF(_xlfn.NUMBERVALUE(Feuil1!N327,\".\")<=0,\"\",_xlfn.NUMBERVALUE(Feuil1!N327,\".\"))","v":""},null,"",{"$nulls":3},"",0]
[null,{"$f":"IF(_xlfn.NUMBERVALUE(Feuil1!N328,\".\")<=0,\"\",Feuil1!C328)","v":""},{"$f":"IF(_xlfn.NUMBERVALUE(Feuil1!N328,\".\")<=0,\"\",Feuil1!Q328)","v":""},{"$f":"IF(_xlfn.NUMBERVALUE(Feuil1!N328,\".\")<=0,\"\",_xlfn.NUMBERVALUE(Feuil1!N328,\".\"))","v":""},null,"",{"$nulls":3},"",0]
[null,{"$f":"IF(_xlfn.NUMBERVALUE(Feuil1!N329,\".\")<=0,\"\",Feuil1!C329)","v":""},{"$f":"IF(_xlfn.NUMBERVALUE(Feuil1!N329,\".\")<=0,\"\",Feuil1!Q329)","v":""},{"$f":"IF(_xlfn.NUMBERVALUE(Feuil1!N329,\".\")<=0,\"\",_xlfn.NUMBERVALUE(Feuil1!N329,\".\"))","v":""},null,"",{"$nulls":3},"",0]
[null,{"$f":"IF(_xlfn.NUMBERVALUE(Feuil1!N330,\".\")<=0,\"\",Feuil1!C330)","v":""},{"$f":"IF(_xlfn.NUMBERVALUE(Feuil1!N330,\".\")<=0,\"\",Feuil1!Q330)","v":""},{"$f":"IF(_xlfn.NUMBERVALUE(Feuil1!N330,\".\")<=0,\"\",_xlfn.NUMBERVALUE(Feuil1!N330,\".\"))","v":""},null,"",{"$nulls":3},"",0]
[null,{"$f":"IF(_xlfn.NUMBERVALUE(Feuil1!N331,\".\")<=0,\"\",Feuil1!C331)","v":""},{"$f":"IF(_xlfn.NUMBERVALUE(Feuil1!N331,\".\")<=0,\"\",Feuil1!Q331)","v":""},{"$f":"IF(_xlfn.NUMBERVALUE(Feuil1!N331,\".\")<=0,\"\",_xlfn.NUMBERVALUE(Feuil1!N331,\".\"))","v":""},null,"",{"$nulls":3},"",0]
[null,{"$f":"IF(_xlfn.NUMBERVALUE(Feuil1!N332,\".\")<=0,\"\",Feuil1!C332)","v":""},{"$f":"IF(_xlfn.NUMBERVALUE(Feuil1!N332,\".\")<=0,\"\",Feuil1!Q332)","v":""},{"$f":"IF(_xlfn.NUMBERVALUE(Feuil1!N332,\".\")<=0,\"\",_xlfn.NUMBERVALUE(Feuil1!N332,\".\"))","v":""},null,"",{"$nulls":3},"",0]
[null,{"$f":"IF(_xlfn.NUMBERVALUE(Feuil1!N333,\".\")<=0,\"\",Feuil1!C333)","v":""},{"$f":"IF(_xlfn.NUMBERVALUE(Feuil1!N333,\".\")<=0,\"\",Feuil1!Q333)","v":""},{"$f":"IF(_xlfn.NUMBERVALUE(Feuil1!N333,\".\")<=0,\"\",_xlfn.NUMBERVALUE(Feuil1!N333,\".\"))","v":""},null,"",{"$nulls":3},"",0]
[null,{"$f":"IF(_xlfn.NUMBERVALUE(Feuil1!N334,\".\")<=0,\"\",Feuil1!C334)","v":""},{"$f":"IF(_xlfn.NUMBERVALUE(Feuil1!N334,\".\")<=0,\"\",Feuil1!Q334)","v":""},{"$f":"IF(_xlfn.NUMBERVALUE(Feuil1!N334,\".\")<=0,\"\",_xlfn.NUMBERVALUE(Feuil1!N334,\".\"))","v":""},null,"",{"$nulls":3},"",0]
[null,{"$f":"IF(_xlfn.NUMBERVALUE(Feuil1!N335,\".\")<=0,\"\",Feuil1!C335)","v":""},{"$f":"IF(_xlfn.NUMBERVALUE(Feuil1!N335,\".\")<=0,\"\",Feuil1!Q335)","v":""},{"$f":"IF(_xlfn.NUMBERVALUE(Feuil1!N335,\".\")<=0,\"\",_xlfn.NUMBERVALUE(Feuil1!N335,\".\"))","v":""},null,"",{"$nulls":3},"",0]
[null,{"$f":"IF(_xlfn.NUMBERVALUE(Feuil1!N336,\".\")<=0,\"\",Feuil1!C336)","v":""},{"$f":"IF(_xlfn.NUMBERVALUE(Feuil1!N336,\".\")<=0,\"\",Feuil1!Q336)","v":""},{"$f":"IF(_xlfn.NUMBERVALUE(Feuil1!N336,\".\")<=0,\"\",_xlfn.NUMBERVALUE(Feuil1!N336,\".\"))","v":""},null,"",{"$nulls":3},"",0]
[null,{"$f":"IF(_xlfn.NUMBERVALUE(Feuil1!N337,\".\")<=0,\"\",Feuil1!C337)","v":""},{"$f":"IF(_xlfn.NUMBERVALUE(Feuil1!N337,\".\")<=0,\"\",Feuil1!Q337)","v":""},{"$f":"IF(_xlfn.NUMBERVALUE(Feuil1!N337,\".\")<=0,\"\",_xlfn.NUMBERVALUE(Feuil1!N337,\".\"))","v":""},null,"",{"$nulls":3},"",0]
[null,{"$f":"IF(_xlfn.NUMBERVALUE(Feuil1!N338,\".\")<=0,\"\",Feuil1!C338)","v":""},{"$f":"IF(_xlfn.NUMBERVALUE(Feuil1!N338,\".\")<=0,\"\",Feuil1!Q338)","v":""},{"$f":"IF(_xlfn.NUMBERVALUE(Feuil1!N338,\".\")<=0,\"\",_xlfn.NUMBERVALUE(Feuil1!N338,\".\"))","v":""},null,"",{"$nulls":3},"",0]
[null,{"$f":"IF(_xlfn.NUMBERVALUE(Feuil1!N339,\".\")<=0,\"\",Feuil1!C339)","v":""},{"$f":"IF(_xlfn.NUMBERVALUE(Feuil1!N339,\".\")<=0,\"\",Feuil1!Q339)","v":""},{"$f":"IF(_xlfn.NUMBERVALUE(Feuil1!N339,\".\")<=0,\"\",_xlfn.NUMBERVALUE(Feuil1!N339,\".\"))","v":""},null,"",{"$nulls":3},"",0]
[null,{"$f":"IF(_xlfn.NUMBERVALUE(Feuil1!N340,\".\")<=0,\"\",Feuil1!C340)","v":""},{"$f":"IF(_xlfn.NUMBERVALUE(Feuil1!N340,\".\")<=0,\"\",Feuil1!Q340)","v":""},{"$f":"IF(_xlfn.NUMBERVALUE(Feuil1!N340,\".\")<=0,\"\",_xlfn.NUMBERVALUE(Feuil1!N340,\".\"))","v":""},null,"",{"$nulls":3},"",0]
[null,{"$f":"IF(_xlfn.NUMBERVALUE(Feuil1!N341,\".\")<=0,\"\",Feuil1!C341)","v":""},{"$f":"IF(_xlfn.NUMBERVALUE(Feuil1!N341,\".\")<=0,\"\",Feuil1!Q341)","v":""},{"$f":"IF(_xlfn.NUMBERVALUE(Feuil1!N341,\".\")<=0,\"\",_xlfn.NUMBERVALUE(Feuil1!N341,\".\"))","v":""},null,"",{"$nulls":3},"",0]
[null,{"$f":"IF(_xlfn.NUMBERVALUE(Feuil1!N342,\".\")<=0,\"\",Feuil1!C342)","v":""},{"$f":"IF(_xlfn.NUMBERVALUE(Feuil1!N342,\".\")<=0,\"\",Feuil1!Q342)","v":""},{"$f":"IF(_xlfn.NUMBERVALUE(Feuil1!N342,\".\")<=0,\"\",_xlfn.NUMBERVALUE(Feuil1!N342,\".\"))","v":""},null,"",{"$nulls":3},"",0]
[null,{"$f":"IF(_xlfn.NUMBERVALUE(Feuil1!N343,\".\")<=0,\"\",Feuil1!C343)","v":""},{"$f":"IF(_xlfn.NUMBERVALUE(Feuil1!N343,\".\")<=0,\"\",Feuil1!Q343)","v":""},{"$f":"IF(_xlfn.NUMBERVALUE(Feuil1!N343,\".\")<=0,\"\",_xlfn.NUMBERVALUE(Feuil1!N343,\".\"))","v":""},null,"",{"$nulls":3},"",0]
[null,{"$f":"IF(_xlfn.NUMBERVALUE(Feuil1!N344,\".\")<=0,\"\",Feuil1!C344)","v":""},{"$f":"IF(_xlfn.NUMBERVALUE(Feuil1!N344,\".\")<=0,\"\",Feuil1!Q344)","v":""},{"$f":"IF(_xlfn.NUMBERVALUE(Feuil1!N344,\".\")<=0,\"\",_xlfn.NUMBERVALUE(Feuil1!N344,\".\"))","v":""},null,"",{"$nulls":3},"",0]
[null,{"$f":"IF(_xlfn.NUMBERVALUE(Feuil1!N345,\".\")<=0,\"\",Feuil1!C345)","v":""},{"$f":"IF(_xlfn.NUMBERVALUE(Feuil1!N345,\".\")<=0,\"\",Feuil1!Q345)","v":""},{"$f":"IF(_xlfn.NUMBERVALUE(Feuil1!N345,\".\")<=0,\"\",_xlfn.NUMBERVALUE(Feuil1!N345,\".\"))","v":""},null,"",{"$nulls":3},"",0]
[null,{"$f":"IF(_xlfn.NUMBERVALUE(Feuil1!N346,\".\")<=0,\"\",Feuil1!C346)","v":""},{"$f":"IF(_xlfn.NUMBERVALUE(Feuil1!N346,\".\")<=0,\"\",Feuil1!Q346)","v":""},{"$f":"IF(_xlfn.NUMBERVALUE(Feuil1!N346,\".\")<=0,\"\",_xlfn.NUMBERVALUE(Feuil1!N346,\".\"))","v":""},null,"",{"$nulls":3},"",0]
[null,{"$f":"IF(_xlfn.NUMBERVALUE(Feuil1!N347,\".\")<=0,\"\",Feuil1!C347)","v":""},{"$f":"IF(_xlfn.NUMBERVALUE(Feuil1!N347,\".\")<=0,\"\",Feuil1!Q347)","v":""},{"$f":"IF(_xlfn.NUMBERVALUE(Feuil1!N347,\".\")<=0,\"\",_xlfn.NUMBERVALUE(Feuil1!N347,\".\"))","v":""},null,"",{"$nulls":3},"",0]
[null,{"$f":"IF(_xlfn.NUMBERVALUE(Feuil1!N348,\".\")<=0,\"\",Feuil1!C348)","v":""},{"$f":"IF(_xlfn.NUMBERVALUE(Feuil1!N348,\".\")<=0,\"\",Feuil1!Q348)","v":""},{"$f":"IF(_xlfn.NUMBERVALUE(Feuil1!N348,\".\")<=0,\"\",_xlfn.NUMBERVALUE(Feuil1!N348,\".\"))","v":""},null,"",{"$nulls":3},"",0]
[null,{"$f":"IF(_xlfn.NUMBERVALUE(Feuil1!N349,\".\")<=0,\"\",Feuil1!C349)","v":""},{"$f":"IF(_xlfn.NUMBERVALUE(Feuil1!N349,\".\")<=0,\"\",Feuil1!Q349)","v":""},{"$f":"IF(_xlfn.NUMBERVALUE(Feuil1!N349,\".\")<=0,\"\",_xlfn.NUMBERVALUE(Feuil1!N349,\".\"))","v":""},null,"",{"$nulls":3},"",0]
[null,{"$f":"IF(_xlfn.NUMBERVALUE(Feuil1!N350,\".\")<=0,\"\",Feuil1!C350)","v":""},{"$f":"IF(_xlfn.NUMBERVALUE(Feuil1!N350,\".\")<=0,\"\",Feuil1!Q350)","v":""},{"$f":"IF(_xlfn.NUMBERVALUE(Feuil1!N350,\".\")<=0,\"\",_xlfn.NUMBERVALUE(Feuil1!N350,\".\"))","v":""},null,"",{"$nulls":3},"",0]
[null,{"$f":"IF(_xlfn.NUMBERVALUE(Feuil1!N351,\".\")<=0,\"\",Feuil1!C351)","v":""},{"$f":"IF(_xlfn.NUMBERVALUE(Feuil1!N351,\".\")<=0,\"\",Feuil1!Q351)","v":""},{"$f":"IF(_xlfn.NUMBERVALUE(Feuil1!N351,\".\")<=0,\"\",_xlfn.NUMBERVALUE(Feuil1!N351,\".\"))","v":""},null,"",{"$nulls":3},"",0]
[null,{"$f":"IF(_xlfn.NUMBERVALUE(Feuil1!N352,\".\")<=0,\"\",Feuil1!C352)","v":""},{"$f":"IF(_xlfn.NUMBERVALUE(Feuil1!N352,\".\")<=0,\"\",Feuil1!Q352)","v":""},{"$f":"IF(_xlfn.NUMBERVALUE(Feuil1!N352,\".\")<=0,\"\",_xlfn.NUMBERVALUE(Feuil1!N352,\".\"))","v":""},null,"",{"$nulls":3},"",0]
[null,{"$f":"IF(_xlfn.NUMBERVALUE(Feuil1!N353,\".\")<=0,\"\",Feuil1!C353)","v":""},{"$f":"IF(_xlfn.NUMBERVALUE(Feuil1!N353,\".\")<=0,\"\",Feuil1!Q353)","v":""},{"$f":"IF(_xlfn.NUMBERVALUE(Feuil1!N353,\".\")<=0,\"\",_xlfn.NUMBERVALUE(Feuil1!N353,\".\"))","v":""},null,"",{"$nulls":3},"",0]
[null,{"$f":"IF(_xlfn.NUMBERVALUE(Feuil1!N354,\".\")<=0,\"\",Feuil1!C354)","v":""},{"$f":"IF(_xlfn.NUMBERVALUE(Feuil1!N354,\".\")<=0,\"\",Feuil1!Q354)","v":""},{"$f":"IF(_xlfn.NUMBERVALUE(Feuil1!N354,\".\")<=0,\"\",_xlfn.NUMBERVALUE(Feuil1!N354,\".\"))","v":""},null,"",{"$nulls":3},"",0]
[null,{"$f":"IF(_xlfn.NUMBERVALUE(Feuil1!N355,\".\")<=0,\"\",Feuil1!C355)","v":""},{"$f":"IF(_xlfn.NUMBERVALUE(Feuil1!N355,\".\")<=0,\"\",Feuil1!Q355)","v":""},{"$f":"IF(_xlfn.NUMBERVALUE(Feuil1!N355,\".\")<=0,\"\",_xlfn.NUMBERVALUE(Feuil1!N355,\".\"))","v":""},null,"",{"$nulls":3},"",0]
[null,{"$f":"IF(_xlfn.NUMBERVALUE(Feuil1!N356,\".\")<=0,\"\",Feuil1!C356)","v":""},{"$f":"IF(_xlfn.NUMBERVALUE(Feuil1!N356,\".\")<=0,\"\",Feuil1!Q356)","v":""},{"$f":"IF(_xlfn.NUMBERVALUE(Feuil1!N356,\".\")<=0,\"\",_xlfn.NUMBERVALUE(Feuil1!N356,\".\"))","v":""},null,"",{"$nulls":3},"",0]
[null,{"$f":"IF(_xlfn.NUMBERVALUE(Feuil1!N357,\".\")<=0,\"\",Feuil1!C357)","v":""},{"$f":"IF(_xlfn.NUMBERVALUE(Feuil1!N357,\".\")<=0,\"\",Feuil1!Q357)","v":""},{"$f":"IF(_xlfn.NUMBERVALUE(Feuil1!N357,\".\")<=0,\"\",_xlfn.NUMBERVALUE(Feuil1!N357,\".\"))","v":""},null,"",{"$nulls":3},"",0]
[null,{"$f":"IF(_xlfn.NUMBERVALUE(Feuil1!N358,\".\")<=0,\"\",Feuil1!C358)","v":""},{"$f":"IF(_xlfn.NUMBERVALUE(Feuil1!N358,\".\")<=0,\"\",Feuil1!Q358)","v":""},{"$f":"IF(_xlfn.NUMBERVALUE(Feuil1!N358,\".\")<=0,\"\",_xlfn.NUMBERVALUE(Feuil1!N358,\".\"))","v":""},null,"",{"$nulls":3},"",0]
[null,{"$f":"IF(_xlfn.NUMBERVALUE(Feuil1!N359,\".\")<=0,\"\",Feuil1!C359)","v":""},{"$f":"IF(_xlfn.NUMBERVALUE(Feuil1!N359,\".\")<=0,\"\",Feuil1!Q359)","v":""},{"$f":"IF(_xlfn.NUMBERVALUE(Feuil1!N359,\".\")<=0,\"\",_xlfn.NUMBERVALUE(Feuil1!N359,\".\"))","v":""},null,"",{"$nulls":3},"",0]
[null,{"$f":"IF(_xlfn.NUMBERVALUE(Feuil1!N360,\".\")<=0,\"\",Feuil1!C360)","v":""},{"$f":"IF(_xlfn.NUMBERVALUE(Feuil1!N360,\".\")<=0,\"\",Feuil1!Q360)","v":""},{"$f":"IF(_xlfn.NUMBERVALUE(Feuil1!N360,\".\")<=0,\"\",_xlfn.NUMBERVALUE(Feuil1!N360,\".\"))","v":""},null,"",{"$nulls":3},"",0]
[null,{"$f":"IF(_xlfn.NUMBERVALUE(Feuil1!N361,\".\")<=0,\"\",Feuil1!C361)","v":""},{"$f":"IF(_xlfn.NUMBERVALUE(Feuil1!N361,\".\")<=0,\"\",Feuil1!Q361)","v":""},{"$f":"IF(_xlfn.NUMBERVALUE(Feuil1!N361,\".\")<=0,\"\",_xlfn.NUMBERVALUE(Feuil1!N361,\".\"))","v":""},null,"",{"$nulls":3},"",0]
[null,{"$f":"IF(_xlfn.NUMBERVALUE(Feuil1!N362,\".\")<=0,\"\",Feuil1!C362)","v":""},{"$f":"IF(_xlfn.NUMBERVALUE(Feuil1!N362,\".\")<=0,\"\",Feuil1!Q362)","v":""},{"$f":"IF(_xlfn.NUMBERVALUE(Feuil1!N362,\".\")<=0,\"\",_xlfn.NUMBERVALUE(Feuil1!N362,\".\"))","v":""},null,"",{"$nulls":3},"",0]
[null,{"$f":"IF(_xlfn.NUMBERVALUE(Feuil1!N363,\".\")<=0,\"\",Feuil1!C363)","v":""},{"$f":"IF(_xlfn.NUMBERVALUE(Feuil1!N363,\".\")<=0,\"\",Feuil1!Q363)","v":""},{"$f":"IF(_xlfn.NUMBERVALUE(Feuil1!N363,\".\")<=0,\"\",_xlfn.NUMBERVALUE(Feuil1!N363,\".\"))","v":""},null,"",{"$nulls":3},"",0]
[null,{"$f":"IF(_xlfn.NUMBERVALUE(Feuil1!N364,\".\")<=0,\"\",Feuil1!C364)","v":""},{"$f":"IF(_xlfn.NUMBERVALUE(Feuil1!N364,\".\")<=0,\"\",Feuil1!Q364)","v":""},{"$f":"IF(_xlfn.NUMBERVALUE(Feuil1!N364,\".\")<=0,\"\",_xlfn.NUMBERVALUE(Feuil1!N364,\".\"))","v":""},null,"",{"$nulls":3},"",0]
[null,{"$f":"IF(_xlfn.NUMBERVALUE(Feuil1!N365,\".\")<=0,\"\",Feuil1!C365)","v":""},{"$f":"IF(_xlfn.NUMBERVALUE(Feuil1!N365,\".\")<=0,\"\",Feuil1!Q365)","v":""},{"$f":"IF(_xlfn.NUMBERVALUE(Feuil1!N365,\".\")<=0,\"\",_xlfn.NUMBERVALUE(Feuil1!N365,\".\"))","v":""},null,"",{"$nulls":3},"",0]
[null,{"$f":"IF(_xlfn.NUMBERVALUE(Feuil1!N366,\".\")<=0,\"\",Feuil1!C366)","v":""},{"$f":"IF(_xlfn.NUMBERVALUE(Feuil1!N366,\".\")<=0,\"\",Feuil1!Q366)","v":""},{"$f":"IF(_xlfn.NUMBERVALUE(Feuil1!N366,\".\")<=0,\"\",_xlfn.NUMBERVALUE(Feuil1!N366,\".\"))","v":""},null,"",{"$nulls":3},"",0]
[null,{"$f":"IF(_xlfn.NUMBERVALUE(Feuil1!N367,\".\")<=0,\"\",Feuil1!C367)","v":""},{"$f":"IF(_xlfn.NUMBERVALUE(Feuil1!N367,\".\")<=0,\"\",Feuil1!Q367)","v":""},{"$f":"IF(_xlfn.NUMBERVALUE(Feuil1!N367,\".\")<=0,\"\",_xlfn.NUMBERVALUE(Feuil1!N367,\".\"))","v":""},null,"",{"$nulls":3},"",0]
[null,{"$f":"IF(_xlfn.NUMBERVALUE(Feuil1!N368,\".\")<=0,\"\",Feuil1!C368)","v":""},{"$f":"IF(_xlfn.NUMBERVALUE(Feuil1!N368,\".\")<=0,\"\",Feuil1!Q368)","v":""},{"$f":"IF(_xlfn.NUMBERVALUE(Feuil1!N368,\".\")<=0,\"\",_xlfn.NUMBERVALUE(Feuil1!N368,\".\"))","v":""},null,"",{"$nulls":3},"",0]
[null,{"$f":"IF(_xlfn.NUMBERVALUE(Feuil1!N369,\".\")<=0,\"\",Feuil1!C369)","v":""},{"$f":"IF(_xlfn.NUMBERVALUE(Feuil1!N369,\".\")<=0,\"\",Feuil1!Q369)","v":""},{"$f":"IF(_xlfn.NUMBERVALUE(Feuil1!N369,\".\")<=0,\"\",_xlfn.NUMBERVALUE(Feuil1!N369,\".\"))","v":""},null,"",{"$nulls":3},"",0]
[null,{"$f":"IF(_xlfn.NUMBERVALUE(Feuil1!N370,\".\")<=0,\"\",Feuil1!C370)","v":""},{"$f":"IF(_xlfn.NUMBERVALUE(Feuil1!N370,\".\")<=0,\"\",Feuil1!Q370)","v":""},{"$f":"IF(_xlfn.NUMBERVALUE(Feuil1!N370,\".\")<=0,\"\",_xlfn.NUMBERVALUE(Feuil1!N370,\".\"))","v":""},null,"",{"$nulls":3},"",0]
[null,{"$f":"IF(_xlfn.NUMBERVALUE(Feuil1!N371,\".\")<=0,\"\",Feuil1!C371)","v":""},{"$f":"IF(_xlfn.NUMBERVALUE(Feuil1!N371,\".\")<=0,\"\",Feuil1!Q371)","v":""},{"$f":"IF(_xlfn.NUMBERVALUE(Feuil1!N371,\".\")<=0,\"\",_xlfn.NUMBERVALUE(Feuil1!N371,\".\"))","v":""},null,"",{"$nulls":3},"",0]
[null,{"$f":"IF(_xlfn.NUMBERVALUE(Feuil1!N372,\".\")<=0,\"\",Feuil1!C372)","v":""},{"$f":"IF(_xlfn.NUMBERVALUE(Feuil1!N372,\".\")<=0,\"\",Feuil1!Q372)","v":""},{"$f":"IF(_xlfn.NUMBERVALUE(Feuil1!N372,\".\")<=0,\"\",_xlfn.NUMBERVALUE(Feuil1!N372,\".\"))","v":""},null,"",{"$nulls":3},"",0]
[null,{"$f":"IF(_xlfn.NUMBERVALUE(Feuil1!N373,\".\")<=0,\"\",Feuil1!C373)","v":""},{"$f":"IF(_xlfn.NUMBERVALUE(Feuil1!N373,\".\")<=0,\"\",Feuil1!Q373)","v":""},{"$f":"IF(_xlfn.NUMBERVALUE(Feuil1!N373,\".\")<=0,\"\",_xlfn.NUMBERVALUE(Feuil1!N373,\".\"))","v":""},null,"",{"$nulls":3},"",0]
[null,{"$f":"IF(_xlfn.NUMBERVALUE(Feuil1!N374,\".\")<=0,\"\",Feuil1!C374)","v":""},{"$f":"IF(_xlfn.NUMBERVALUE(Feuil1!N374,\".\")<=0,\"\",Feuil1!Q374)","v":""},{"$f":"IF(_xlfn.NUMBERVALUE(Feuil1!N374,\".\")<=0,\"\",_xlfn.NUMBERVALUE(Feuil1!N374,\".\"))","v":""},null,"",{"$nulls":3},"",0]
[null,{"$f":"IF(_xlfn.NUMBERVALUE(Feuil1!N375,\".\")<=0,\"\",Feuil1!C375)","v":""},{"$f":"IF(_xlfn.NUMBERVALUE(Feuil1!N375,\".\")<=0,\"\",Feuil1!Q375)","v":""},{"$f":"IF(_xlfn.NUMBERVALUE(Feuil1!N375,\".\")<=0,\"\",_xlfn.NUMBERVALUE(Feuil1!N375,\".\"))","v":""},null,"",{"$nulls":3},"",0]
[null,{"$f":"IF(_xlfn.NUMBERVALUE(Feuil1!N376,\".\")<=0,\"\",Feuil1!C376)","v":""},{"$f":"IF(_xlfn.NUMBERVALUE(Feuil1!N376,\".\")<=0,\"\",Feuil1!Q376)","v":""},{"$f":"IF(_xlfn.NUMBERVALUE(Feuil1!N376,\".\")<=0,\"\",_xlfn.NUMBERVALUE(Feuil1!N376,\".\"))","v":""},null,"",{"$nulls":3},"",0]
[null,{"$f":"IF(_xlfn.NUMBERVALUE(Feuil1!N377,\".\")<=0,\"\",Feuil1!C377)","v":""},{"$f":"IF(_xlfn.NUMBERVALUE(Feuil1!N377,\".\")<=0,\"\",Feuil1!Q377)","v":""},{"$f":"IF(_xlfn.NUMBERVALUE(Feuil1!N377,\".\")<=0,\"\",_xlfn.NUMBERVALUE(Feuil1!N377,\".\"))","v":""},null,"",{"$nulls":3},"",0]
[null,{"$f":"IF(_xlfn.NUMBERVALUE(Feuil1!N378,\".\")<=0,\"\",Feuil1!C378)","v":""},{"$f":"IF(_xlfn.NUMBERVALUE(Feuil1!N378,\".\")<=0,\"\",Feuil1!Q378)","v":""},{"$f":"IF(_xlfn.NUMBERVALUE(Feuil1!N378,\".\")<=0,\"\",_xlfn.NUMBERVALUE(Feuil1!N378,\".\"))","v":""},null,"",{"$nulls":3},"",0]
[null,{"$f":"IF(_xlfn.NUMBERVALUE(Feuil1!N379,\".\")<=0,\"\",Feuil1!C379)","v":""},{"$f":"IF(_xlfn.NUMBERVALUE(Feuil1!N379,\".\")<=0,\"\",Feuil1!Q379)","v":""},{"$f":"IF(_xlfn.NUMBERVALUE(Feuil1!N379,\".\")<=0,\"\",_xlfn.NUMBERVALUE(Feuil1!N379,\".\"))","v":""},null,"",{"$nulls":3},"",0]
[null,{"$f":"IF(_xlfn.NUMBERVALUE(Feuil1!N380,\".\")<=0,\"\",Feuil1!C380)","v":""},{"$f":"IF(_xlfn.NUMBERVALUE(Feuil1!N380,\".\")<=0,\"\",Feuil1!Q380)","v":""},{"$f":"IF(_xlfn.NUMBERVALUE(Feuil1!N380,\".\")<=0,\"\",_xlfn.NUMBERVALUE(Feuil1!N380,\".\"))","v":""},null,"",{"$nulls":3},"",0]
[null,{"$f":"IF(_xlfn.NUMBERVALUE(Feuil1!N381,\".\")<=0,\"\",Feuil1!C381)","v":""},{"$f":"IF(_xlfn.NUMBERVALUE(Feuil1!N381,\".\")<=0,\"\",Feuil1!Q381)","v":""},{"$f":"IF(_xlfn.NUMBERVALUE(Feuil1!N381,\".\")<=0,\"\",_xlfn.NUMBERVALUE(Feuil1!N381,\".\"))","v":""},null,"",{"$nulls":3},"",0]
[null,{"$f":"IF(_xlfn.NUMBERVALUE(Feuil1!N382,\".\")<=0,\"\",Feuil1!C382)","v":""},{"$f":"IF(_xlfn.NUMBERVALUE(Feuil1!N382,\".\")<=0,\"\",Feuil1!Q382)","v":""},{"$f":"IF(_xlfn.NUMBERVALUE(Feuil1!N382,\".\")<=0,\"\",_xlfn.NUMBERVALUE(Feuil1!N382,\".\"))","v":""},null,"",{"$nulls":3},"",0]
[null,{"$f":"IF(_xlfn.NUMBERVALUE(Feuil1!N383,\".\")<=0,\"\",Feuil1!C383)","v":""},{"$f":"IF(_xlfn.NUMBERVALUE(Feuil1!N383,\".\")<=0,\"\",Feuil1!Q383)","v":""},{"$f":"IF(_xlfn.NUMBERVALUE(Feuil1!N383,\".\")<=0,\"\",_xlfn.NUMBERVALUE(Feuil1!N383,\".\"))","v":""},null,"",{"$nulls":3},"",0]
[null,{"$f":"IF(_xlfn.NUMBERVALUE(Feuil1!N384,\".\")<=0,\"\",Feuil1!C384)","v":""},{"$f":"IF(_xlfn.NUMBERVALUE(Feuil1!N384,\".\")<=0,\"\",Feuil1!Q384)","v":""},{"$f":"IF(_xlfn.NUMBERVALUE(Feuil1!N384,\".\")<=0,\"\",_xlfn.NUMBERVALUE(Feuil1!N384,\".\"))","v":""},null,"",{"$nulls":3},"",0]
[null,{"$f":"IF(_xlfn.NUMBERVALUE(Feuil1!N385,\".\")<=0,\"\",Feuil1!C385)","v":""},{"$f":"IF(_xlfn.NUMBERVALUE(Feuil1!N385,\".\")<=0,\"\",Feuil1!Q385)","v":""},{"$f":"IF(_xlfn.NUMBERVALUE(Feuil1!N385,\".\")<=0,\"\",_xlfn.NUMBERVALUE(Feuil1!N385,\".\"))","v":""},null,"",{"$nulls":3},"",0]
[null,{"$f":"IF(_xlfn.NUMBERVALUE(Feuil1!N386,\".\")<=0,\"\",Feuil1!C386)","v":""},{"$f":"IF(_xlfn.NUMBERVALUE(Feuil1!N386,\".\")<=0,\"\",Feuil1!Q386)","v":""},{"$f":"IF(_xlfn.NUMBERVALUE(Feuil1!N386,\".\")<=0,\"\",_xlfn.NUMBERVALUE(Feuil1!N386,\".\"))","v":""},null,"",{"$nulls":3},"",0]
[null,{"$f":"IF(_xlfn.NUMBERVALUE(Feuil1!N387,\".\")<=0,\"\",Feuil1!C387)","v":""},{"$f":"IF(_xlfn.NUMBERVALUE(Feuil1!N387,\".\")<=0,\"\",Feuil1!Q387)","v":""},{"$f":"IF(_xlfn.NUMBERVALUE(Feuil1!N387,\".\")<=0,\"\",_xlfn.NUMBERVALUE(Feuil1!N387,\".\"))","v":""},null,"",{"$nulls":3},"",0]
[null,{"$f":"IF(_xlfn.NUMBERVALUE(Feuil1!N388,\".\")<=0,\"\",Feuil1!C388)","v":""},{"$f":"IF(_xlfn.NUMBERVALUE(Feuil1!N388,\".\")<=0,\"\",Feuil1!Q388)","v":""},{"$f":"IF(_xlfn.NUMBERVALUE(Feuil1!N388,\".\")<=0,\"\",_xlfn.NUMBERVALUE(Feuil1!N388,\".\"))","v":""},null,"",{"$nulls":3},{"$f":"IF(D406<>\"\",IF(E406=\"\",\"Finding Nbr\",IF(F406=\"\",\"Add Nature\",IF(G406=\"\",\"Add Source\",\"Ok\"))),IF(F406<>\"\",\"remove Nature\",IF(G406<>\"\",\"remove Source\",\"\")))","v":""},{"$f":"IF(J406=\"Ok\",0,IF(J406=\"\",0,1))","v":0}]
[null,{"$f":"IF(_xlfn.NUMBERVALUE(Feuil1!N389,\".\")<=0,\"\",Feuil1!C389)","v":""},{"$f":"IF(_xlfn.NUMBERVALUE(Feuil1!N389,\".\")<=0,\"\",Feuil1!Q389)","v":""},{"$f":"IF(_xlfn.NUMBERVALUE(Feuil1!N389,\".\")<=0,\"\",_xlfn.NUMBERVALUE(Feuil1!N389,\".\"))","v":""},null,{"$f":"IF(G407=\"Mandatory Replacement\",\"Mandatory replacement\",IF(G407=\"SUP\",\"Incorrect / Suspected unapproved\",\"\"))","v":""},{"$nulls":3},"",0]
[null,{"$f":"IF(_xlfn.NUMBERVALUE(Feuil1!N390,\".\")<=0,\"\",Feuil1!C390)","v":""},{"$f":"IF(_xlfn.NUMBERVALUE(Feuil1!N390,\".\")<=0,\"\",Feuil1!Q390)","v":""},{"$f":"IF(_xlfn.NUMBERVALUE(Feuil1!N390,\".\")<=0,\"\",_xlfn.NUMBERVALUE(Feuil1!N390,\".\"))","v":""},null,"",{"$nulls":3},"",0]
[null,{"$f":"IF(_xlfn.NUMBERVALUE(Feuil1!N391,\".\")<=0,\"\",Feuil1!C391)","v":""},{"$f":"IF(_xlfn.NUMBERVALUE(Feuil1!N391,\".\")<=0,\"\",Feuil1!Q391)","v":""},{"$f":"IF(_xlfn.NUMBERVALUE(Feuil1!N391,\".\")<=0,\"\",_xlfn.NUMBERVALUE(Feuil1!N391,\".\"))","v":""},null,"",{"$nulls":3},"",0]
[null,{"$f":"IF(_xlfn.NUMBERVALUE(Feuil1!N392,\".\")<=0,\"\",Feuil1!C392)","v":""},{"$f":"IF(_xlfn.NUMBERVALUE(Feuil1!N392,\".\")<=0,\"\",Feuil1!Q392)","v":""},{"$f":"IF(_xlfn.NUMBERVALUE(Feuil1!N392,\".\")<=0,\"\",_xlfn.NUMBERVALUE(Feuil1!N392,\".\"))","v":""},null,"",{"$nulls":3},"",0]
[null,{"$f":"IF(_xlfn.NUMBERVALUE(Feuil1!N393,\".\")<=0,\"\",Feuil1!C393)","v":""},{"$f":"IF(_xlfn.NUMBERVALUE(Feuil1!N393,\".\")<=0,\"\",Feuil1!Q393)","v":""},{"$f":"IF(_xlfn.NUMBERVALUE(Feuil1!N393,\".\")<=0,\"\",_xlfn.NUMBERVALUE(Feuil1!N393,\".\"))","v":""},null,"",{"$nulls":3},"",0]
[null,{"$f":"IF(_xlfn.NUMBERVALUE(Feuil1!N394,\".\")<=0,\"\",Feuil1!C394)","v":""},{"$f":"IF(_xlfn.NUMBERVALUE(Feuil1!N394,\".\")<=0,\"\",Feuil1!Q394)","v":""},{"$f":"IF(_xlfn.NUMBERVALUE(Feuil1!N394,\".\")<=0,\"\",_xlfn.NUMBERVALUE(Feuil1!N394,\".\"))","v":""},null,"",{"$nulls":3},"",0]
[null,{"$f":"IF(_xlfn.NUMBERVALUE(Feuil1!N395,\".\")<=0,\"\",Feuil1!C395)","v":""},{"$f":"IF(_xlfn.NUMBERVALUE(Feuil1!N395,\".\")<=0,\"\",Feuil1!Q395)","v":""},{"$f":"IF(_xlfn.NUMBERVALUE(Feuil1!N395,\".\")<=0,\"\",_xlfn.NUMBERVALUE(Feuil1!N395,\".\"))","v":""},null,"",{"$nulls":3},"",0]
[null,{"$f":"IF(_xlfn.NUMBERVALUE(Feuil1!N396,\".\")<=0,\"\",Feuil1!C396)","v":""},{"$f":"IF(_xlfn.NUMBERVALUE(Feuil1!N396,\".\")<=0,\"\",Feuil1!Q396)","v":""},{"$f":"IF(_xlfn.NUMBERVALUE(Feuil1!N396,\".\")<=0,\"\",_xlfn.NUMBERVALUE(Feuil1!N396,\".\"))","v":""},null,"",{"$nulls":3},"",0]
[null,{"$f":"IF(_xlfn.NUMBERVALUE(Feuil1!N397,\".\")<=0,\"\",Feuil1!C397)","v":""},{"$f":"IF(_xlfn.NUMBERVALUE(Feuil1!N397,\".\")<=0,\"\",Feuil1!Q397)","v":""},{"$f":"IF(_xlfn.NUMBERVALUE(Feuil1!N397,\".\")<=0,\"\",_xlfn.NUMBERVALUE(Feuil1!N397,\".\"))","v":""},null,"",{"$nulls":3},"",0]
[null,{"$f":"IF(_xlfn.NUMBERVALUE(Feuil1!N398,\".\")<=0,\"\",Feuil1!C398)","v":""},{"$f":"IF(_xlfn.NUMBERVALUE(Feuil1!N398,\".\")<=0,\"\",Feuil1!Q398)","v":""},{"$f":"IF(_xlfn.NUMBERVALUE(Feuil1!N398,\".\")<=0,\"\",_xlfn.NUMBERVALUE(Feuil1!N398,\".\"))","v":""},null,"",{"$nulls":3},"",0]
[null,{"$f":"IF(_xlfn.NUMBERVALUE(Feuil1!N399,\".\")<=0,\"\",Feuil1!C399)","v":""},{"$f":"IF(_xlfn.NUMBERVALUE(Feuil1!N399,\".\")<=0,\"\",Feuil1!Q399)","v":""},{"$f":"IF(_xlfn.NUMBERVALUE(Feuil1!N399,\".\")<=0,\"\",_xlfn.NUMBERVALUE(Feuil1!N399,\".\"))","v":""},null,"",{"$nulls":3},"",0]
[null,{"$f":"IF(_xlfn.NUMBERVALUE(Feuil1!N400,\".\")<=0,\"\",Feuil1!C400)","v":""},{"$f":"IF(_xlfn.NUMBERVALUE(Feuil1!N400,\".\")<=0,\"\",Feuil1!Q400)","v":""},{"$f":"IF(_xlfn.NUMBERVALUE(Feuil1!N400,\".\")<=0,\"\",_xlfn.NUMBERVALUE(Feuil1!N400,\".\"))","v":""},null,"",{"$nulls":3},"",0]
[null,{"$f":"IF(_xlfn.NUMBERVALUE(Feuil1!N401,\".\")<=0,\"\",Feuil1!C401)","v":""},{"$f":"IF(_xlfn.NUMBERVALUE(Feuil1!N401,\".\")<=0,\"\",Feuil1!Q401)","v":""},{"$f":"IF(_xlfn.NUMBERVALUE(Feuil1!N401,\".\")<=0,\"\",_xlfn.NUMBERVALUE(Feuil1!N401,\".\"))","v":""},null,"",{"$nulls":3},"",0]
[null,{"$f":"IF(_xlfn.NUMBERVALUE(Feuil1!N402,\".\")<=0,\"\",Feuil1!C402)","v":""},{"$f":"IF(_xlfn.NUMBERVALUE(Feuil1!N402,\".\")<=0,\"\",Feuil1!Q402)","v":""},{"$f":"IF(_xlfn.NUMBERVALUE(Feuil1!N402,\".\")<=0,\"\",_xlfn.NUMBERVALUE(Feuil1!N402,\".\"))","v":""},null,"",{"$nulls":3},"",0]
[null,{"$f":"IF(_xlfn.NUMBERVALUE(Feuil1!N403,\".\")<=0,\"\",Feuil1!C403)","v":""},{"$f":"IF(_xlfn.NUMBERVALUE(Feuil1!N403,\".\")<=0,\"\",Feuil1!Q403)","v":""},{"$f":"IF(_xlfn.NUMBERVALUE(Feuil1!N403,\".\")<=0,\"\",_xlfn.NUMBERVALUE(Feuil1!N403,\".\"))","v":""},null,"",{"$nulls":3},"",0]
[null,{"$f":"IF(_xlfn.NUMBERVALUE(Feuil1!N404,\".\")<=0,\"\",Feuil1!C404)","v":""},{"$f":"IF(_xlfn.NUMBERVALUE(Feuil1!N404,\".\")<=0,\"\",Feuil1!Q404)","v":""},{"$f":"IF(_xlfn.NUMBERVALUE(Feuil1!N404,\".\")<=0,\"\",_xlfn.NUMBERVALUE(Feuil1!N404,\".\"))","v":""},null,"",{"$nulls":3},"",0]
[null,{"$f":"IF(_xlfn.NUMBERVALUE(Feuil1!N405,\".\")<=0,\"\",Feuil1!C405)","v":""},{"$f":"IF(_xlfn.NUMBERVALUE(Feuil1!N405,\".\")<=0,\"\",Feuil1!Q405)","v":""},{"$f":"IF(_xlfn.NUMBERVALUE(Feuil1!N405,\".\")<=0,\"\",_xlfn.NUMBERVALUE(Feuil1!N405,\".\"))","v":""},null,"",{"$nulls":3},"",0]
[null,{"$f":"IF(_xlfn.NUMBERVALUE(Feuil1!N406,\".\")<=0,\"\",Feuil1!C406)","v":""},{"$f":"IF(_xlfn.NUMBERVALUE(Feuil1!N406,\".\")<=0,\"\",Feuil1!Q406)","v":""},{"$f":"IF(_xlfn.NUMBERVALUE(Feuil1!N406,\".\")<=0,\"\",_xlfn.NUMBERVALUE(Feuil1!N406,\".\"))","v":""},null,"",{"$nulls":3},"",0]
[null,{"$f":"IF(_xlfn.NUMBERVALUE(Feuil1!N407,\".\")<=0,\"\",Feuil1!C407)","v":""},{"$f":"IF(_xlfn.NUMBERVALUE(Feuil1!N407,\".\")<=0,\"\",Feuil1!Q407)","v":""},{"$f":"IF(_xlfn.NUMBERVALUE(Feuil1!N407,\".\")<=0,\"\",_xlfn.NUMBERVALUE(Feuil1!N407,\".\"))","v":""},null,"",{"$nulls":3},"",0]
[null,{"$f":"IF(_xlfn.NUMBERVALUE(Feuil1!N408,\".\")<=0,\"\",Feuil1!C408)","v":""},{"$f":"IF(_xlfn.NUMBERVALUE(Feuil1!N408,\".\")<=0,\"\",Feuil1!Q408)","v":""},{"$f":"IF(_xlfn.NUMBERVALUE(Feuil1!N408,\".\")<=0,\"\",_xlfn.NUMBERVALUE(Feuil1!N408,\".\"))","v":""},null,"",{"$nulls":3},"",0]
[null,{"$f":"IF(_xlfn.NUMBERVALUE(Feuil1!N409,\".\")<=0,\"\",Feuil1!C409)","v":""},{"$f":"IF(_xlfn.NUMBERVALUE(Feuil1!N409,\".\")<=0,\"\",Feuil1!Q409)","v":""},{"$f":"IF(_xlfn.NUMBERVALUE(Feuil1!N409,\".\")<=0,\"\",_xlfn.NUMBERVALUE(Feuil1!N409,\".\"))","v":""},null,"",{"$nulls":3},"",0]
[null,{"$f":"IF(_xlfn.NUMBERVALUE(Feuil1!N410,\".\")<=0,\"\",Feuil1!C410)","v":""},{"$f":"IF(_xlfn.NUMBERVALUE(Feuil1!N410,\".\")<=0,\"\",Feuil1!Q410)","v":""},{"$f":"IF(_xlfn.NUMBERVALUE(Feuil1!N410,\".\")<=0,\"\",_xlfn.NUMBERVALUE(Feuil1!N410,\".\"))","v":""},null,"",{"$nulls":3},"",0]
[null,{"$f":"IF(_xlfn.NUMBERVALUE(Feuil1!N411,\".\")<=0,\"\",Feuil1!C411)","v":""},{"$f":"IF(_xlfn.NUMBERVALUE(Feuil1!N411,\".\")<=0,\"\",Feuil1!Q411)","v":""},{"$f":"IF(_xlfn.NUMBERVALUE(Feuil1!N411,\".\")<=0,\"\",_xlfn.NUMBERVALUE(Feuil1!N411,\".\"))","v":""},null,"",{"$nulls":3},"",0]
[null,{"$f":"IF(_xlfn.NUMBERVALUE(Feuil1!N412,\".\")<=0,\"\",Feuil1!C412)","v":""},{"$f":"IF(_xlfn.NUMBERVALUE(Feuil1!N412,\".\")<=0,\"\",Feuil1!Q412)","v":""},{"$f":"IF(_xlfn.NUMBERVALUE(Feuil1!N412,\".\")<=0,\"\",_xlfn.NUMBERVALUE(Feuil1!N412,\".\"))","v":""},null,"",{"$nulls":3},"",0]
[null,{"$f":"IF(_xlfn.NUMBERVALUE(Feuil1!N413,\".\")<=0,\"\",Feuil1!C413)","v":""},{"$f":"IF(_xlfn.NUMBERVALUE(Feuil1!N413,\".\")<=0,\"\",Feuil1!Q413)","v":""},{"$f":"IF(_xlfn.NUMBERVALUE(Feuil1!N413,\".\")<=0,\"\",_xlfn.NUMBERVALUE(Feuil1!N413,\".\"))","v":""},null,"",{"$nulls":3},"",0]
[null,{"$f":"IF(_xlfn.NUMBERVALUE(Feuil1!N414,\".\")<=0,\"\",Feuil1!C414)","v":""},{"$f":"IF(_xlfn.NUMBERVALUE(Feuil1!N414,\".\")<=0,\"\",Feuil1!Q414)","v":""},{"$f":"IF(_xlfn.NUMBERVALUE(Feuil1!N414,\".\")<=0,\"\",_xlfn.NUMBERVALUE(Feuil1!N414,\".\"))","v":""},null,"",{"$nulls":3},"",0]
[null,{"$f":"IF(_xlfn.NUMBERVALUE(Feuil1!N415,\".\")<=0,\"\",Feuil1!C415)","v":""},{"$f":"IF(_xlfn.NUMBERVALUE(Feuil1!N415,\".\")<=0,\"\",Feuil1!Q415)","v":""},{"$f":"IF(_xlfn.NUMBERVALUE(Feuil1!N415,\".\")<=0,\"\",_xlfn.NUMBERVALUE(Feuil1!N415,\".\"))","v":""},null,"",{"$nulls":3},"",0]
[null,{"$f":"IF(_xlfn.NUMBERVALUE(Feuil1!N416,\".\")<=0,\"\",Feuil1!C416)","v":""},{"$f":"IF(_xlfn.NUMBERVALUE(Feuil1!N416,\".\")<=0,\"\",Feuil1!Q416)","v":""},{"$f":"IF(_xlfn.NUMBERVALUE(Feuil1!N416,\".\")<=0,\"\",_xlfn.NUMBERVALUE(Feuil1!N416,\".\"))","v":""},null,"",{"$nulls":3},"",0]
[null,{"$f":"IF(_xlfn.NUMBERVALUE(Feuil1!N417,\".\")<=0,\"\",Feuil1!C417)","v":""},{"$f":"IF(_xlfn.NUMBERVALUE(Feuil1!N417,\".\")<=0,\"\",Feuil1!Q417)","v":""},{"$f":"IF(_xlfn.NUMBERVALUE(Feuil1!N417,\".\")<=0,\"\",_xlfn.NUMBERVALUE(Feuil1!N417,\".\"))","v":""},null,"",{"$nulls":3},"",0]
[null,{"$f":"IF(_xlfn.NUMBERVALUE(Feuil1!N418,\".\")<=0,\"\",Feuil1!C418)","v":""},{"$f":"IF(_xlfn.NUMBERVALUE(Feuil1!N418,\".\")<=0,\"\",Feuil1!Q418)","v":""},{"$f":"IF(_xlfn.NUMBERVALUE(Feuil1!N418,\".\")<=0,\"\",_xlfn.NUMBERVALUE(Feuil1!N418,\".\"))","v":""},null,"",{"$nulls":3},"",0]
[null,{"$f":"IF(_xlfn.NUMBERVALUE(Feuil1!N419,\".\")<=0,\"\",Feuil1!C419)","v":""},{"$f":"IF(_xlfn.NUMBERVALUE(Feuil1!N419,\".\")<=0,\"\",Feuil1!Q419)","v":""},{"$f":"IF(_xlfn.NUMBERVALUE(Feuil1!N419,\".\")<=0,\"\",_xlfn.NUMBERVALUE(Feuil1!N419,\".\"))","v":""},null,"",{"$nulls":3},"",0]
[null,{"$f":"IF(_xlfn.NUMBERVALUE(Feuil1!N420,\".\")<=0,\"\",Feuil1!C420)","v":""},{"$f":"IF(_xlfn.NUMBERVALUE(Feuil1!N420,\".\")<=0,\"\",Feuil1!Q420)","v":""},{"$f":"IF(_xlfn.NUMBERVALUE(Feuil1!N420,\".\")<=0,\"\",_xlfn.NUMBERVALUE(Feuil1!N420,\".\"))","v":""},null,"",{"$nulls":3},"",0]
[null,{"$f":"IF(_xlfn.NUMBERVALUE(Feuil1!N421,\".\")<=0,\"\",Feuil1!C421)","v":""},{"$f":"IF(_xlfn.NUMBERVALUE(Feuil1!N421,\".\")<=0,\"\",Feuil1!Q421)","v":""},{"$f":"IF(_xlfn.NUMBERVALUE(Feuil1!N421,\".\")<=0,\"\",_xlfn.NUMBERVALUE(Feuil1!N421,\".\"))","v":""},null,"",{"$nulls":3},"",0]
[null,{"$f":"IF(_xlfn.NUMBERVALUE(Feuil1!N422,\".\")<=0,\"\",Feuil1!C422)","v":""},{"$f":"IF(_xlfn.NUMBERVALUE(Feuil1!N422,\".\")<=0,\"\",Feuil1!Q422)","v":""},{"$f":"IF(_xlfn.NUMBERVALUE(Feuil1!N422,\".\")<=0,\"\",_xlfn.NUMBERVALUE(Feuil1!N422,\".\"))","v":""},null,"",{"$nulls":3},"",0]
[null,{"$f":"IF(_xlfn.NUMBERVALUE(Feuil1!N423,\".\")<=0,\"\",Feuil1!C423)","v":""},{"$f":"IF(_xlfn.NUMBERVALUE(Feuil1!N423,\".\")<=0,\"\",Feuil1!Q423)","v":""},{"$f":"IF(_xlfn.NUMBERVALUE(Feuil1!N423,\".\")<=0,\"\",_xlfn.NUMBERVALUE(Feuil1!N423,\".\"))","v":""},null,"",{"$nulls":3},"",0]
[null,{"$f":"IF(_xlfn.NUMBERVALUE(Feuil1!N424,\".\")<=0,\"\",Feuil1!C424)","v":""},{"$f":"IF(_xlfn.NUMBERVALUE(Feuil1!N424,\".\")<=0,\"\",Feuil1!Q424)","v":""},{"$f":"IF(_xlfn.NUMBERVALUE(Feuil1!N424,\".\")<=0,\"\",_xlfn.NUMBERVALUE(Feuil1!N424,\".\"))","v":""},null,"",{"$nulls":3},"",0]
[null,{"$f":"IF(_xlfn.NUMBERVALUE(Feuil1!N425,\".\")<=0,\"\",Feuil1!C425)","v":""},{"$f":"IF(_xlfn.NUMBERVALUE(Feuil1!N425,\".\")<=0,\"\",Feuil1!Q425)","v":""},{"$f":"IF(_xlfn.NUMBERVALUE(Feuil1!N425,\".\")<=0,\"\",_xlfn.NUMBERVALUE(Feuil1!N425,\".\"))","v":""},null,"",{"$nulls":3},"",0]
[null,{"$f":"IF(_xlfn.NUMBERVALUE(Feuil1!N426,\".\")<=0,\"\",Feuil1!C426)","v":""},{"$f":"IF(_xlfn.NUMBERVALUE(Feuil1!N426,\".\")<=0,\"\",Feuil1!Q426)","v":""},{"$f":"IF(_xlfn.NUMBERVALUE(Feuil1!N426,\".\")<=0,\"\",_xlfn.NUMBERVALUE(Feuil1!N426,\".\"))","v":""},null,"",{"$nulls":3},"",0]
[null,{"$f":"IF(_xlfn.NUMBERVALUE(Feuil1!N427,\".\")<=0,\"\",Feuil1!C427)","v":""},{"$f":"IF(_xlfn.NUMBERVALUE(Feuil1!N427,\".\")<=0,\"\",Feuil1!Q427)","v":""},{"$f":"IF(_xlfn.NUMBERVALUE(Feuil1!N427,\".\")<=0,\"\",_xlfn.NUMBERVALUE(Feuil1!N427,\".\"))","v":""},null,"",{"$nulls":3},"",0]
[null,{"$f":"IF(_xlfn.NUMBERVALUE(Feuil1!N428,\".\")<=0,\"\",Feuil1!C428)","v":""},{"$f":"IF(_xlfn.NUMBERVALUE(Feuil1!N428,\".\")<=0,\"\",Feuil1!Q428)","v":""},{"$f":"IF(_xlfn.NUMBERVALUE(Feuil1!N428,\".\")<=0,\"\",_xlfn.NUMBERVALUE(Feuil1!N428,\".\"))","v":""},null,"",{"$nulls":3},"",0]
[null,{"$f":"IF(_xlfn.NUMBERVALUE(Feuil1!N429,\".\")<=0,\"\",Feuil1!C429)","v":""},{"$f":"IF(_xlfn.NUMBERVALUE(Feuil1!N429,\".\")<=0,\"\",Feuil1!Q429)","v":""},{"$f":"IF(_xlfn.NUMBERVALUE(Feuil1!N429,\".\")<=0,\"\",_xlfn.NUMBERVALUE(Feuil1!N429,\".\"))","v":""},null,"",{"$nulls":3},"",0]
[null,{"$f":"IF(_xlfn.NUMBERVALUE(Feuil1!N430,\".\")<=0,\"\",Feuil1!C430)","v":""},{"$f":"IF(_xlfn.NUMBERVALUE(Feuil1!N430,\".\")<=0,\"\",Feuil1!Q430)","v":""},{"$f":"IF(_xlfn.NUMBERVALUE(Feuil1!N430,\".\")<=0,\"\",_xlfn.NUMBERVALUE(Feuil1!N430,\".\"))","v":""},null,"",{"$nulls":3},"",0]
[null,{"$f":"IF(_xlfn.NUMBERVALUE(Feuil1!N431,\".\")<=0,\"\",Feuil1!C431)","v":""},{"$f":"IF(_xlfn.NUMBERVALUE(Feuil1!N431,\".\")<=0,\"\",Feuil1!Q431)","v":""},{"$f":"IF(_xlfn.NUMBERVALUE(Feuil1!N431,\".\")<=0,\"\",_xlfn.NUMBERVALUE(Feuil1!N431,\".\"))","v":""},null,"",{"$nulls":3},"",0]
[null,{"$f":"IF(_xlfn.NUMBERVALUE(Feuil1!N432,\".\")<=0,\"\",Feuil1!C432)","v":""},{"$f":"IF(_xlfn.NUMBERVALUE(Feuil1!N432,\".\")<=0,\"\",Feuil1!Q432)","v":""},{"$f":"IF(_xlfn.NUMBERVALUE(Feuil1!N432,\".\")<=0,\"\",_xlfn.NUMBERVALUE(Feuil1!N432,\".\"))","v":""},null,"",{"$nulls":3},"",0]
[null,{"$f":"IF(_xlfn.NUMBERVALUE(Feuil1!N433,\".\")<=0,\"\",Feuil1!C433)","v":""},{"$f":"IF(_xlfn.NUMBERVALUE(Feuil1!N433,\".\")<=0,\"\",Feuil1!Q433)","v":""},{"$f":"IF(_xlfn.NUMBERVALUE(Feuil1!N433,\".\")<=0,\"\",_xlfn.NUMBERVALUE(Feuil1!N433,\".\"))","v":""},null,"",{"$nulls":3},"",0]
[null,{"$f":"IF(_xlfn.NUMBERVALUE(Feuil1!N434,\".\")<=0,\"\",Feuil1!C434)","v":""},{"$f":"IF(_xlfn.NUMBERVALUE(Feuil1!N434,\".\")<=0,\"\",Feuil1!Q434)","v":""},{"$f":"IF(_xlfn.NUMBERVALUE(Feuil1!N434,\".\")<=0,\"\",_xlfn.NUMBERVALUE(Feuil1!N434,\".\"))","v":""},null,"",{"$nulls":3},"",0]
[null,{"$f":"IF(_xlfn.NUMBERVALUE(Feuil1!N435,\".\")<=0,\"\",Feuil1!C435)","v":""},{"$f":"IF(_xlfn.NUMBERVALUE(Feuil1!N435,\".\")<=0,\"\",Feuil1!Q435)","v":""},{"$f":"IF(_xlfn.NUMBERVALUE(Feuil1!N435,\".\")<=0,\"\",_xlfn.NUMBERVALUE(Feuil1!N435,\".\"))","v":""},null,"",{"$nulls":3},"",0]
[null,{"$f":"IF(_xlfn.NUMBERVALUE(Feuil1!N436,\".\")<=0,\"\",Feuil1!C436)","v":""},{"$f":"IF(_xlfn.NUMBERVALUE(Feuil1!N436,\".\")<=0,\"\",Feuil1!Q436)","v":""},{"$f":"IF(_xlfn.NUMBERVALUE(Feuil1!N436,\".\")<=0,\"\",_xlfn.NUMBERVALUE(Feuil1!N436,\".\"))","v":""},null,"",{"$nulls":3},"",0]
[null,{"$f":"IF(_xlfn.NUMBERVALUE(Feuil1!N437,\".\")<=0,\"\",Feuil1!C437)","v":""},{"$f":"IF(_xlfn.NUMBERVALUE(Feuil1!N437,\".\")<=0,\"\",Feuil1!Q437)","v":""},{"$f":"IF(_xlfn.NUMBERVALUE(Feuil1!N437,\".\")<=0,\"\",_xlfn.NUMBERVALUE(Feuil1!N437,\".\"))","v":""},null,"",{"$nulls":3},"",0]
[null,{"$f":"IF(_xlfn.NUMBERVALUE(Feuil1!N438,\".\")<=0,\"\",Feuil1!C438)","v":""},{"$f":"IF(_xlfn.NUMBERVALUE(Feuil1!N438,\".\")<=0,\"\",Feuil1!Q438)","v":""},{"$f":"IF(_xlfn.NUMBERVALUE(Feuil1!N438,\".\")<=0,\"\",_xlfn.NUMBERVALUE(Feuil1!N438,\".\"))","v":""},null,"",{"$nulls":3},"",0]
[null,{"$f":"IF(_xlfn.NUMBERVALUE(Feuil1!N439,\".\")<=0,\"\",Feuil1!C439)","v":""},{"$f":"IF(_xlfn.NUMBERVALUE(Feuil1!N439,\".\")<=0,\"\",Feuil1!Q439)","v":""},{"$f":"IF(_xlfn.NUMBERVALUE(Feuil1!N439,\".\")<=0,\"\",_xlfn.NUMBERVALUE(Feuil1!N439,\".\"))","v":""},null,"",{"$nulls":3},"",0]
[null,{"$f":"IF(_xlfn.NUMBERVALUE(Feuil1!N440,\".\")<=0,\"\",Feuil1!C440)","v":""},{"$f":"IF(_xlfn.NUMBERVALUE(Feuil1!N440,\".\")<=0,\"\",Feuil1!Q440)","v":""},{"$f":"IF(_xlfn.NUMBERVALUE(Feuil1!N440,\".\")<=0,\"\",_xlfn.NUMBERVALUE(Feuil1!N440,\".\"))","v":""},null,"",{"$nulls":3},"",0]
[null,{"$f":"IF(_xlfn.NUMBERVALUE(Feuil1!N441,\".\")<=0,\"\",Feuil1!C441)","v":""},{"$f":"IF(_xlfn.NUMBERVALUE(Feuil1!N441,\".\")<=0,\"\",Feuil1!Q441)","v":""},{"$f":"IF(_xlfn.NUMBERVALUE(Feuil1!N441,\".\")<=0,\"\",_xlfn.NUMBERVALUE(Feuil1!N441,\".\"))","v":""},null,"",{"$nulls":3},"",0]
[null,{"$f":"IF(_xlfn.NUMBERVALUE(Feuil1!N442,\".\")<=0,\"\",Feuil1!C442)","v":""},{"$f":"IF(_xlfn.NUMBERVALUE(Feuil1!N442,\".\")<=0,\"\",Feuil1!Q442)","v":""},{"$f":"IF(_xlfn.NUMBERVALUE(Feuil1!N442,\".\")<=0,\"\",_xlfn.NUMBERVALUE(Feuil1!N442,\".\"))","v":""},null,"",{"$nulls":3},"",0]
[null,{"$f":"IF(_xlfn.NUMBERVALUE(Feuil1!N443,\".\")<=0,\"\",Feuil1!C443)","v":""},{"$f":"IF(_xlfn.NUMBERVALUE(Feuil1!N443,\".\")<=0,\"\",Feuil1!Q443)","v":""},{"$f":"IF(_xlfn.NUMBERVALUE(Feuil1!N443,\".\")<=0,\"\",_xlfn.NUMBERVALUE(Feuil1!N443,\".\"))","v":""},null,"",{"$nulls":3},"",0]
[null,{"$f":"IF(_xlfn.NUMBERVALUE(Feuil1!N444,\".\")<=0,\"\",Feuil1!C444)","v":""},{"$f":"IF(_xlfn.NUMBERVALUE(Feuil1!N444,\".\")<=0,\"\",Feuil1!Q444)","v":""},{"$f":"IF(_xlfn.NUMBERVALUE(Feuil1!N444,\".\")<=0,\"\",_xlfn.NUMBERVALUE(Feuil1!N444,\".\"))","v":""},null,"",{"$nulls":3},"",0]
[null,{"$f":"IF(_xlfn.NUMBERVALUE(Feuil1!N445,\".\")<=0,\"\",Feuil1!C445)","v":""},{"$f":"IF(_xlfn.NUMBERVALUE(Feuil1!N445,\".\")<=0,\"\",Feuil1!Q445)","v":""},{"$f":"IF(_xlfn.NUMBERVALUE(Feuil1!N445,\".\")<=0,\"\",_xlfn.NUMBERVALUE(Feuil1!N445,\".\"))","v":""},null,"",{"$nulls":3},"",0]
[null,{"$f":"IF(_xlfn.NUMBERVALUE(Feuil1!N446,\".\")<=0,\"\",Feuil1!C446)","v":""},{"$f":"IF(_xlfn.NUMBERVALUE(Feuil1!N446,\".\")<=0,\"\",Feuil1!Q446)","v":""},{"$f":"IF(_xlfn.NUMBERVALUE(Feuil1!N446,\".\")<=0,\"\",_xlfn.NUMBERVALUE(Feuil1!N446,\".\"))","v":""},null,"",{"$nulls":3},"",0]
[null,{"$f":"IF(_xlfn.NUMBERVALUE(Feuil1!N447,\".\")<=0,\"\",Feuil1!C447)","v":""},{"$f":"IF(_xlfn.NUMBERVALUE(Feuil1!N447,\".\")<=0,\"\",Feuil1!Q447)","v":""},{"$f":"IF(_xlfn.NUMBERVALUE(Feuil1!N447,\".\")<=0,\"\",_xlfn.NUMBERVALUE(Feuil1!N447,\".\"))","v":""},null,"",{"$nulls":3},"",0]
[null,{"$f":"IF(_xlfn.NUMBERVALUE(Feuil1!N448,\".\")<=0,\"\",Feuil1!C448)","v":""},{"$f":"IF(_xlfn.NUMBERVALUE(Feuil1!N448,\".\")<=0,\"\",Feuil1!Q448)","v":""},{"$f":"IF(_xlfn.NUMBERVALUE(Feuil1!N448,\".\")<=0,\"\",_xlfn.NUMBERVALUE(Feuil1!N448,\".\"))","v":""},null,"",{"$nulls":3},"",0]
[null,{"$f":"IF(_xlfn.NUMBERVALUE(Feuil1!N449,\".\")<=0,\"\",Feuil1!C449)","v":""},{"$f":"IF(_xlfn.NUMBERVALUE(Feuil1!N449,\".\")<=0,\"\",Feuil1!Q449)","v":""},{"$f":"IF(_xlfn.NUMBERVALUE(Feuil1!N449,\".\")<=0,\"\",_xlfn.NUMBERVALUE(Feuil1!N449,\".\"))","v":""},null,"",{"$nulls":3},"",0]
[null,{"$f":"IF(_xlfn.NUMBERVALUE(Feuil1!N450,\".\")<=0,\"\",Feuil1!C450)","v":""},{"$f":"IF(_xlfn.NUMBERVALUE(Feuil1!N450,\".\")<=0,\"\",Feuil1!Q450)","v":""},{"$f":"IF(_xlfn.NUMBERVALUE(Feuil1!N450,\".\")<=0,\"\",_xlfn.NUMBERVALUE(Feuil1!N450,\".\"))","v":""},null,"",{"$nulls":3},"",0]
[null,{"$f":"IF(_xlfn.NUMBERVALUE(Feuil1!N451,\".\")<=0,\"\",Feuil1!C451)","v":""},{"$f":"IF(_xlfn.NUMBERVALUE(Feuil1!N451,\".\")<=0,\"\",Feuil1!Q451)","v":""},{"$f":"IF(_xlfn.NUMBERVALUE(Feuil1!N451,\".\")<=0,\"\",_xlfn.NUMBERVALUE(Feuil1!N451,\".\"))","v":""},null,"",{"$nulls":3},"",0]
[null,{"$f":"IF(_xlfn.NUMBERVALUE(Feuil1!N452,\".\")<=0,\"\",Feuil1!C452)","v":""},{"$f":"IF(_xlfn.NUMBERVALUE(Feuil1!N452,\".\")<=0,\"\",Feuil1!Q452)","v":""},{"$f":"IF(_xlfn.NUMBERVALUE(Feuil1!N452,\".\")<=0,\"\",_xlfn.NUMBERVALUE(Feuil1!N452,\".\"))","v":""},null,"",{"$nulls":3},{"$f":"IF(D470<>\"\",IF(E470=\"\",\"Finding Nbr\",IF(F470=\"\",\"Add Nature\",IF(G470=\"\",\"Add Source\",\"Ok\"))),IF(F470<>\"\",\"remove Nature\",IF(G470<>\"\",\"remove Source\",\"\")))","v":""},{"$f":"IF(J470=\"Ok\",0,IF(J470=\"\",0,1))","v":0}]
[null,{"$f":"IF(_xlfn.NUMBERVALUE(Feuil1!N453,\".\")<=0,\"\",Feuil1!C453)","v":""},{"$f":"IF(_xlfn.NUMBERVALUE(Feuil1!N453,\".\")<=0,\"\",Feuil1!Q453)","v":""},{"$f":"IF(_xlfn.NUMBERVALUE(Feuil1!N453,\".\")<=0,\"\",_xlfn.NUMBERVALUE(Feuil1!N453,\".\"))","v":""},null,{"$f":"IF(G471=\"Mandatory Replacement\",\"Mandatory replacement\",IF(G471=\"SUP\",\"Incorrect / Suspected unapproved\",\"\"))","v":""},{"$nulls":3},"",0]
[null,{"$f":"IF(_xlfn.NUMBERVALUE(Feuil1!N454,\".\")<=0,\"\",Feuil1!C454)","v":""},{"$f":"IF(_xlfn.NUMBERVALUE(Feuil1!N454,\".\")<=0,\"\",Feuil1!Q454)","v":""},{"$f":"IF(_xlfn.NUMBERVALUE(Feuil1!N454,\".\")<=0,\"\",_xlfn.NUMBERVALUE(Feuil1!N454,\".\"))","v":""},null,"",{"$nulls":3},"",0]
[null,{"$f":"IF(_xlfn.NUMBERVALUE(Feuil1!N455,\".\")<=0,\"\",Feuil1!C455)","v":""},{"$f":"IF(_xlfn.NUMBERVALUE(Feuil1!N455,\".\")<=0,\"\",Feuil1!Q455)","v":""},{"$f":"IF(_xlfn.NUMBERVALUE(Feuil1!N455,\".\")<=0,\"\",_xlfn.NUMBERVALUE(Feuil1!N455,\".\"))","v":""},null,"",{"$nulls":3},"",0]
[null,{"$f":"IF(_xlfn.NUMBERVALUE(Feuil1!N456,\".\")<=0,\"\",Feuil1!C456)","v":""},{"$f":"IF(_xlfn.NUMBERVALUE(Feuil1!N456,\".\")<=0,\"\",Feuil1!Q456)","v":""},{"$f":"IF(_xlfn.NUMBERVALUE(Feuil1!N456,\".\")<=0,\"\",_xlfn.NUMBERVALUE(Feuil1!N456,\".\"))","v":""},null,"",{"$nulls":3},"",0]
[null,{"$f":"IF(_xlfn.NUMBERVALUE(Feuil1!N457,\".\")<=0,\"\",Feuil1!C457)","v":""},{"$f":"IF(_xlfn.NUMBERVALUE(Feuil1!N457,\".\")<=0,\"\",Feuil1!Q457)","v":""},{"$f":"IF(_xlfn.NUMBERVALUE(Feuil1!N457,\".\")<=0,\"\",_xlfn.NUMBERVALUE(Feuil1!N457,\".\"))","v":""},null,"",{"$nulls":3},"",0]
[null,{"$f":"IF(_xlfn.NUMBERVALUE(Feuil1!N458,\".\")<=0,\"\",Feuil1!C458)","v":""},{"$f":"IF(_xlfn.NUMBERVALUE(Feuil1!N458,\".\")<=0,\"\",Feuil1!Q458)","v":""},{"$f":"IF(_xlfn.NUMBERVALUE(Feuil1!N458,\".\")<=0,\"\",_xlfn.NUMBERVALUE(Feuil1!N458,\".\"))","v":""},null,"",{"$nulls":3},"",0]
[null,{"$f":"IF(_xlfn.NUMBERVALUE(Feuil1!N459,\".\")<=0,\"\",Feuil1!C459)","v":""},{"$f":"IF(_xlfn.NUMBERVALUE(Feuil1!N459,\".\")<=0,\"\",Feuil1!Q459)","v":""},{"$f":"IF(_xlfn.NUMBERVALUE(Feuil1!N459,\".\")<=0,\"\",_xlfn.NUMBERVALUE(Feuil1!N459,\".\"))","v":""},null,"",{"$nulls":3},"",0]
[null,{"$f":"IF(_xlfn.NUMBERVALUE(Feuil1!N460,\".\")<=0,\"\",Feuil1!C460)","v":""},{"$f":"IF(_xlfn.NUMBERVALUE(Feuil1!N460,\".\")<=0,\"\",Feuil1!Q460)","v":""},{"$f":"IF(_xlfn.NUMBERVALUE(Feuil1!N460,\".\")<=0,\"\",_xlfn.NUMBERVALUE(Feuil1!N460,\".\"))","v":""},null,"",{"$nulls":3},"",0]
[null,{"$f":"IF(_xlfn.NUMBERVALUE(Feuil1!N461,\".\")<=0,\"\",Feuil1!C461)","v":""},{"$f":"IF(_xlfn.NUMBERVALUE(Feuil1!N461,\".\")<=0,\"\",Feuil1!Q461)","v":""},{"$f":"IF(_xlfn.NUMBERVALUE(Feuil1!N461,\".\")<=0,\"\",_xlfn.NUMBERVALUE(Feuil1!N461,\".\"))","v":""},null,"",{"$nulls":3},"",0]
[null,{"$f":"IF(_xlfn.NUMBERVALUE(Feuil1!N462,\".\")<=0,\"\",Feuil1!C462)","v":""},{"$f":"IF(_xlfn.NUMBERVALUE(Feuil1!N462,\".\")<=0,\"\",Feuil1!Q462)","v":""},{"$f":"IF(_xlfn.NUMBERVALUE(Feuil1!N462,\".\")<=0,\"\",_xlfn.NUMBERVALUE(Feuil1!N462,\".\"))","v":""},null,"",{"$nulls":3},"",0]
[null,{"$f":"IF(_xlfn.NUMBERVALUE(Feuil1!N463,\".\")<=0,\"\",Feuil1!C463)","v":""},{"$f":"IF(_xlfn.NUMBERVALUE(Feuil1!N463,\".\")<=0,\"\",Feuil1!Q463)","v":""},{"$f":"IF(_xlfn.NUMBERVALUE(Feuil1!N463,\".\")<=0,\"\",_xlfn.NUMBERVALUE(Feuil1!N463,\".\"))","v":""},null,"",{"$nulls":3},"",0]
[null,{"$f":"IF(_xlfn.NUMBERVALUE(Feuil1!N464,\".\")<=0,\"\",Feuil1!C464)","v":""},{"$f":"IF(_xlfn.NUMBERVALUE(Feuil1!N464,\".\")<=0,\"\",Feuil1!Q464)","v":""},{"$f":"IF(_xlfn.NUMBERVALUE(Feuil1!N464,\".\")<=0,\"\",_xlfn.NUMBERVALUE(Feuil1!N464,\".\"))","v":""},null,"",{"$nulls":3},"",0]
[null,{"$f":"IF(_xlfn.NUMBERVALUE(Feuil1!N465,\".\")<=0,\"\",Feuil1!C465)","v":""},{"$f":"IF(_xlfn.NUMBERVALUE(Feuil1!N465,\".\")<=0,\"\",Feuil1!Q465)","v":""},{"$f":"IF(_xlfn.NUMBERVALUE(Feuil1!N465,\".\")<=0,\"\",_xlfn.NUMBERVALUE(Feuil1!N465,\".\"))","v":""},null,"",{"$nulls":3},"",0]
[null,{"$f":"IF(_xlfn.NUMBERVALUE(Feuil1!N466,\".\")<=0,\"\",Feuil1!C466)","v":""},{"$f":"IF(_xlfn.NUMBERVALUE(Feuil1!N466,\".\")<=0,\"\",Feuil1!Q466)","v":""},{"$f":"IF(_xlfn.NUMBERVALUE(Feuil1!N466,\".\")<=0,\"\",_xlfn.NUMBERVALUE(Feuil1!N466,\".\"))","v":""},null,"",{"$nulls":3},"",0]
[null,{"$f":"IF(_xlfn.NUMBERVALUE(Feuil1!N467,\".\")<=0,\"\",Feuil1!C467)","v":""},{"$f":"IF(_xlfn.NUMBERVALUE(Feuil1!N467,\".\")<=0,\"\",Feuil1!Q467)","v":""},{"$f":"IF(_xlfn.NUMBERVALUE(Feuil1!N467,\".\")<=0,\"\",_xlfn.NUMBERVALUE(Feuil1!N467,\".\"))","v":""},null,"",{"$nulls":3},"",0]
[null,{"$f":"IF(_xlfn.NUMBERVALUE(Feuil1!N468,\".\")<=0,\"\",Feuil1!C468)","v":""},{"$f":"IF(_xlfn.NUMBERVALUE(Feuil1!N468,\".\")<=0,\"\",Feuil1!Q468)","v":""},{"$f":"IF(_xlfn.NUMBERVALUE(Feuil1!N468,\".\")<=0,\"\",_xlfn.NUMBERVALUE(Feuil1!N468,\".\"))","v":""},null,"",{"$nulls":3},"",0]
[null,{"$f":"IF(_xlfn.NUMBERVALUE(Feuil1!N469,\".\")<=0,\"\",Feuil1!C469)","v":""},{"$f":"IF(_xlfn.NUMBERVALUE(Feuil1!N469,\".\")<=0,\"\",Feuil1!Q469)","v":""},{"$f":"IF(_xlfn.NUMBERVALUE(Feuil1!N469,\".\")<=0,\"\",_xlfn.NUMBERVALUE(Feuil1!N469,\".\"))","v":""},null,"",{"$nulls":3},"",0]
[null,{"$f":"IF(_xlfn.NUMBERVALUE(Feuil1!N470,\".\")<=0,\"\",Feuil1!C470)","v":""},{"$f":"IF(_xlfn.NUMBERVALUE(Feuil1!N470,\".\")<=0,\"\",Feuil1!Q470)","v":""},{"$f":"IF(_xlfn.NUMBERVALUE(Feuil1!N470,\".\")<=0,\"\",_xlfn.NUMBERVALUE(Feuil1!N470,\".\"))","v":""},null,"",{"$nulls":3},"",0]
[null,{"$f":"IF(_xlfn.NUMBERVALUE(Feuil1!N471,\".\")<=0,\"\",Feuil1!C471)","v":""},{"$f":"IF(_xlfn.NUMBERVALUE(Feuil1!N471,\".\")<=0,\"\",Feuil1!Q471)","v":""},{"$f":"IF(_xlfn.NUMBERVALUE(Feuil1!N471,\".\")<=0,\"\",_xlfn.NUMBERVALUE(Feuil1!N471,\".\"))","v":""},null,"",{"$nulls":3},"",0]
[null,{"$f":"IF(_xlfn.NUMBERVALUE(Feuil1!N472,\".\")<=0,\"\",Feuil1!C472)","v":""},{"$f":"IF(_xlfn.NUMBERVALUE(Feuil1!N472,\".\")<=0,\"\",Feuil1!Q472)","v":""},{"$f":"IF(_xlfn.NUMBERVALUE(Feuil1!N472,\".\")<=0,\"\",_xlfn.NUMBERVALUE(Feuil1!N472,\".\"))","v":""},null,"",{"$nulls":3},"",0]
[null,{"$f":"IF(_xlfn.NUMBERVALUE(Feuil1!N473,\".\")<=0,\"\",Feuil1!C473)","v":""},{"$f":"IF(_xlfn.NUMBERVALUE(Feuil1!N473,\".\")<=0,\"\",Feuil1!Q473)","v":""},{"$f":"IF(_xlfn.NUMBERVALUE(Feuil1!N473,\".\")<=0,\"\",_xlfn.NUMBERVALUE(Feuil1!N473,\".\"))","v":""},null,"",{"$nulls":3},"",0]
[null,{"$f":"IF(_xlfn.NUMBERVALUE(Feuil1!N474,\".\")<=0,\"\",Feuil1!C474)","v":""},{"$f":"IF(_xlfn.NUMBERVALUE(Feuil1!N474,\".\")<=0,\"\",Feuil1!Q474)","v":""},{"$f":"IF(_xlfn.NUMBERVALUE(Feuil1!N474,\".\")<=0,\"\",_xlfn.NUMBERVALUE(Feuil1!N474,\".\"))","v":""},null,"",{"$nulls":3},"",0]
[null,{"$f":"IF(_xlfn.NUMBERVALUE(Feuil1!N475,\".\")<=0,\"\",Feuil1!C475)","v":""},{"$f":"IF(_xlfn.NUMBERVALUE(Feuil1!N475,\".\")<=0,\"\",Feuil1!Q475)","v":""},{"$f":"IF(_xlfn.NUMBERVALUE(Feuil1!N475,\".\")<=0,\"\",_xlfn.NUMBERVALUE(Feuil1!N475,\".\"))","v":""},null,"",{"$nulls":3},"",0]
[null,{"$f":"IF(_xlfn.NUMBERVALUE(Feuil1!N476,\".\")<=0,\"\",Feuil1!C476)","v":""},{"$f":"IF(_xlfn.NUMBERVALUE(Feuil1!N476,\".\")<=0,\"\",Feuil1!Q476)","v":""},{"$f":"IF(_xlfn.NUMBERVALUE(Feuil1!N476,\".\")<=0,\"\",_xlfn.NUMBERVALUE(Feuil1!N476,\".\"))","v":""},null,"",{"$nulls":3},"",0]
[null,{"$f":"IF(_xlfn.NUMBERVALUE(Feuil1!N477,\".\")<=0,\"\",Feuil1!C477)","v":""},{"$f":"IF(_xlfn.NUMBERVALUE(Feuil1!N477,\".\")<=0,\"\",Feuil1!Q477)","v":""},{"$f":"IF(_xlfn.NUMBERVALUE(Feuil1!N477,\".\")<=0,\"\",_xlfn.NUMBERVALUE(Feuil1!N477,\".\"))","v":""},null,"",{"$nulls":3},"",0]
[null,{"$f":"IF(_xlfn.NUMBERVALUE(Feuil1!N478,\".\")<=0,\"\",Feuil1!C478)","v":""},{"$f":"IF(_xlfn.NUMBERVALUE(Feuil1!N478,\".\")<=0,\"\",Feuil1!Q478)","v":""},{"$f":"IF(_xlfn.NUMBERVALUE(Feuil1!N478,\".\")<=0,\"\",_xlfn.NUMBERVALUE(Feuil1!N478,\".\"))","v":""},null,"",{"$nulls":3},"",0]
[null,{"$f":"IF(_xlfn.NUMBERVALUE(Feuil1!N479,\".\")<=0,\"\",Feuil1!C479)","v":""},{"$f":"IF(_xlfn.NUMBERVALUE(Feuil1!N479,\".\")<=0,\"\",Feuil1!Q479)","v":""},{"$f":"IF(_xlfn.NUMBERVALUE(Feuil1!N479,\".\")<=0,\"\",_xlfn.NUMBERVALUE(Feuil1!N479,\".\"))","v":""},null,"",{"$nulls":3},"",0]
[null,{"$f":"IF(_xlfn.NUMBERVALUE(Feuil1!N480,\".\")<=0,\"\",Feuil1!C480)","v":""},{"$f":"IF(_xlfn.NUMBERVALUE(Feuil1!N480,\".\")<=0,\"\",Feuil1!Q480)","v":""},{"$f":"IF(_xlfn.NUMBERVALUE(Feuil1!N480,\".\")<=0,\"\",_xlfn.NUMBERVALUE(Feuil1!N480,\".\"))","v":""},null,"",{"$nulls":3},"",0]
[null,{"$f":"IF(_xlfn.NUMBERVALUE(Feuil1!N481,\".\")<=0,\"\",Feuil1!C481)","v":""},{"$f":"IF(_xlfn.NUMBERVALUE(Feuil1!N481,\".\")<=0,\"\",Feuil1!Q481)","v":""},{"$f":"IF(_xlfn.NUMBERVALUE(Feuil1!N481,\".\")<=0,\"\",_xlfn.NUMBERVALUE(Feuil1!N481,\".\"))","v":""},null,"",{"$nulls":3},"",0]
[null,{"$f":"IF(_xlfn.NUMBERVALUE(Feuil1!N482,\".\")<=0,\"\",Feuil1!C482)","v":""},{"$f":"IF(_xlfn.NUMBERVALUE(Feuil1!N482,\".\")<=0,\"\",Feuil1!Q482)","v":""},{"$f":"IF(_xlfn.NUMBERVALUE(Feuil1!N482,\".\")<=0,\"\",_xlfn.NUMBERVALUE(Feuil1!N482,\".\"))","v":""},null,"",{"$nulls":3},"",0]
[null,{"$f":"IF(_xlfn.NUMBERVALUE(Feuil1!N483,\".\")<=0,\"\",Feuil1!C483)","v":""},{"$f":"IF(_xlfn.NUMBERVALUE(Feuil1!N483,\".\")<=0,\"\",Feuil1!Q483)","v":""},{"$f":"IF(_xlfn.NUMBERVALUE(Feuil1!N483,\".\")<=0,\"\",_xlfn.NUMBERVALUE(Feuil1!N483,\".\"))","v":""},null,"",{"$nulls":3},"",0]
[null,{"$f":"IF(_xlfn.NUMBERVALUE(Feuil1!N484,\".\")<=0,\"\",Feuil1!C484)","v":""},{"$f":"IF(_xlfn.NUMBERVALUE(Feuil1!N484,\".\")<=0,\"\",Feuil1!Q484)","v":""},{"$f":"IF(_xlfn.NUMBERVALUE(Feuil1!N484,\".\")<=0,\"\",_xlfn.NUMBERVALUE(Feuil1!N484,\".\"))","v":""},null,"",{"$nulls":3},"",0]
[null,{"$f":"IF(_xlfn.NUMBERVALUE(Feuil1!N485,\".\")<=0,\"\",Feuil1!C485)","v":""},{"$f":"IF(_xlfn.NUMBERVALUE(Feuil1!N485,\".\")<=0,\"\",Feuil1!Q485)","v":""},{"$f":"IF(_xlfn.NUMBERVALUE(Feuil1!N485,\".\")<=0,\"\",_xlfn.NUMBERVALUE(Feuil1!N485,\".\"))","v":""},null,"",{"$nulls":3},"",0]
[null,{"$f":"IF(_xlfn.NUMBERVALUE(Feuil1!N486,\".\")<=0,\"\",Feuil1!C486)","v":""},{"$f":"IF(_xlfn.NUMBERVALUE(Feuil1!N486,\".\")<=0,\"\",Feuil1!Q486)","v":""},{"$f":"IF(_xlfn.NUMBERVALUE(Feuil1!N486,\".\")<=0,\"\",_xlfn.NUMBERVALUE(Feuil1!N486,\".\"))","v":""},null,"",{"$nulls":3},"",0]
[null,{"$f":"IF(_xlfn.NUMBERVALUE(Feuil1!N487,\".\")<=0,\"\",Feuil1!C487)","v":""},{"$f":"IF(_xlfn.NUMBERVALUE(Feuil1!N487,\".\")<=0,\"\",Feuil1!Q487)","v":""},{"$f":"IF(_xlfn.NUMBERVALUE(Feuil1!N487,\".\")<=0,\"\",_xlfn.NUMBERVALUE(Feuil1!N487,\".\"))","v":""},null,"",{"$nulls":3},"",0]
[null,{"$f":"IF(_xlfn.NUMBERVALUE(Feuil1!N488,\".\")<=0,\"\",Feuil1!C488)","v":""},{"$f":"IF(_xlfn.NUMBERVALUE(Feuil1!N488,\".\")<=0,\"\",Feuil1!Q488)","v":""},{"$f":"IF(_xlfn.NUMBERVALUE(Feuil1!N488,\".\")<=0,\"\",_xlfn.NUMBERVALUE(Feuil1!N488,\".\"))","v":""},null,"",{"$nulls":3},"",0]
[null,{"$f":"IF(_xlfn.NUMBERVALUE(Feuil1!N489,\".\")<=0,\"\",Feuil1!C489)","v":""},{"$f":"IF(_xlfn.NUMBERVALUE(Feuil1!N489,\".\")<=0,\"\",Feuil1!Q489)","v":""},{"$f":"IF(_xlfn.NUMBERVALUE(Feuil1!N489,\".\")<=0,\"\",_xlfn.NUMBERVALUE(Feuil1!N489,\".\"))","v":""},null,"",{"$nulls":3},"",0]
[null,{"$f":"IF(_xlfn.NUMBERVALUE(Feuil1!N490,\".\")<=0,\"\",Feuil1!C490)","v":""},{"$f":"IF(_xlfn.NUMBERVALUE(Feuil1!N490,\".\")<=0,\"\",Feuil1!Q490)","v":""},{"$f":"IF(_xlfn.NUMBERVALUE(Feuil1!N490,\".\")<=0,\"\",_xlfn.NUMBERVALUE(Feuil1!N490,\".\"))","v":""},null,"",{"$nulls":3},"",0]
[null,{"$f":"IF(_xlfn.NUMBERVALUE(Feuil1!N491,\".\")<=0,\"\",Feuil1!C491)","v":""},{"$f":"IF(_xlfn.NUMBERVALUE(Feuil1!N491,\".\")<=0,\"\",Feuil1!Q491)","v":""},{"$f":"IF(_xlfn.NUMBERVALUE(Feuil1!N491,\".\")<=0,\"\",_xlfn.NUMBERVALUE(Feuil1!N491,\".\"))","v":""},null,"",{"$nulls":3},"",0]
[null,{"$f":"IF(_xlfn.NUMBERVALUE(Feuil1!N492,\".\")<=0,\"\",Feuil1!C492)","v":""},{"$f":"IF(_xlfn.NUMBERVALUE(Feuil1!N492,\".\")<=0,\"\",Feuil1!Q492)","v":""},{"$f":"IF(_xlfn.NUMBERVALUE(Feuil1!N492,\".\")<=0,\"\",_xlfn.NUMBERVALUE(Feuil1!N492,\".\"))","v":""},null,"",{"$nulls":3},"",0]
[null,{"$f":"IF(_xlfn.NUMBERVALUE(Feuil1!N493,\".\")<=0,\"\",Feuil1!C493)","v":""},{"$f":"IF(_xlfn.NUMBERVALUE(Feuil1!N493,\".\")<=0,\"\",Feuil1!Q493)","v":""},{"$f":"IF(_xlfn.NUMBERVALUE(Feuil1!N493,\".\")<=0,\"\",_xlfn.NUMBERVALUE(Feuil1!N493,\".\"))","v":""},null,"",{"$nulls":3},"",0]
[null,{"$f":"IF(_xlfn.NUMBERVALUE(Feuil1!N494,\".\")<=0,\"\",Feuil1!C494)","v":""},{"$f":"IF(_xlfn.NUMBERVALUE(Feuil1!N494,\".\")<=0,\"\",Feuil1!Q494)","v":""},{"$f":"IF(_xlfn.NUMBERVALUE(Feuil1!N494,\".\")<=0,\"\",_xlfn.NUMBERVALUE(Feuil1!N494,\".\"))","v":""},null,"",{"$nulls":3},"",0]
[null,{"$f":"IF(_xlfn.NUMBERVALUE(Feuil1!N495,\".\")<=0,\"\",Feuil1!C495)","v":""},{"$f":"IF(_xlfn.NUMBERVALUE(Feuil1!N495,\".\")<=0,\"\",Feuil1!Q495)","v":""},{"$f":"IF(_xlfn.NUMBERVALUE(Feuil1!N495,\".\")<=0,\"\",_xlfn.NUMBERVALUE(Feuil1!N495,\".\"))","v":""},null,"",{"$nulls":3},"",0]
[null,{"$f":"IF(_xlfn.NUMBERVALUE(Feuil1!N496,\".\")<=0,\"\",Feuil1!C496)","v":""},{"$f":"IF(_xlfn.NUMBERVALUE(Feuil1!N496,\".\")<=0,\"\",Feuil1!Q496)","v":""},{"$f":"IF(_xlfn.NUMBERVALUE(Feuil1!N496,\".\")<=0,\"\",_xlfn.NUMBERVALUE(Feuil1!N496,\".\"))","v":""},null,"",{"$nulls":3},"",0]
[null,{"$f":"IF(_xlfn.NUMBERVALUE(Feuil1!N497,\".\")<=0,\"\",Feuil1!C497)","v":""},{"$f":"IF(_xlfn.NUMBERVALUE(Feuil1!N497,\".\")<=0,\"\",Feuil1!Q497)","v":""},{"$f":"IF(_xlfn.NUMBERVALUE(Feuil1!N497,\".\")<=0,\"\",_xlfn.NUMBERVALUE(Feuil1!N497,\".\"))","v":""},null,"",{"$nulls":3},"",0]
[null,{"$f":"IF(_xlfn.NUMBERVALUE(Feuil1!N498,\".\")<=0,\"\",Feuil1!C498)","v":""},{"$f":"IF(_xlfn.NUMBERVALUE(Feuil1!N498,\".\")<=0,\"\",Feuil1!Q498)","v":""},{"$f":"IF(_xlfn.NUMBERVALUE(Feuil1!N498,\".\")<=0,\"\",_xlfn.NUMBERVALUE(Feuil1!N498,\".\"))","v":""},null,"",{"$nulls":3},"",0]
[null,{"$f":"IF(_xlfn.NUMBERVALUE(Feuil1!N499,\".\")<=0,\"\",Feuil1!C499)","v":""},{"$f":"IF(_xlfn.NUMBERVALUE(Feuil1!N499,\".\")<=0,\"\",Feuil1!Q499)","v":""},{"$f":"IF(_xlfn.NUMBERVALUE(Feuil1!N499,\".\")<=0,\"\",_xlfn.NUMBERVALUE(Feuil1!N499,\".\"))","v":""},null,"",{"$nulls":3},"",0]
[null,{"$f":"IF(_xlfn.NUMBERVALUE(Feuil1!N500,\".\")<=0,\"\",Feuil1!C500)","v":""},{"$f":"IF(_xlfn.NUMBERVALUE(Feuil1!N500,\".\")<=0,\"\",Feuil1!Q500)","v":""},{"$f":"IF(_xlfn.NUMBERVALUE(Feuil1!N500,\".\")<=0,\"\",_xlfn.NUMBERVALUE(Feuil1!N500,\".\"))","v":""},null,"",{"$nulls":3},"",0]
[null,{"$f":"IF(_xlfn.NUMBERVALUE(Feuil1!N501,\".\")<=0,\"\",Feuil1!C501)","v":""},{"$f":"IF(_xlfn.NUMBERVALUE(Feuil1!N501,\".\")<=0,\"\",Feuil1!Q501)","v":""},{"$f":"IF(_xlfn.NUMBERVALUE(Feuil1!N501,\".\")<=0,\"\",_xlfn.NUMBERVALUE(Feuil1!N501,\".\"))","v":""},null,"",{"$nulls":3},"",0]
[null,{"$f":"IF(_xlfn.NUMBERVALUE(Feuil1!N502,\".\")<=0,\"\",Feuil1!C502)","v":""},{"$f":"IF(_xlfn.NUMBERVALUE(Feuil1!N502,\".\")<=0,\"\",Feuil1!Q502)","v":""},{"$f":"IF(_xlfn.NUMBERVALUE(Feuil1!N502,\".\")<=0,\"\",_xlfn.NUMBERVALUE(Feuil1!N502,\".\"))","v":""},null,"",{"$nulls":3},"",0]
[{"$nulls":5},"",{"$nulls":3},"",0]
[{"$nulls":5},"",{"$nulls":3},""]
[{"$nulls":5},"",{"$nulls":3},""]
[{"$nulls":5},"",{"$nulls":3},""]
[{"$nulls":5},"",{"$nulls":3},""]
[{"$nulls":5},"",{"$nulls":3},""]
[{"$nulls":5},"",{"$nulls":3},""]
[{"$nulls":5},"",{"$nulls":3},""]
[{"$nulls":5},"",{"$nulls":3},""]
[{"$nulls":5},"",{"$nulls":3},""]
{"$rows_empty":19}
["DO NOT TOUCH",{"$nulls":4},"Missing","Normal wear & tear"]
["DO NOT TOUCH",{"$nulls":4},"Missing","Misuse/mishandeling"]
["DO NOT TOUCH",{"$nulls":4},"Missing","FOD"]
["DO NOT TOUCH",{"$nulls":4},"Missing","Mandatory Replacement"]
["DO NOT TOUCH",{"$nulls":4},"Bended","Normal wear & tear"]
["DO NOT TOUCH",{"$nulls":4},"Broken","Normal wear & tear"]
["DO NOT TOUCH",{"$nulls":4},"Burnt","Normal wear & tear"]
["DO NOT TOUCH",{"$nulls":4},"Chafing","Normal wear & tear"]
["DO NOT TOUCH",{"$nulls":4},"Corroded","Normal wear & tear"]
["DO NOT TOUCH",{"$nulls":4},"Cracked","Normal wear & tear"]
["DO NOT TOUCH",{"$nulls":4},"Defective","Normal wear & tear"]
["DO NOT TOUCH",{"$nulls":4},"Deformed","Normal wear & tear"]
["DO NOT TOUCH",{"$nulls":4},"Dimension Failed","Normal wear & tear"]
["DO NOT TOUCH",{"$nulls":4},"Dirty","Normal wear & tear"]
["DO NOT TOUCH",{"$nulls":4},"Failed test","Normal wear & tear"]
["DO NOT TOUCH",{"$nulls":4},"Faulty","Normal wear & tear"]
["DO NOT TOUCH",{"$nulls":4},"Frayed","Normal wear & tear"]
["DO NOT TOUCH",{"$nulls":4},"Mandatory replacement","Normal wear & tear"]
["DO NOT TOUCH",{"$nulls":4},"Perforated","Normal wear & tear"]
["DO NOT TOUCH",{"$nulls":4},"Preventive replacement","Normal wear & tear"]
["DO NOT TOUCH",{"$nulls":4},"Punctured","Normal wear & tear"]
["DO NOT TOUCH",{"$nulls":4},"Rounded","Normal wear & tear"]
["DO NOT TOUCH",{"$nulls":4},"scratches","Normal wear & tear"]
["DO NOT TOUCH",{"$nulls":4},"Torn","Normal wear & tear"]
["DO NOT TOUCH",{"$nulls":4},"Worn off","Normal wear & tear"]
["DO NOT TOUCH",{"$nulls":4},"Wrong Part","Normal wear & tear"]
["DO NOT TOUCH",{"$nulls":4},"Bended","Misuse/mishandeling"]
["DO NOT TOUCH",{"$nulls":4},"Broken","Misuse/mishandeling"]
["DO NOT TOUCH",{"$nulls":4},"Burnt","Misuse/mishandeling"]
["DO NOT TOUCH",{"$nulls":4},"Chafing","Misuse/mishandeling"]
["DO NOT TOUCH",{"$nulls":4},"Corroded","Misuse/mishandeling"]
["DO NOT TOUCH",{"$nulls":4},"Cracked","Misuse/mishandeling"]
["DO NOT TOUCH",{"$nulls":4},"Defective","Misuse/mishandeling"]
["DO NOT TOUCH",{"$nulls":4},"Deformed","Misuse/mishandeling"]
["DO NOT TOUCH",{"$nulls":4},"Dimension Failed","Misuse/mishandeling"]
["DO NOT TOUCH",{"$nulls":4},"Dirty","Misuse/mishandeling"]
["DO NOT TOUCH",{"$nulls":4},"Failed test","Misuse/mishandeling"]
["DO NOT TOUCH",{"$nulls":4},"Faulty","Misuse/mishandeling"]
["DO NOT TOUCH",{"$nulls":4},"Frayed","Misuse/mishandeling"]
["DO NOT TOUCH",{"$nulls":4},"Mandatory replacement","Misuse/mishandeling"]
["DO NOT TOUCH",{"$nulls":4},"Perforated","Misuse/mishandeling"]
["DO NOT TOUCH",{"$nulls":4},"Preventive replacement","Misuse/mishandeling"]
["DO NOT TOUCH",{"$nulls":4},"Punctured","Misuse/mishandeling"]
["DO NOT TOUCH",{"$nulls":4},"Rounded","Misuse/mishandeling"]
["DO NOT TOUCH",{"$nulls":4},"scratches","Misuse/mishandeling"]
["DO NOT TOUCH",{"$nulls":4},"Torn","Misuse/mishandeling"]
["DO NOT TOUCH",{"$nulls":4},"Worn off","Misuse/mishandeling"]
["DO NOT TOUCH",{"$nulls":4},"Wrong Part","Misuse/mishandeling"]
["DO NOT TOUCH",{"$nulls":4},"Bended","FOD"]
["DO NOT TOUCH",{"$nulls":4},"Broken","FOD"]
["DO NOT TOUCH",{"$nulls":4},"Burnt","FOD"]
["DO NOT TOUCH",{"$nulls":4},"Chafing","FOD"]
["DO NOT TOUCH",{"$nulls":4},"Corroded","FOD"]
["DO NOT TOUCH",{"$nulls":4},"Cracked","FOD"]
["DO NOT TOUCH",{"$nulls":4},"Defective","FOD"]
["DO NOT TOUCH",{"$nulls":4},"Deformed","FOD"]
["DO NOT TOUCH",{"$nulls":4},"Dimension Failed","FOD"]
["DO NOT TOUCH",{"$nulls":4},"Dirty","FOD"]
["DO NOT TOUCH",{"$nulls":4},"Failed test","FOD"]
["DO NOT TOUCH",{"$nulls":4},"Faulty","FOD"]
["DO NOT TOUCH",{"$nulls":4},"Frayed","FOD"]
["DO NOT TOUCH",{"$nulls":4},"Mandatory replacement","FOD"]
["DO NOT TOUCH",{"$nulls":4},"Perforated","FOD"]
["DO NOT TOUCH",{"$nulls":4},"Preventive replacement","FOD"]
["DO NOT TOUCH",{"$nulls":4},"Punctured","FOD"]
["DO NOT TOUCH",{"$nulls":4},"Rounded","FOD"]
["DO NOT TOUCH",{"$nulls":4},"scratches","FOD"]
["DO NOT TOUCH",{"$nulls":4},"Torn","FOD"]
["DO NOT TOUCH",{"$nulls":4},"Worn off","FOD"]
["DO NOT TOUCH",{"$nulls":4},"Wrong Part","FOD"]
["DO NOT TOUCH",{"$nulls":4},"Bended","Mandatory Replacement"]
["DO NOT TOUCH",{"$nulls":4},"Broken","Mandatory Replacement"]
["DO NOT TOUCH",{"$nulls":4},"Burnt","Mandatory Replacement"]
["DO NOT TOUCH",{"$nulls":4},"Chafing","Mandatory Replacement"]
["DO NOT TOUCH",{"$nulls":4},"Corroded","Mandatory Replacement"]
["DO NOT TOUCH",{"$nulls":4},"Cracked","Mandatory Replacement"]
["DO NOT TOUCH",{"$nulls":4},"Defective","Mandatory Replacement"]
["DO NOT TOUCH",{"$nulls":4},"Deformed","Mandatory Replacement"]
["DO NOT TOUCH",{"$nulls":4},"Dimension Failed","Mandatory Replacement"]
["DO NOT TOUCH",{"$nulls":4},"Dirty","Mandatory Replacement"]
["DO NOT TOUCH",{"$nulls":4},"Failed test","Mandatory Replacement"]
["DO NOT TOUCH",{"$nulls":4},"Faulty","Mandatory Replacement"]
["DO NOT TOUCH",{"$nulls":4},"Frayed","Mandatory Replacement"]
["DO NOT TOUCH",{"$nulls":4},"Mandatory replacement","Mandatory Replacement"]
["DO NOT TOUCH",{"$nulls":4},"Perforated","Mandatory Replacement"]
["DO NOT TOUCH",{"$nulls":4},"Preventive replacement","Mandatory Replacement"]
["DO NOT TOUCH",{"$nulls":4},"Punctured","Mandatory Replacement"]
["DO NOT TOUCH",{"$nulls":4},"Rounded","Mandatory Replacement"]
["DO NOT TOUCH",{"$nulls":4},"scratches","Mandatory Replacement"]
["DO NOT TOUCH",{"$nulls":4},"Torn","Mandatory Replacement"]
["DO NOT TOUCH",{"$nulls":4},"Worn off","Mandatory Replacement"]
["DO NOT TOUCH",{"$nulls":4},"Wrong Part","Mandatory Replacement"]
["DO NOT TOUCH",{"$nulls":4},"Bended","SUP"]
["DO NOT TOUCH",{"$nulls":4},"Broken","SUP"]
["DO NOT TOUCH",{"$nulls":4},"Burnt","SUP"]
["DO NOT TOUCH",{"$nulls":4},"Chafing","SUP"]
["DO NOT TOUCH",{"$nulls":4},"Corroded","SUP"]
["DO NOT TOUCH",{"$nulls":4},"Cracked","SUP"]
["DO NOT TOUCH",{"$nulls":4},"Defective","SUP"]
["DO NOT TOUCH",{"$nulls":4},"Deformed","SUP"]
["DO NOT TOUCH",{"$nulls":4},"Dimension Failed","SUP"]
["DO NOT TOUCH",{"$nulls":4},"Dirty","SUP"]
["DO NOT TOUCH",{"$nulls":4},"Failed test","SUP"]
["DO NOT TOUCH",{"$nulls":4},"Faulty","SUP"]
["DO NOT TOUCH",{"$nulls":4},"Frayed","SUP"]
["DO NOT TOUCH",{"$nulls":4},"Mandatory replacement","SUP"]
["DO NOT TOUCH",{"$nulls":4},"Perforated","SUP"]
["DO NOT TOUCH",{"$nulls":4},"Preventive replacement","SUP"]
["DO NOT TOUCH",{"$nulls":4},"Punctured","SUP"]
["DO NOT TOUCH",{"$nulls":4},"Rounded","SUP"]
["DO NOT TOUCH",{"$nulls":4},"scratches","SUP"]
["DO NOT TOUCH",{"$nulls":4},"Torn","SUP"]
["DO NOT TOUCH",{"$nulls":4},"Worn off","SUP"]
["DO NOT TOUCH",{"$nulls":4},"Wrong Part","SUP"]
["DO NOT TOUCH",{"$nulls":4},"Incorrect / Suspected unapproved","SUP"]

{"sheet":"General Findings","index":2,"n_rows":6,"n_cols":1,"rows_kept":6}
["ACTUATOR FAILED TORQUE TEST"]
["ACTUATOR FAILED ELECTRICAL TEST"]
["CIRCUIT BREAKER FAILED"]
["PARTS DAMAGED TO BE REPLACED"]
["PART MISSING"]
["SUSPECTED UNAPPROVED PARTS"]

{"sheet":"parts finding","index":3,"n_rows":24,"n_cols":1,"rows_kept":24}
["Bended"]
["Broken"]
["Burnt"]
["Chafing"]
["Corroded"]
["Cracked"]
["Defective"]
["Deformed"]
["Dimension Failed"]
["Dirty"]
["Failed test"]
["Faulty"]
["Frayed"]
["Incorrect / Suspected unapproved"]
["Mandatory replacement"]
["Missing"]
["Perforated"]
["Preventive replacement"]
["Punctured"]
["Rounded"]
["scratches"]
["Torn"]
["Worn off"]
["Wrong Part"]

{"sheet":"TCD NW&T","index":4,"n_rows":100,"n_cols":5,"rows_kept":100}
[]
[]
["Source of default","(Plusieurs éléments)"]
["Nature of finding","(Plusieurs éléments)"]
[]
["Étiquettes de lignes","Somme de Qty"]
["23351AC080LE",1,null,null,{"$f":"IF(VLOOKUP(A7,'Finding report'!$B:$F,5,0)=\"Mandatory replacement\",CONCATENATE(VLOOKUP(A7,'Finding report'!$B:$C,2,0),\" PN \",IF(RIGHT(A7,1)=\"R\",LEFT(A7,LEN(A7)-1),A7),\" Qty \",B7,\" to be replaced due to mandatory replacement as per CMM\"),CONCATENATE(VLOOKUP(A7,'Finding report'!$B:$C,2,0),\" PN \",IF(RIGHT(A7,1)=\"R\",LEFT(A7,LEN(A7)-1),A7),\" Qty \",B7,\" Found \",VLOOKUP(A7,'Finding report'!$B:$F,5,0),\" due to normal wear and tear\"))","v":"LOCK PLATE PN 23351AC080LE Qty 1 Found Broken due to normal wear and tear"}]
["4136290006R",1,null,null,{"$f":"IF(VLOOKUP(A8,'Finding report'!$B:$F,5,0)=\"Mandatory replacement\",CONCATENATE(VLOOKUP(A8,'Finding report'!$B:$C,2,0),\" PN \",IF(RIGHT(A8,1)=\"R\",LEFT(A8,LEN(A8)-1),A8),\" Qty \",B8,\" to be replaced due to mandatory replacement as per CMM\"),CONCATENATE(VLOOKUP(A8,'Finding report'!$B:$C,2,0),\" PN \",IF(RIGHT(A8,1)=\"R\",LEFT(A8,LEN(A8)-1),A8),\" Qty \",B8,\" Found \",VLOOKUP(A8,'Finding report'!$B:$F,5,0),\" due to normal wear and tear\"))","v":"ACTUATOR PN 4136290006 Qty 1 Found Failed test due to normal wear and tear"}]
["ET3-200-014-09",1,null,null,{"$f":"IF(VLOOKUP(A9,'Finding report'!$B:$F,5,0)=\"Mandatory replacement\",CONCATENATE(VLOOKUP(A9,'Finding report'!$B:$C,2,0),\" PN \",IF(RIGHT(A9,1)=\"R\",LEFT(A9,LEN(A9)-1),A9),\" Qty \",B9,\" to be replaced due to mandatory replacement as per CMM\"),CONCATENATE(VLOOKUP(A9,'Finding report'!$B:$C,2,0),\" PN \",IF(RIGHT(A9,1)=\"R\",LEFT(A9,LEN(A9)-1),A9),\" Qty \",B9,\" Found \",VLOOKUP(A9,'Finding report'!$B:$F,5,0),\" due to normal wear and tear\"))","v":"LABEL PN ET3-200-014-09 Qty 1 Found Chafing due to normal wear and tear"}]
["MS21083N5",1,null,null,{"$f":"IF(VLOOKUP(A10,'Finding report'!$B:$F,5,0)=\"Mandatory replacement\",CONCATENATE(VLOOKUP(A10,'Finding report'!$B:$C,2,0),\" PN \",IF(RIGHT(A10,1)=\"R\",LEFT(A10,LEN(A10)-1),A10),\" Qty \",B10,\" to be replaced due to mandatory replacement as per CMM\"),CONCATENATE(VLOOKUP(A10,'Finding report'!$B:$C,2,0),\" PN \",IF(RIGHT(A10,1)=\"R\",LEFT(A10,LEN(A10)-1),A10),\" Qty \",B10,\" Found \",VLOOKUP(A10,'Finding report'!$B:$F,5,0),\" due to normal wear and tear\"))","v":"NUT . 52NTE054 PN MS21083N5 Qty 1 Found Broken due to normal wear and tear"}]
["NAS679A3",1,null,null,{"$f":"IF(VLOOKUP(A11,'Finding report'!$B:$F,5,0)=\"Mandatory replacement\",CONCATENATE(VLOOKUP(A11,'Finding report'!$B:$C,2,0),\" PN \",IF(RIGHT(A11,1)=\"R\",LEFT(A11,LEN(A11)-1),A11),\" Qty \",B11,\" to be replaced due to mandatory replacement as per CMM\"),CONCATENATE(VLOOKUP(A11,'Finding report'!$B:$C,2,0),\" PN \",IF(RIGHT(A11,1)=\"R\",LEFT(A11,LEN(A11)-1),A11),\" Qty \",B11,\" Found \",VLOOKUP(A11,'Finding report'!$B:$F,5,0),\" due to normal wear and tear\"))","v":"NUT PN NAS679A3 Qty 1 Found Broken due to normal wear and tear"}]
["SCN900-005-01",1,null,null,{"$f":"IF(VLOOKUP(A12,'Finding report'!$B:$F,5,0)=\"Mandatory replacement\",CONCATENATE(VLOOKUP(A12,'Finding report'!$B:$C,2,0),\" PN \",IF(RIGHT(A12,1)=\"R\",LEFT(A12,LEN(A12)-1),A12),\" Qty \",B12,\" to be replaced due to mandatory replacement as per CMM\"),CONCATENATE(VLOOKUP(A12,'Finding report'!$B:$C,2,0),\" PN \",IF(RIGHT(A12,1)=\"R\",LEFT(A12,LEN(A12)-1),A12),\" Qty \",B12,\" Found \",VLOOKUP(A12,'Finding report'!$B:$F,5,0),\" due to normal wear and tear\"))","v":"LABEL, HIGH VOLTAGE PN SCN900-005-01 Qty 1 Found Cracked due to normal wear and tear"}]
["TAAI3-427030-01",1,null,null,{"$f":"IF(VLOOKUP(A13,'Finding report'!$B:$F,5,0)=\"Mandatory replacement\",CONCATENATE(VLOOKUP(A13,'Finding report'!$B:$C,2,0),\" PN \",IF(RIGHT(A13,1)=\"R\",LEFT(A13,LEN(A13)-1),A13),\" Qty \",B13,\" to be replaced due to mandatory replacement as per CMM\"),CONCATENATE(VLOOKUP(A13,'Finding report'!$B:$C,2,0),\" PN \",IF(RIGHT(A13,1)=\"R\",LEFT(A13,LEN(A13)-1),A13),\" Qty \",B13,\" Found \",VLOOKUP(A13,'Finding report'!$B:$F,5,0),\" due to normal wear and tear\"))","v":"BONDING BRAID PN TAAI3-427030-01 Qty 1 Found Broken due to normal wear and tear"}]
["(vide)",{"$nulls":3},{"$f":"IF(VLOOKUP(A14,'Finding report'!$B:$F,5,0)=\"Mandatory replacement\",CONCATENATE(VLOOKUP(A14,'Finding report'!$B:$C,2,0),\" PN \",IF(RIGHT(A14,1)=\"R\",LEFT(A14,LEN(A14)-1),A14),\" Qty \",B14,\" to be replaced due to mandatory replacement as per CMM\"),CONCATENATE(VLOOKUP(A14,'Finding report'!$B:$C,2,0),\" PN \",IF(RIGHT(A14,1)=\"R\",LEFT(A14,LEN(A14)-1),A14),\" Qty \",B14,\" Found \",VLOOKUP(A14,'Finding report'!$B:$F,5,0),\" due to normal wear and tear\"))","v":{"$error":"#N/A"}}]
["E0043-4B0",1,null,null,{"$f":"IF(VLOOKUP(A15,'Finding report'!$B:$F,5,0)=\"Mandatory replacement\",CONCATENATE(VLOOKUP(A15,'Finding report'!$B:$C,2,0),\" PN \",IF(RIGHT(A15,1)=\"R\",LEFT(A15,LEN(A15)-1),A15),\" Qty \",B15,\" to be replaced due to mandatory replacement as per CMM\"),CONCATENATE(VLOOKUP(A15,'Finding report'!$B:$C,2,0),\" PN \",IF(RIGHT(A15,1)=\"R\",LEFT(A15,LEN(A15)-1),A15),\" Qty \",B15,\" Found \",VLOOKUP(A15,'Finding report'!$B:$F,5,0),\" due to normal wear and tear\"))","v":"CLAMP PN E0043-4B0 Qty 1 Found Broken due to normal wear and tear"}]
["NSA935401-03",6,null,null,{"$f":"IF(VLOOKUP(A16,'Finding report'!$B:$F,5,0)=\"Mandatory replacement\",CONCATENATE(VLOOKUP(A16,'Finding report'!$B:$C,2,0),\" PN \",IF(RIGHT(A16,1)=\"R\",LEFT(A16,LEN(A16)-1),A16),\" Qty \",B16,\" to be replaced due to mandatory replacement as per CMM\"),CONCATENATE(VLOOKUP(A16,'Finding report'!$B:$C,2,0),\" PN \",IF(RIGHT(A16,1)=\"R\",LEFT(A16,LEN(A16)-1),A16),\" Qty \",B16,\" Found \",VLOOKUP(A16,'Finding report'!$B:$F,5,0),\" due to normal wear and tear\"))","v":"HOLDING CLAMP PN NSA935401-03 Qty 6 Found Corroded due to normal wear and tear"}]
["NSA938150-03-12",1,null,null,{"$f":"IF(VLOOKUP(A17,'Finding report'!$B:$F,5,0)=\"Mandatory replacement\",CONCATENATE(VLOOKUP(A17,'Finding report'!$B:$C,2,0),\" PN \",IF(RIGHT(A17,1)=\"R\",LEFT(A17,LEN(A17)-1),A17),\" Qty \",B17,\" to be replaced due to mandatory replacement as per CMM\"),CONCATENATE(VLOOKUP(A17,'Finding report'!$B:$C,2,0),\" PN \",IF(RIGHT(A17,1)=\"R\",LEFT(A17,LEN(A17)-1),A17),\" Qty \",B17,\" Found \",VLOOKUP(A17,'Finding report'!$B:$F,5,0),\" due to normal wear and tear\"))","v":"ADAPTER, CABLE CLAMP PN NSA938150-03-12 Qty 1 Found Broken due to normal wear and tear"}]
["8526-1348",3,null,null,{"$f":"IF(VLOOKUP(A18,'Finding report'!$B:$F,5,0)=\"Mandatory replacement\",CONCATENATE(VLOOKUP(A18,'Finding report'!$B:$C,2,0),\" PN \",IF(RIGHT(A18,1)=\"R\",LEFT(A18,LEN(A18)-1),A18),\" Qty \",B18,\" to be replaced due to mandatory replacement as per CMM\"),CONCATENATE(VLOOKUP(A18,'Finding report'!$B:$C,2,0),\" PN \",IF(RIGHT(A18,1)=\"R\",LEFT(A18,LEN(A18)-1),A18),\" Qty \",B18,\" Found \",VLOOKUP(A18,'Finding report'!$B:$F,5,0),\" due to normal wear and tear\"))","v":"CONTACT PN 8526-1348 Qty 3 Found Missing due to normal wear and tear"}]
["NSA935401-05",3,null,null,{"$f":"IF(VLOOKUP(A19,'Finding report'!$B:$F,5,0)=\"Mandatory replacement\",CONCATENATE(VLOOKUP(A19,'Finding report'!$B:$C,2,0),\" PN \",IF(RIGHT(A19,1)=\"R\",LEFT(A19,LEN(A19)-1),A19),\" Qty \",B19,\" to be replaced due to mandatory replacement as per CMM\"),CONCATENATE(VLOOKUP(A19,'Finding report'!$B:$C,2,0),\" PN \",IF(RIGHT(A19,1)=\"R\",LEFT(A19,LEN(A19)-1),A19),\" Qty \",B19,\" Found \",VLOOKUP(A19,'Finding report'!$B:$F,5,0),\" due to normal wear and tear\"))","v":"TY-RAP PN NSA935401-05 Qty 3 Found Perforated due to normal wear and tear"}]
["Total général",21,null,null,{"$f":"IF(VLOOKUP(A20,'Finding report'!$B:$F,5,0)=\"Mandatory replacement\",CONCATENATE(VLOOKUP(A20,'Finding report'!$B:$C,2,0),\" PN \",IF(RIGHT(A20,1)=\"R\",LEFT(A20,LEN(A20)-1),A20),\" Qty \",B20,\" to be replaced due to mandatory replacement as per CMM\"),CONCATENATE(VLOOKUP(A20,'Finding report'!$B:$C,2,0),\" PN \",IF(RIGHT(A20,1)=\"R\",LEFT(A20,LEN(A20)-1),A20),\" Qty \",B20,\" Found \",VLOOKUP(A20,'Finding report'!$B:$F,5,0),\" due to normal wear and tear\"))","v":{"$error":"#N/A"}}]
[{"$nulls":4},{"$f":"IF(VLOOKUP(A21,'Finding report'!$B:$F,5,0)=\"Mandatory replacement\",CONCATENATE(VLOOKUP(A21,'Finding report'!$B:$C,2,0),\" PN \",IF(RIGHT(A21,1)=\"R\",LEFT(A21,LEN(A21)-1),A21),\" Qty \",B21,\" to be replaced due to mandatory replacement as per CMM\"),CONCATENATE(VLOOKUP(A21,'Finding report'!$B:$C,2,0),\" PN \",IF(RIGHT(A21,1)=\"R\",LEFT(A21,LEN(A21)-1),A21),\" Qty \",B21,\" Found \",VLOOKUP(A21,'Finding report'!$B:$F,5,0),\" due to normal wear and tear\"))","v":{"$error":"#N/A"}}]
[{"$nulls":4},{"$f":"IF(VLOOKUP(A22,'Finding report'!$B:$F,5,0)=\"Mandatory replacement\",CONCATENATE(VLOOKUP(A22,'Finding report'!$B:$C,2,0),\" PN \",IF(RIGHT(A22,1)=\"R\",LEFT(A22,LEN(A22)-1),A22),\" Qty \",B22,\" to be replaced due to mandatory replacement as per CMM\"),CONCATENATE(VLOOKUP(A22,'Finding report'!$B:$C,2,0),\" PN \",IF(RIGHT(A22,1)=\"R\",LEFT(A22,LEN(A22)-1),A22),\" Qty \",B22,\" Found \",VLOOKUP(A22,'Finding report'!$B:$F,5,0),\" due to normal wear and tear\"))","v":{"$error":"#N/A"}}]
[{"$nulls":4},{"$f":"IF(VLOOKUP(A23,'Finding report'!$B:$F,5,0)=\"Mandatory replacement\",CONCATENATE(VLOOKUP(A23,'Finding report'!$B:$C,2,0),\" PN \",IF(RIGHT(A23,1)=\"R\",LEFT(A23,LEN(A23)-1),A23),\" Qty \",B23,\" to be replaced due to mandatory replacement as per CMM\"),CONCATENATE(VLOOKUP(A23,'Finding report'!$B:$C,2,0),\" PN \",IF(RIGHT(A23,1)=\"R\",LEFT(A23,LEN(A23)-1),A23),\" Qty \",B23,\" Found \",VLOOKUP(A23,'Finding report'!$B:$F,5,0),\" due to normal wear and tear\"))","v":{"$error":"#N/A"}}]
[{"$nulls":4},{"$f":"IF(VLOOKUP(A24,'Finding report'!$B:$F,5,0)=\"Mandatory replacement\",CONCATENATE(VLOOKUP(A24,'Finding report'!$B:$C,2,0),\" PN \",IF(RIGHT(A24,1)=\"R\",LEFT(A24,LEN(A24)-1),A24),\" Qty \",B24,\" to be replaced due to mandatory replacement as per CMM\"),CONCATENATE(VLOOKUP(A24,'Finding report'!$B:$C,2,0),\" PN \",IF(RIGHT(A24,1)=\"R\",LEFT(A24,LEN(A24)-1),A24),\" Qty \",B24,\" Found \",VLOOKUP(A24,'Finding report'!$B:$F,5,0),\" due to normal wear and tear\"))","v":{"$error":"#N/A"}}]
[{"$nulls":4},{"$f":"IF(VLOOKUP(A25,'Finding report'!$B:$F,5,0)=\"Mandatory replacement\",CONCATENATE(VLOOKUP(A25,'Finding report'!$B:$C,2,0),\" PN \",IF(RIGHT(A25,1)=\"R\",LEFT(A25,LEN(A25)-1),A25),\" Qty \",B25,\" to be replaced due to mandatory replacement as per CMM\"),CONCATENATE(VLOOKUP(A25,'Finding report'!$B:$C,2,0),\" PN \",IF(RIGHT(A25,1)=\"R\",LEFT(A25,LEN(A25)-1),A25),\" Qty \",B25,\" Found \",VLOOKUP(A25,'Finding report'!$B:$F,5,0),\" due to normal wear and tear\"))","v":{"$error":"#N/A"}}]
[{"$nulls":4},{"$f":"IF(VLOOKUP(A26,'Finding report'!$B:$F,5,0)=\"Mandatory replacement\",CONCATENATE(VLOOKUP(A26,'Finding report'!$B:$C,2,0),\" PN \",IF(RIGHT(A26,1)=\"R\",LEFT(A26,LEN(A26)-1),A26),\" Qty \",B26,\" to be replaced due to mandatory replacement as per CMM\"),CONCATENATE(VLOOKUP(A26,'Finding report'!$B:$C,2,0),\" PN \",IF(RIGHT(A26,1)=\"R\",LEFT(A26,LEN(A26)-1),A26),\" Qty \",B26,\" Found \",VLOOKUP(A26,'Finding report'!$B:$F,5,0),\" due to normal wear and tear\"))","v":{"$error":"#N/A"}}]
[{"$nulls":4},{"$f":"IF(VLOOKUP(A27,'Finding report'!$B:$F,5,0)=\"Mandatory replacement\",CONCATENATE(VLOOKUP(A27,'Finding report'!$B:$C,2,0),\" PN \",IF(RIGHT(A27,1)=\"R\",LEFT(A27,LEN(A27)-1),A27),\" Qty \",B27,\" to be replaced due to mandatory replacement as per CMM\"),CONCATENATE(VLOOKUP(A27,'Finding report'!$B:$C,2,0),\" PN \",IF(RIGHT(A27,1)=\"R\",LEFT(A27,LEN(A27)-1),A27),\" Qty \",B27,\" Found \",VLOOKUP(A27,'Finding report'!$B:$F,5,0),\" due to normal wear and tear\"))","v":{"$error":"#N/A"}}]
[{"$nulls":4},{"$f":"IF(VLOOKUP(A28,'Finding report'!$B:$F,5,0)=\"Mandatory replacement\",CONCATENATE(VLOOKUP(A28,'Finding report'!$B:$C,2,0),\" PN \",IF(RIGHT(A28,1)=\"R\",LEFT(A28,LEN(A28)-1),A28),\" Qty \",B28,\" to be replaced due to mandatory replacement as per CMM\"),CONCATENATE(VLOOKUP(A28,'Finding report'!$B:$C,2,0),\" PN \",IF(RIGHT(A28,1)=\"R\",LEFT(A28,LEN(A28)-1),A28),\" Qty \",B28,\" Found \",VLOOKUP(A28,'Finding report'!$B:$F,5,0),\" due to normal wear and tear\"))","v":{"$error":"#N/A"}}]
[{"$nulls":4},{"$f":"IF(VLOOKUP(A29,'Finding report'!$B:$F,5,0)=\"Mandatory replacement\",CONCATENATE(VLOOKUP(A29,'Finding report'!$B:$C,2,0),\" PN \",IF(RIGHT(A29,1)=\"R\",LEFT(A29,LEN(A29)-1),A29),\" Qty \",B29,\" to be replaced due to mandatory replacement as per CMM\"),CONCATENATE(VLOOKUP(A29,'Finding report'!$B:$C,2,0),\" PN \",IF(RIGHT(A29,1)=\"R\",LEFT(A29,LEN(A29)-1),A29),\" Qty \",B29,\" Found \",VLOOKUP(A29,'Finding report'!$B:$F,5,0),\" due to normal wear and tear\"))","v":{"$error":"#N/A"}}]
[{"$nulls":4},{"$f":"IF(VLOOKUP(A30,'Finding report'!$B:$F,5,0)=\"Mandatory replacement\",CONCATENATE(VLOOKUP(A30,'Finding report'!$B:$C,2,0),\" PN \",IF(RIGHT(A30,1)=\"R\",LEFT(A30,LEN(A30)-1),A30),\" Qty \",B30,\" to be replaced due to mandatory replacement as per CMM\"),CONCATENATE(VLOOKUP(A30,'Finding report'!$B:$C,2,0),\" PN \",IF(RIGHT(A30,1)=\"R\",LEFT(A30,LEN(A30)-1),A30),\" Qty \",B30,\" Found \",VLOOKUP(A30,'Finding report'!$B:$F,5,0),\" due to normal wear and tear\"))","v":{"$error":"#N/A"}}]
[{"$nulls":4},{"$f":"IF(VLOOKUP(A31,'Finding report'!$B:$F,5,0)=\"Mandatory replacement\",CONCATENATE(VLOOKUP(A31,'Finding report'!$B:$C,2,0),\" PN \",IF(RIGHT(A31,1)=\"R\",LEFT(A31,LEN(A31)-1),A31),\" Qty \",B31,\" to be replaced due to mandatory replacement as per CMM\"),CONCATENATE(VLOOKUP(A31,'Finding report'!$B:$C,2,0),\" PN \",IF(RIGHT(A31,1)=\"R\",LEFT(A31,LEN(A31)-1),A31),\" Qty \",B31,\" Found \",VLOOKUP(A31,'Finding report'!$B:$F,5,0),\" due to normal wear and tear\"))","v":{"$error":"#N/A"}}]
[{"$nulls":4},{"$f":"IF(VLOOKUP(A32,'Finding report'!$B:$F,5,0)=\"Mandatory replacement\",CONCATENATE(VLOOKUP(A32,'Finding report'!$B:$C,2,0),\" PN \",IF(RIGHT(A32,1)=\"R\",LEFT(A32,LEN(A32)-1),A32),\" Qty \",B32,\" to be replaced due to mandatory replacement as per CMM\"),CONCATENATE(VLOOKUP(A32,'Finding report'!$B:$C,2,0),\" PN \",IF(RIGHT(A32,1)=\"R\",LEFT(A32,LEN(A32)-1),A32),\" Qty \",B32,\" Found \",VLOOKUP(A32,'Finding report'!$B:$F,5,0),\" due to normal wear and tear\"))","v":{"$error":"#N/A"}}]
[{"$nulls":4},{"$f":"IF(VLOOKUP(A33,'Finding report'!$B:$F,5,0)=\"Mandatory replacement\",CONCATENATE(VLOOKUP(A33,'Finding report'!$B:$C,2,0),\" PN \",IF(RIGHT(A33,1)=\"R\",LEFT(A33,LEN(A33)-1),A33),\" Qty \",B33,\" to be replaced due to mandatory replacement as per CMM\"),CONCATENATE(VLOOKUP(A33,'Finding report'!$B:$C,2,0),\" PN \",IF(RIGHT(A33,1)=\"R\",LEFT(A33,LEN(A33)-1),A33),\" Qty \",B33,\" Found \",VLOOKUP(A33,'Finding report'!$B:$F,5,0),\" due to normal wear and tear\"))","v":{"$error":"#N/A"}}]
[{"$nulls":4},{"$f":"IF(VLOOKUP(A34,'Finding report'!$B:$F,5,0)=\"Mandatory replacement\",CONCATENATE(VLOOKUP(A34,'Finding report'!$B:$C,2,0),\" PN \",IF(RIGHT(A34,1)=\"R\",LEFT(A34,LEN(A34)-1),A34),\" Qty \",B34,\" to be replaced due to mandatory replacement as per CMM\"),CONCATENATE(VLOOKUP(A34,'Finding report'!$B:$C,2,0),\" PN \",IF(RIGHT(A34,1)=\"R\",LEFT(A34,LEN(A34)-1),A34),\" Qty \",B34,\" Found \",VLOOKUP(A34,'Finding report'!$B:$F,5,0),\" due to normal wear and tear\"))","v":{"$error":"#N/A"}}]
[{"$nulls":4},{"$f":"IF(VLOOKUP(A35,'Finding report'!$B:$F,5,0)=\"Mandatory replacement\",CONCATENATE(VLOOKUP(A35,'Finding report'!$B:$C,2,0),\" PN \",IF(RIGHT(A35,1)=\"R\",LEFT(A35,LEN(A35)-1),A35),\" Qty \",B35,\" to be replaced due to mandatory replacement as per CMM\"),CONCATENATE(VLOOKUP(A35,'Finding report'!$B:$C,2,0),\" PN \",IF(RIGHT(A35,1)=\"R\",LEFT(A35,LEN(A35)-1),A35),\" Qty \",B35,\" Found \",VLOOKUP(A35,'Finding report'!$B:$F,5,0),\" due to normal wear and tear\"))","v":{"$error":"#N/A"}}]
[{"$nulls":4},{"$f":"IF(VLOOKUP(A36,'Finding report'!$B:$F,5,0)=\"Mandatory replacement\",CONCATENATE(VLOOKUP(A36,'Finding report'!$B:$C,2,0),\" PN \",IF(RIGHT(A36,1)=\"R\",LEFT(A36,LEN(A36)-1),A36),\" Qty \",B36,\" to be replaced due to mandatory replacement as per CMM\"),CONCATENATE(VLOOKUP(A36,'Finding report'!$B:$C,2,0),\" PN \",IF(RIGHT(A36,1)=\"R\",LEFT(A36,LEN(A36)-1),A36),\" Qty \",B36,\" Found \",VLOOKUP(A36,'Finding report'!$B:$F,5,0),\" due to normal wear and tear\"))","v":{"$error":"#N/A"}}]
[{"$nulls":4},{"$f":"IF(VLOOKUP(A37,'Finding report'!$B:$F,5,0)=\"Mandatory replacement\",CONCATENATE(VLOOKUP(A37,'Finding report'!$B:$C,2,0),\" PN \",IF(RIGHT(A37,1)=\"R\",LEFT(A37,LEN(A37)-1),A37),\" Qty \",B37,\" to be replaced due to mandatory replacement as per CMM\"),CONCATENATE(VLOOKUP(A37,'Finding report'!$B:$C,2,0),\" PN \",IF(RIGHT(A37,1)=\"R\",LEFT(A37,LEN(A37)-1),A37),\" Qty \",B37,\" Found \",VLOOKUP(A37,'Finding report'!$B:$F,5,0),\" due to normal wear and tear\"))","v":{"$error":"#N/A"}}]
[{"$nulls":4},{"$f":"IF(VLOOKUP(A38,'Finding report'!$B:$F,5,0)=\"Mandatory replacement\",CONCATENATE(VLOOKUP(A38,'Finding report'!$B:$C,2,0),\" PN \",IF(RIGHT(A38,1)=\"R\",LEFT(A38,LEN(A38)-1),A38),\" Qty \",B38,\" to be replaced due to mandatory replacement as per CMM\"),CONCATENATE(VLOOKUP(A38,'Finding report'!$B:$C,2,0),\" PN \",IF(RIGHT(A38,1)=\"R\",LEFT(A38,LEN(A38)-1),A38),\" Qty \",B38,\" Found \",VLOOKUP(A38,'Finding report'!$B:$F,5,0),\" due to normal wear and tear\"))","v":{"$error":"#N/A"}}]
[{"$nulls":4},{"$f":"IF(VLOOKUP(A39,'Finding report'!$B:$F,5,0)=\"Mandatory replacement\",CONCATENATE(VLOOKUP(A39,'Finding report'!$B:$C,2,0),\" PN \",IF(RIGHT(A39,1)=\"R\",LEFT(A39,LEN(A39)-1),A39),\" Qty \",B39,\" to be replaced due to mandatory replacement as per CMM\"),CONCATENATE(VLOOKUP(A39,'Finding report'!$B:$C,2,0),\" PN \",IF(RIGHT(A39,1)=\"R\",LEFT(A39,LEN(A39)-1),A39),\" Qty \",B39,\" Found \",VLOOKUP(A39,'Finding report'!$B:$F,5,0),\" due to normal wear and tear\"))","v":{"$error":"#N/A"}}]
[{"$nulls":4},{"$f":"IF(VLOOKUP(A40,'Finding report'!$B:$F,5,0)=\"Mandatory replacement\",CONCATENATE(VLOOKUP(A40,'Finding report'!$B:$C,2,0),\" PN \",IF(RIGHT(A40,1)=\"R\",LEFT(A40,LEN(A40)-1),A40),\" Qty \",B40,\" to be replaced due to mandatory replacement as per CMM\"),CONCATENATE(VLOOKUP(A40,'Finding report'!$B:$C,2,0),\" PN \",IF(RIGHT(A40,1)=\"R\",LEFT(A40,LEN(A40)-1),A40),\" Qty \",B40,\" Found \",VLOOKUP(A40,'Finding report'!$B:$F,5,0),\" due to normal wear and tear\"))","v":{"$error":"#N/A"}}]
[{"$nulls":4},{"$f":"IF(VLOOKUP(A41,'Finding report'!$B:$F,5,0)=\"Mandatory replacement\",CONCATENATE(VLOOKUP(A41,'Finding report'!$B:$C,2,0),\" PN \",IF(RIGHT(A41,1)=\"R\",LEFT(A41,LEN(A41)-1),A41),\" Qty \",B41,\" to be replaced due to mandatory replacement as per CMM\"),CONCATENATE(VLOOKUP(A41,'Finding report'!$B:$C,2,0),\" PN \",IF(RIGHT(A41,1)=\"R\",LEFT(A41,LEN(A41)-1),A41),\" Qty \",B41,\" Found \",VLOOKUP(A41,'Finding report'!$B:$F,5,0),\" due to normal wear and tear\"))","v":{"$error":"#N/A"}}]
[{"$nulls":4},{"$f":"IF(VLOOKUP(A42,'Finding report'!$B:$F,5,0)=\"Mandatory replacement\",CONCATENATE(VLOOKUP(A42,'Finding report'!$B:$C,2,0),\" PN \",IF(RIGHT(A42,1)=\"R\",LEFT(A42,LEN(A42)-1),A42),\" Qty \",B42,\" to be replaced due to mandatory replacement as per CMM\"),CONCATENATE(VLOOKUP(A42,'Finding report'!$B:$C,2,0),\" PN \",IF(RIGHT(A42,1)=\"R\",LEFT(A42,LEN(A42)-1),A42),\" Qty \",B42,\" Found \",VLOOKUP(A42,'Finding report'!$B:$F,5,0),\" due to normal wear and tear\"))","v":{"$error":"#N/A"}}]
[{"$nulls":4},{"$f":"IF(VLOOKUP(A43,'Finding report'!$B:$F,5,0)=\"Mandatory replacement\",CONCATENATE(VLOOKUP(A43,'Finding report'!$B:$C,2,0),\" PN \",IF(RIGHT(A43,1)=\"R\",LEFT(A43,LEN(A43)-1),A43),\" Qty \",B43,\" to be replaced due to mandatory replacement as per CMM\"),CONCATENATE(VLOOKUP(A43,'Finding report'!$B:$C,2,0),\" PN \",IF(RIGHT(A43,1)=\"R\",LEFT(A43,LEN(A43)-1),A43),\" Qty \",B43,\" Found \",VLOOKUP(A43,'Finding report'!$B:$F,5,0),\" due to normal wear and tear\"))","v":{"$error":"#N/A"}}]
[{"$nulls":4},{"$f":"IF(VLOOKUP(A44,'Finding report'!$B:$F,5,0)=\"Mandatory replacement\",CONCATENATE(VLOOKUP(A44,'Finding report'!$B:$C,2,0),\" PN \",IF(RIGHT(A44,1)=\"R\",LEFT(A44,LEN(A44)-1),A44),\" Qty \",B44,\" to be replaced due to mandatory replacement as per CMM\"),CONCATENATE(VLOOKUP(A44,'Finding report'!$B:$C,2,0),\" PN \",IF(RIGHT(A44,1)=\"R\",LEFT(A44,LEN(A44)-1),A44),\" Qty \",B44,\" Found \",VLOOKUP(A44,'Finding report'!$B:$F,5,0),\" due to normal wear and tear\"))","v":{"$error":"#N/A"}}]
[{"$nulls":4},{"$f":"IF(VLOOKUP(A45,'Finding report'!$B:$F,5,0)=\"Mandatory replacement\",CONCATENATE(VLOOKUP(A45,'Finding report'!$B:$C,2,0),\" PN \",IF(RIGHT(A45,1)=\"R\",LEFT(A45,LEN(A45)-1),A45),\" Qty \",B45,\" to be replaced due to mandatory replacement as per CMM\"),CONCATENATE(VLOOKUP(A45,'Finding report'!$B:$C,2,0),\" PN \",IF(RIGHT(A45,1)=\"R\",LEFT(A45,LEN(A45)-1),A45),\" Qty \",B45,\" Found \",VLOOKUP(A45,'Finding report'!$B:$F,5,0),\" due to normal wear and tear\"))","v":{"$error":"#N/A"}}]
[{"$nulls":4},{"$f":"IF(VLOOKUP(A46,'Finding report'!$B:$F,5,0)=\"Mandatory replacement\",CONCATENATE(VLOOKUP(A46,'Finding report'!$B:$C,2,0),\" PN \",IF(RIGHT(A46,1)=\"R\",LEFT(A46,LEN(A46)-1),A46),\" Qty \",B46,\" to be replaced due to mandatory replacement as per CMM\"),CONCATENATE(VLOOKUP(A46,'Finding report'!$B:$C,2,0),\" PN \",IF(RIGHT(A46,1)=\"R\",LEFT(A46,LEN(A46)-1),A46),\" Qty \",B46,\" Found \",VLOOKUP(A46,'Finding report'!$B:$F,5,0),\" due to normal wear and tear\"))","v":{"$error":"#N/A"}}]
[{"$nulls":4},{"$f":"IF(VLOOKUP(A47,'Finding report'!$B:$F,5,0)=\"Mandatory replacement\",CONCATENATE(VLOOKUP(A47,'Finding report'!$B:$C,2,0),\" PN \",IF(RIGHT(A47,1)=\"R\",LEFT(A47,LEN(A47)-1),A47),\" Qty \",B47,\" to be replaced due to mandatory replacement as per CMM\"),CONCATENATE(VLOOKUP(A47,'Finding report'!$B:$C,2,0),\" PN \",IF(RIGHT(A47,1)=\"R\",LEFT(A47,LEN(A47)-1),A47),\" Qty \",B47,\" Found \",VLOOKUP(A47,'Finding report'!$B:$F,5,0),\" due to normal wear and tear\"))","v":{"$error":"#N/A"}}]
[{"$nulls":4},{"$f":"IF(VLOOKUP(A48,'Finding report'!$B:$F,5,0)=\"Mandatory replacement\",CONCATENATE(VLOOKUP(A48,'Finding report'!$B:$C,2,0),\" PN \",IF(RIGHT(A48,1)=\"R\",LEFT(A48,LEN(A48)-1),A48),\" Qty \",B48,\" to be replaced due to mandatory replacement as per CMM\"),CONCATENATE(VLOOKUP(A48,'Finding report'!$B:$C,2,0),\" PN \",IF(RIGHT(A48,1)=\"R\",LEFT(A48,LEN(A48)-1),A48),\" Qty \",B48,\" Found \",VLOOKUP(A48,'Finding report'!$B:$F,5,0),\" due to normal wear and tear\"))","v":{"$error":"#N/A"}}]
[{"$nulls":4},{"$f":"IF(VLOOKUP(A49,'Finding report'!$B:$F,5,0)=\"Mandatory replacement\",CONCATENATE(VLOOKUP(A49,'Finding report'!$B:$C,2,0),\" PN \",IF(RIGHT(A49,1)=\"R\",LEFT(A49,LEN(A49)-1),A49),\" Qty \",B49,\" to be replaced due to mandatory replacement as per CMM\"),CONCATENATE(VLOOKUP(A49,'Finding report'!$B:$C,2,0),\" PN \",IF(RIGHT(A49,1)=\"R\",LEFT(A49,LEN(A49)-1),A49),\" Qty \",B49,\" Found \",VLOOKUP(A49,'Finding report'!$B:$F,5,0),\" due to normal wear and tear\"))","v":{"$error":"#N/A"}}]
[{"$nulls":4},{"$f":"IF(VLOOKUP(A50,'Finding report'!$B:$F,5,0)=\"Mandatory replacement\",CONCATENATE(VLOOKUP(A50,'Finding report'!$B:$C,2,0),\" PN \",IF(RIGHT(A50,1)=\"R\",LEFT(A50,LEN(A50)-1),A50),\" Qty \",B50,\" to be replaced due to mandatory replacement as per CMM\"),CONCATENATE(VLOOKUP(A50,'Finding report'!$B:$C,2,0),\" PN \",IF(RIGHT(A50,1)=\"R\",LEFT(A50,LEN(A50)-1),A50),\" Qty \",B50,\" Found \",VLOOKUP(A50,'Finding report'!$B:$F,5,0),\" due to normal wear and tear\"))","v":{"$error":"#N/A"}}]
[{"$nulls":4},{"$f":"IF(VLOOKUP(A51,'Finding report'!$B:$F,5,0)=\"Mandatory replacement\",CONCATENATE(VLOOKUP(A51,'Finding report'!$B:$C,2,0),\" PN \",IF(RIGHT(A51,1)=\"R\",LEFT(A51,LEN(A51)-1),A51),\" Qty \",B51,\" to be replaced due to mandatory replacement as per CMM\"),CONCATENATE(VLOOKUP(A51,'Finding report'!$B:$C,2,0),\" PN \",IF(RIGHT(A51,1)=\"R\",LEFT(A51,LEN(A51)-1),A51),\" Qty \",B51,\" Found \",VLOOKUP(A51,'Finding report'!$B:$F,5,0),\" due to normal wear and tear\"))","v":{"$error":"#N/A"}}]
[{"$nulls":4},{"$f":"IF(VLOOKUP(A52,'Finding report'!$B:$F,5,0)=\"Mandatory replacement\",CONCATENATE(VLOOKUP(A52,'Finding report'!$B:$C,2,0),\" PN \",IF(RIGHT(A52,1)=\"R\",LEFT(A52,LEN(A52)-1),A52),\" Qty \",B52,\" to be replaced due to mandatory replacement as per CMM\"),CONCATENATE(VLOOKUP(A52,'Finding report'!$B:$C,2,0),\" PN \",IF(RIGHT(A52,1)=\"R\",LEFT(A52,LEN(A52)-1),A52),\" Qty \",B52,\" Found \",VLOOKUP(A52,'Finding report'!$B:$F,5,0),\" due to normal wear and tear\"))","v":{"$error":"#N/A"}}]
[{"$nulls":4},{"$f":"IF(VLOOKUP(A53,'Finding report'!$B:$F,5,0)=\"Mandatory replacement\",CONCATENATE(VLOOKUP(A53,'Finding report'!$B:$C,2,0),\" PN \",IF(RIGHT(A53,1)=\"R\",LEFT(A53,LEN(A53)-1),A53),\" Qty \",B53,\" to be replaced due to mandatory replacement as per CMM\"),CONCATENATE(VLOOKUP(A53,'Finding report'!$B:$C,2,0),\" PN \",IF(RIGHT(A53,1)=\"R\",LEFT(A53,LEN(A53)-1),A53),\" Qty \",B53,\" Found \",VLOOKUP(A53,'Finding report'!$B:$F,5,0),\" due to normal wear and tear\"))","v":{"$error":"#N/A"}}]
[{"$nulls":4},{"$f":"IF(VLOOKUP(A54,'Finding report'!$B:$F,5,0)=\"Mandatory replacement\",CONCATENATE(VLOOKUP(A54,'Finding report'!$B:$C,2,0),\" PN \",IF(RIGHT(A54,1)=\"R\",LEFT(A54,LEN(A54)-1),A54),\" Qty \",B54,\" to be replaced due to mandatory replacement as per CMM\"),CONCATENATE(VLOOKUP(A54,'Finding report'!$B:$C,2,0),\" PN \",IF(RIGHT(A54,1)=\"R\",LEFT(A54,LEN(A54)-1),A54),\" Qty \",B54,\" Found \",VLOOKUP(A54,'Finding report'!$B:$F,5,0),\" due to normal wear and tear\"))","v":{"$error":"#N/A"}}]
[{"$nulls":4},{"$f":"IF(VLOOKUP(A55,'Finding report'!$B:$F,5,0)=\"Mandatory replacement\",CONCATENATE(VLOOKUP(A55,'Finding report'!$B:$C,2,0),\" PN \",IF(RIGHT(A55,1)=\"R\",LEFT(A55,LEN(A55)-1),A55),\" Qty \",B55,\" to be replaced due to mandatory replacement as per CMM\"),CONCATENATE(VLOOKUP(A55,'Finding report'!$B:$C,2,0),\" PN \",IF(RIGHT(A55,1)=\"R\",LEFT(A55,LEN(A55)-1),A55),\" Qty \",B55,\" Found \",VLOOKUP(A55,'Finding report'!$B:$F,5,0),\" due to normal wear and tear\"))","v":{"$error":"#N/A"}}]
[{"$nulls":4},{"$f":"IF(VLOOKUP(A56,'Finding report'!$B:$F,5,0)=\"Mandatory replacement\",CONCATENATE(VLOOKUP(A56,'Finding report'!$B:$C,2,0),\" PN \",IF(RIGHT(A56,1)=\"R\",LEFT(A56,LEN(A56)-1),A56),\" Qty \",B56,\" to be replaced due to mandatory replacement as per CMM\"),CONCATENATE(VLOOKUP(A56,'Finding report'!$B:$C,2,0),\" PN \",IF(RIGHT(A56,1)=\"R\",LEFT(A56,LEN(A56)-1),A56),\" Qty \",B56,\" Found \",VLOOKUP(A56,'Finding report'!$B:$F,5,0),\" due to normal wear and tear\"))","v":{"$error":"#N/A"}}]
[{"$nulls":4},{"$f":"IF(VLOOKUP(A57,'Finding report'!$B:$F,5,0)=\"Mandatory replacement\",CONCATENATE(VLOOKUP(A57,'Finding report'!$B:$C,2,0),\" PN \",IF(RIGHT(A57,1)=\"R\",LEFT(A57,LEN(A57)-1),A57),\" Qty \",B57,\" to be replaced due to mandatory replacement as per CMM\"),CONCATENATE(VLOOKUP(A57,'Finding report'!$B:$C,2,0),\" PN \",IF(RIGHT(A57,1)=\"R\",LEFT(A57,LEN(A57)-1),A57),\" Qty \",B57,\" Found \",VLOOKUP(A57,'Finding report'!$B:$F,5,0),\" due to normal wear and tear\"))","v":{"$error":"#N/A"}}]
[{"$nulls":4},{"$f":"IF(VLOOKUP(A58,'Finding report'!$B:$F,5,0)=\"Mandatory replacement\",CONCATENATE(VLOOKUP(A58,'Finding report'!$B:$C,2,0),\" PN \",IF(RIGHT(A58,1)=\"R\",LEFT(A58,LEN(A58)-1),A58),\" Qty \",B58,\" to be replaced due to mandatory replacement as per CMM\"),CONCATENATE(VLOOKUP(A58,'Finding report'!$B:$C,2,0),\" PN \",IF(RIGHT(A58,1)=\"R\",LEFT(A58,LEN(A58)-1),A58),\" Qty \",B58,\" Found \",VLOOKUP(A58,'Finding report'!$B:$F,5,0),\" due to normal wear and tear\"))","v":{"$error":"#N/A"}}]
[{"$nulls":4},{"$f":"IF(VLOOKUP(A59,'Finding report'!$B:$F,5,0)=\"Mandatory replacement\",CONCATENATE(VLOOKUP(A59,'Finding report'!$B:$C,2,0),\" PN \",IF(RIGHT(A59,1)=\"R\",LEFT(A59,LEN(A59)-1),A59),\" Qty \",B59,\" to be replaced due to mandatory replacement as per CMM\"),CONCATENATE(VLOOKUP(A59,'Finding report'!$B:$C,2,0),\" PN \",IF(RIGHT(A59,1)=\"R\",LEFT(A59,LEN(A59)-1),A59),\" Qty \",B59,\" Found \",VLOOKUP(A59,'Finding report'!$B:$F,5,0),\" due to normal wear and tear\"))","v":{"$error":"#N/A"}}]
[{"$nulls":4},{"$f":"IF(VLOOKUP(A60,'Finding report'!$B:$F,5,0)=\"Mandatory replacement\",CONCATENATE(VLOOKUP(A60,'Finding report'!$B:$C,2,0),\" PN \",IF(RIGHT(A60,1)=\"R\",LEFT(A60,LEN(A60)-1),A60),\" Qty \",B60,\" to be replaced due to mandatory replacement as per CMM\"),CONCATENATE(VLOOKUP(A60,'Finding report'!$B:$C,2,0),\" PN \",IF(RIGHT(A60,1)=\"R\",LEFT(A60,LEN(A60)-1),A60),\" Qty \",B60,\" Found \",VLOOKUP(A60,'Finding report'!$B:$F,5,0),\" due to normal wear and tear\"))","v":{"$error":"#N/A"}}]
[{"$nulls":4},{"$f":"IF(VLOOKUP(A61,'Finding report'!$B:$F,5,0)=\"Mandatory replacement\",CONCATENATE(VLOOKUP(A61,'Finding report'!$B:$C,2,0),\" PN \",IF(RIGHT(A61,1)=\"R\",LEFT(A61,LEN(A61)-1),A61),\" Qty \",B61,\" to be replaced due to mandatory replacement as per CMM\"),CONCATENATE(VLOOKUP(A61,'Finding report'!$B:$C,2,0),\" PN \",IF(RIGHT(A61,1)=\"R\",LEFT(A61,LEN(A61)-1),A61),\" Qty \",B61,\" Found \",VLOOKUP(A61,'Finding report'!$B:$F,5,0),\" due to normal wear and tear\"))","v":{"$error":"#N/A"}}]
[{"$nulls":4},{"$f":"IF(VLOOKUP(A62,'Finding report'!$B:$F,5,0)=\"Mandatory replacement\",CONCATENATE(VLOOKUP(A62,'Finding report'!$B:$C,2,0),\" PN \",IF(RIGHT(A62,1)=\"R\",LEFT(A62,LEN(A62)-1),A62),\" Qty \",B62,\" to be replaced due to mandatory replacement as per CMM\"),CONCATENATE(VLOOKUP(A62,'Finding report'!$B:$C,2,0),\" PN \",IF(RIGHT(A62,1)=\"R\",LEFT(A62,LEN(A62)-1),A62),\" Qty \",B62,\" Found \",VLOOKUP(A62,'Finding report'!$B:$F,5,0),\" due to normal wear and tear\"))","v":{"$error":"#N/A"}}]
[{"$nulls":4},{"$f":"IF(VLOOKUP(A63,'Finding report'!$B:$F,5,0)=\"Mandatory replacement\",CONCATENATE(VLOOKUP(A63,'Finding report'!$B:$C,2,0),\" PN \",IF(RIGHT(A63,1)=\"R\",LEFT(A63,LEN(A63)-1),A63),\" Qty \",B63,\" to be replaced due to mandatory replacement as per CMM\"),CONCATENATE(VLOOKUP(A63,'Finding report'!$B:$C,2,0),\" PN \",IF(RIGHT(A63,1)=\"R\",LEFT(A63,LEN(A63)-1),A63),\" Qty \",B63,\" Found \",VLOOKUP(A63,'Finding report'!$B:$F,5,0),\" due to normal wear and tear\"))","v":{"$error":"#N/A"}}]
[{"$nulls":4},{"$f":"IF(VLOOKUP(A64,'Finding report'!$B:$F,5,0)=\"Mandatory replacement\",CONCATENATE(VLOOKUP(A64,'Finding report'!$B:$C,2,0),\" PN \",IF(RIGHT(A64,1)=\"R\",LEFT(A64,LEN(A64)-1),A64),\" Qty \",B64,\" to be replaced due to mandatory replacement as per CMM\"),CONCATENATE(VLOOKUP(A64,'Finding report'!$B:$C,2,0),\" PN \",IF(RIGHT(A64,1)=\"R\",LEFT(A64,LEN(A64)-1),A64),\" Qty \",B64,\" Found \",VLOOKUP(A64,'Finding report'!$B:$F,5,0),\" due to normal wear and tear\"))","v":{"$error":"#N/A"}}]
[{"$nulls":4},{"$f":"IF(VLOOKUP(A65,'Finding report'!$B:$F,5,0)=\"Mandatory replacement\",CONCATENATE(VLOOKUP(A65,'Finding report'!$B:$C,2,0),\" PN \",IF(RIGHT(A65,1)=\"R\",LEFT(A65,LEN(A65)-1),A65),\" Qty \",B65,\" to be replaced due to mandatory replacement as per CMM\"),CONCATENATE(VLOOKUP(A65,'Finding report'!$B:$C,2,0),\" PN \",IF(RIGHT(A65,1)=\"R\",LEFT(A65,LEN(A65)-1),A65),\" Qty \",B65,\" Found \",VLOOKUP(A65,'Finding report'!$B:$F,5,0),\" due to normal wear and tear\"))","v":{"$error":"#N/A"}}]
[{"$nulls":4},{"$f":"IF(VLOOKUP(A66,'Finding report'!$B:$F,5,0)=\"Mandatory replacement\",CONCATENATE(VLOOKUP(A66,'Finding report'!$B:$C,2,0),\" PN \",IF(RIGHT(A66,1)=\"R\",LEFT(A66,LEN(A66)-1),A66),\" Qty \",B66,\" to be replaced due to mandatory replacement as per CMM\"),CONCATENATE(VLOOKUP(A66,'Finding report'!$B:$C,2,0),\" PN \",IF(RIGHT(A66,1)=\"R\",LEFT(A66,LEN(A66)-1),A66),\" Qty \",B66,\" Found \",VLOOKUP(A66,'Finding report'!$B:$F,5,0),\" due to normal wear and tear\"))","v":{"$error":"#N/A"}}]
[{"$nulls":4},{"$f":"IF(VLOOKUP(A67,'Finding report'!$B:$F,5,0)=\"Mandatory replacement\",CONCATENATE(VLOOKUP(A67,'Finding report'!$B:$C,2,0),\" PN \",IF(RIGHT(A67,1)=\"R\",LEFT(A67,LEN(A67)-1),A67),\" Qty \",B67,\" to be replaced due to mandatory replacement as per CMM\"),CONCATENATE(VLOOKUP(A67,'Finding report'!$B:$C,2,0),\" PN \",IF(RIGHT(A67,1)=\"R\",LEFT(A67,LEN(A67)-1),A67),\" Qty \",B67,\" Found \",VLOOKUP(A67,'Finding report'!$B:$F,5,0),\" due to normal wear and tear\"))","v":{"$error":"#N/A"}}]
[{"$nulls":4},{"$f":"IF(VLOOKUP(A68,'Finding report'!$B:$F,5,0)=\"Mandatory replacement\",CONCATENATE(VLOOKUP(A68,'Finding report'!$B:$C,2,0),\" PN \",IF(RIGHT(A68,1)=\"R\",LEFT(A68,LEN(A68)-1),A68),\" Qty \",B68,\" to be replaced due to mandatory replacement as per CMM\"),CONCATENATE(VLOOKUP(A68,'Finding report'!$B:$C,2,0),\" PN \",IF(RIGHT(A68,1)=\"R\",LEFT(A68,LEN(A68)-1),A68),\" Qty \",B68,\" Found \",VLOOKUP(A68,'Finding report'!$B:$F,5,0),\" due to normal wear and tear\"))","v":{"$error":"#N/A"}}]
[{"$nulls":4},{"$f":"IF(VLOOKUP(A69,'Finding report'!$B:$F,5,0)=\"Mandatory replacement\",CONCATENATE(VLOOKUP(A69,'Finding report'!$B:$C,2,0),\" PN \",IF(RIGHT(A69,1)=\"R\",LEFT(A69,LEN(A69)-1),A69),\" Qty \",B69,\" to be replaced due to mandatory replacement as per CMM\"),CONCATENATE(VLOOKUP(A69,'Finding report'!$B:$C,2,0),\" PN \",IF(RIGHT(A69,1)=\"R\",LEFT(A69,LEN(A69)-1),A69),\" Qty \",B69,\" Found \",VLOOKUP(A69,'Finding report'!$B:$F,5,0),\" due to normal wear and tear\"))","v":{"$error":"#N/A"}}]
[{"$nulls":4},{"$f":"IF(VLOOKUP(A70,'Finding report'!$B:$F,5,0)=\"Mandatory replacement\",CONCATENATE(VLOOKUP(A70,'Finding report'!$B:$C,2,0),\" PN \",IF(RIGHT(A70,1)=\"R\",LEFT(A70,LEN(A70)-1),A70),\" Qty \",B70,\" to be replaced due to mandatory replacement as per CMM\"),CONCATENATE(VLOOKUP(A70,'Finding report'!$B:$C,2,0),\" PN \",IF(RIGHT(A70,1)=\"R\",LEFT(A70,LEN(A70)-1),A70),\" Qty \",B70,\" Found \",VLOOKUP(A70,'Finding report'!$B:$F,5,0),\" due to normal wear and tear\"))","v":{"$error":"#N/A"}}]
[{"$nulls":4},{"$f":"IF(VLOOKUP(A71,'Finding report'!$B:$F,5,0)=\"Mandatory replacement\",CONCATENATE(VLOOKUP(A71,'Finding report'!$B:$C,2,0),\" PN \",IF(RIGHT(A71,1)=\"R\",LEFT(A71,LEN(A71)-1),A71),\" Qty \",B71,\" to be replaced due to mandatory replacement as per CMM\"),CONCATENATE(VLOOKUP(A71,'Finding report'!$B:$C,2,0),\" PN \",IF(RIGHT(A71,1)=\"R\",LEFT(A71,LEN(A71)-1),A71),\" Qty \",B71,\" Found \",VLOOKUP(A71,'Finding report'!$B:$F,5,0),\" due to normal wear and tear\"))","v":{"$error":"#N/A"}}]
[{"$nulls":4},{"$f":"IF(VLOOKUP(A72,'Finding report'!$B:$F,5,0)=\"Mandatory replacement\",CONCATENATE(VLOOKUP(A72,'Finding report'!$B:$C,2,0),\" PN \",IF(RIGHT(A72,1)=\"R\",LEFT(A72,LEN(A72)-1),A72),\" Qty \",B72,\" to be replaced due to mandatory replacement as per CMM\"),CONCATENATE(VLOOKUP(A72,'Finding report'!$B:$C,2,0),\" PN \",IF(RIGHT(A72,1)=\"R\",LEFT(A72,LEN(A72)-1),A72),\" Qty \",B72,\" Found \",VLOOKUP(A72,'Finding report'!$B:$F,5,0),\" due to normal wear and tear\"))","v":{"$error":"#N/A"}}]
[{"$nulls":4},{"$f":"IF(VLOOKUP(A73,'Finding report'!$B:$F,5,0)=\"Mandatory replacement\",CONCATENATE(VLOOKUP(A73,'Finding report'!$B:$C,2,0),\" PN \",IF(RIGHT(A73,1)=\"R\",LEFT(A73,LEN(A73)-1),A73),\" Qty \",B73,\" to be replaced due to mandatory replacement as per CMM\"),CONCATENATE(VLOOKUP(A73,'Finding report'!$B:$C,2,0),\" PN \",IF(RIGHT(A73,1)=\"R\",LEFT(A73,LEN(A73)-1),A73),\" Qty \",B73,\" Found \",VLOOKUP(A73,'Finding report'!$B:$F,5,0),\" due to normal wear and tear\"))","v":{"$error":"#N/A"}}]
[{"$nulls":4},{"$f":"IF(VLOOKUP(A74,'Finding report'!$B:$F,5,0)=\"Mandatory replacement\",CONCATENATE(VLOOKUP(A74,'Finding report'!$B:$C,2,0),\" PN \",IF(RIGHT(A74,1)=\"R\",LEFT(A74,LEN(A74)-1),A74),\" Qty \",B74,\" to be replaced due to mandatory replacement as per CMM\"),CONCATENATE(VLOOKUP(A74,'Finding report'!$B:$C,2,0),\" PN \",IF(RIGHT(A74,1)=\"R\",LEFT(A74,LEN(A74)-1),A74),\" Qty \",B74,\" Found \",VLOOKUP(A74,'Finding report'!$B:$F,5,0),\" due to normal wear and tear\"))","v":{"$error":"#N/A"}}]
[{"$nulls":4},{"$f":"IF(VLOOKUP(A75,'Finding report'!$B:$F,5,0)=\"Mandatory replacement\",CONCATENATE(VLOOKUP(A75,'Finding report'!$B:$C,2,0),\" PN \",IF(RIGHT(A75,1)=\"R\",LEFT(A75,LEN(A75)-1),A75),\" Qty \",B75,\" to be replaced due to mandatory replacement as per CMM\"),CONCATENATE(VLOOKUP(A75,'Finding report'!$B:$C,2,0),\" PN \",IF(RIGHT(A75,1)=\"R\",LEFT(A75,LEN(A75)-1),A75),\" Qty \",B75,\" Found \",VLOOKUP(A75,'Finding report'!$B:$F,5,0),\" due to normal wear and tear\"))","v":{"$error":"#N/A"}}]
[{"$nulls":4},{"$f":"IF(VLOOKUP(A76,'Finding report'!$B:$F,5,0)=\"Mandatory replacement\",CONCATENATE(VLOOKUP(A76,'Finding report'!$B:$C,2,0),\" PN \",IF(RIGHT(A76,1)=\"R\",LEFT(A76,LEN(A76)-1),A76),\" Qty \",B76,\" to be replaced due to mandatory replacement as per CMM\"),CONCATENATE(VLOOKUP(A76,'Finding report'!$B:$C,2,0),\" PN \",IF(RIGHT(A76,1)=\"R\",LEFT(A76,LEN(A76)-1),A76),\" Qty \",B76,\" Found \",VLOOKUP(A76,'Finding report'!$B:$F,5,0),\" due to normal wear and tear\"))","v":{"$error":"#N/A"}}]
[{"$nulls":4},{"$f":"IF(VLOOKUP(A77,'Finding report'!$B:$F,5,0)=\"Mandatory replacement\",CONCATENATE(VLOOKUP(A77,'Finding report'!$B:$C,2,0),\" PN \",IF(RIGHT(A77,1)=\"R\",LEFT(A77,LEN(A77)-1),A77),\" Qty \",B77,\" to be replaced due to mandatory replacement as per CMM\"),CONCATENATE(VLOOKUP(A77,'Finding report'!$B:$C,2,0),\" PN \",IF(RIGHT(A77,1)=\"R\",LEFT(A77,LEN(A77)-1),A77),\" Qty \",B77,\" Found \",VLOOKUP(A77,'Finding report'!$B:$F,5,0),\" due to normal wear and tear\"))","v":{"$error":"#N/A"}}]
[{"$nulls":4},{"$f":"IF(VLOOKUP(A78,'Finding report'!$B:$F,5,0)=\"Mandatory replacement\",CONCATENATE(VLOOKUP(A78,'Finding report'!$B:$C,2,0),\" PN \",IF(RIGHT(A78,1)=\"R\",LEFT(A78,LEN(A78)-1),A78),\" Qty \",B78,\" to be replaced due to mandatory replacement as per CMM\"),CONCATENATE(VLOOKUP(A78,'Finding report'!$B:$C,2,0),\" PN \",IF(RIGHT(A78,1)=\"R\",LEFT(A78,LEN(A78)-1),A78),\" Qty \",B78,\" Found \",VLOOKUP(A78,'Finding report'!$B:$F,5,0),\" due to normal wear and tear\"))","v":{"$error":"#N/A"}}]
[{"$nulls":4},{"$f":"IF(VLOOKUP(A79,'Finding report'!$B:$F,5,0)=\"Mandatory replacement\",CONCATENATE(VLOOKUP(A79,'Finding report'!$B:$C,2,0),\" PN \",IF(RIGHT(A79,1)=\"R\",LEFT(A79,LEN(A79)-1),A79),\" Qty \",B79,\" to be replaced due to mandatory replacement as per CMM\"),CONCATENATE(VLOOKUP(A79,'Finding report'!$B:$C,2,0),\" PN \",IF(RIGHT(A79,1)=\"R\",LEFT(A79,LEN(A79)-1),A79),\" Qty \",B79,\" Found \",VLOOKUP(A79,'Finding report'!$B:$F,5,0),\" due to normal wear and tear\"))","v":{"$error":"#N/A"}}]
[{"$nulls":4},{"$f":"IF(VLOOKUP(A80,'Finding report'!$B:$F,5,0)=\"Mandatory replacement\",CONCATENATE(VLOOKUP(A80,'Finding report'!$B:$C,2,0),\" PN \",IF(RIGHT(A80,1)=\"R\",LEFT(A80,LEN(A80)-1),A80),\" Qty \",B80,\" to be replaced due to mandatory replacement as per CMM\"),CONCATENATE(VLOOKUP(A80,'Finding report'!$B:$C,2,0),\" PN \",IF(RIGHT(A80,1)=\"R\",LEFT(A80,LEN(A80)-1),A80),\" Qty \",B80,\" Found \",VLOOKUP(A80,'Finding report'!$B:$F,5,0),\" due to normal wear and tear\"))","v":{"$error":"#N/A"}}]
[{"$nulls":4},{"$f":"IF(VLOOKUP(A81,'Finding report'!$B:$F,5,0)=\"Mandatory replacement\",CONCATENATE(VLOOKUP(A81,'Finding report'!$B:$C,2,0),\" PN \",IF(RIGHT(A81,1)=\"R\",LEFT(A81,LEN(A81)-1),A81),\" Qty \",B81,\" to be replaced due to mandatory replacement as per CMM\"),CONCATENATE(VLOOKUP(A81,'Finding report'!$B:$C,2,0),\" PN \",IF(RIGHT(A81,1)=\"R\",LEFT(A81,LEN(A81)-1),A81),\" Qty \",B81,\" Found \",VLOOKUP(A81,'Finding report'!$B:$F,5,0),\" due to normal wear and tear\"))","v":{"$error":"#N/A"}}]
[{"$nulls":4},{"$f":"IF(VLOOKUP(A82,'Finding report'!$B:$F,5,0)=\"Mandatory replacement\",CONCATENATE(VLOOKUP(A82,'Finding report'!$B:$C,2,0),\" PN \",IF(RIGHT(A82,1)=\"R\",LEFT(A82,LEN(A82)-1),A82),\" Qty \",B82,\" to be replaced due to mandatory replacement as per CMM\"),CONCATENATE(VLOOKUP(A82,'Finding report'!$B:$C,2,0),\" PN \",IF(RIGHT(A82,1)=\"R\",LEFT(A82,LEN(A82)-1),A82),\" Qty \",B82,\" Found \",VLOOKUP(A82,'Finding report'!$B:$F,5,0),\" due to normal wear and tear\"))","v":{"$error":"#N/A"}}]
[{"$nulls":4},{"$f":"IF(VLOOKUP(A83,'Finding report'!$B:$F,5,0)=\"Mandatory replacement\",CONCATENATE(VLOOKUP(A83,'Finding report'!$B:$C,2,0),\" PN \",IF(RIGHT(A83,1)=\"R\",LEFT(A83,LEN(A83)-1),A83),\" Qty \",B83,\" to be replaced due to mandatory replacement as per CMM\"),CONCATENATE(VLOOKUP(A83,'Finding report'!$B:$C,2,0),\" PN \",IF(RIGHT(A83,1)=\"R\",LEFT(A83,LEN(A83)-1),A83),\" Qty \",B83,\" Found \",VLOOKUP(A83,'Finding report'!$B:$F,5,0),\" due to normal wear and tear\"))","v":{"$error":"#N/A"}}]
[{"$nulls":4},{"$f":"IF(VLOOKUP(A84,'Finding report'!$B:$F,5,0)=\"Mandatory replacement\",CONCATENATE(VLOOKUP(A84,'Finding report'!$B:$C,2,0),\" PN \",IF(RIGHT(A84,1)=\"R\",LEFT(A84,LEN(A84)-1),A84),\" Qty \",B84,\" to be replaced due to mandatory replacement as per CMM\"),CONCATENATE(VLOOKUP(A84,'Finding report'!$B:$C,2,0),\" PN \",IF(RIGHT(A84,1)=\"R\",LEFT(A84,LEN(A84)-1),A84),\" Qty \",B84,\" Found \",VLOOKUP(A84,'Finding report'!$B:$F,5,0),\" due to normal wear and tear\"))","v":{"$error":"#N/A"}}]
[{"$nulls":4},{"$f":"IF(VLOOKUP(A85,'Finding report'!$B:$F,5,0)=\"Mandatory replacement\",CONCATENATE(VLOOKUP(A85,'Finding report'!$B:$C,2,0),\" PN \",IF(RIGHT(A85,1)=\"R\",LEFT(A85,LEN(A85)-1),A85),\" Qty \",B85,\" to be replaced due to mandatory replacement as per CMM\"),CONCATENATE(VLOOKUP(A85,'Finding report'!$B:$C,2,0),\" PN \",IF(RIGHT(A85,1)=\"R\",LEFT(A85,LEN(A85)-1),A85),\" Qty \",B85,\" Found \",VLOOKUP(A85,'Finding report'!$B:$F,5,0),\" due to normal wear and tear\"))","v":{"$error":"#N/A"}}]
[{"$nulls":4},{"$f":"IF(VLOOKUP(A86,'Finding report'!$B:$F,5,0)=\"Mandatory replacement\",CONCATENATE(VLOOKUP(A86,'Finding report'!$B:$C,2,0),\" PN \",IF(RIGHT(A86,1)=\"R\",LEFT(A86,LEN(A86)-1),A86),\" Qty \",B86,\" to be replaced due to mandatory replacement as per CMM\"),CONCATENATE(VLOOKUP(A86,'Finding report'!$B:$C,2,0),\" PN \",IF(RIGHT(A86,1)=\"R\",LEFT(A86,LEN(A86)-1),A86),\" Qty \",B86,\" Found \",VLOOKUP(A86,'Finding report'!$B:$F,5,0),\" due to normal wear and tear\"))","v":{"$error":"#N/A"}}]
[{"$nulls":4},{"$f":"IF(VLOOKUP(A87,'Finding report'!$B:$F,5,0)=\"Mandatory replacement\",CONCATENATE(VLOOKUP(A87,'Finding report'!$B:$C,2,0),\" PN \",IF(RIGHT(A87,1)=\"R\",LEFT(A87,LEN(A87)-1),A87),\" Qty \",B87,\" to be replaced due to mandatory replacement as per CMM\"),CONCATENATE(VLOOKUP(A87,'Finding report'!$B:$C,2,0),\" PN \",IF(RIGHT(A87,1)=\"R\",LEFT(A87,LEN(A87)-1),A87),\" Qty \",B87,\" Found \",VLOOKUP(A87,'Finding report'!$B:$F,5,0),\" due to normal wear and tear\"))","v":{"$error":"#N/A"}}]
[{"$nulls":4},{"$f":"IF(VLOOKUP(A88,'Finding report'!$B:$F,5,0)=\"Mandatory replacement\",CONCATENATE(VLOOKUP(A88,'Finding report'!$B:$C,2,0),\" PN \",IF(RIGHT(A88,1)=\"R\",LEFT(A88,LEN(A88)-1),A88),\" Qty \",B88,\" to be replaced due to mandatory replacement as per CMM\"),CONCATENATE(VLOOKUP(A88,'Finding report'!$B:$C,2,0),\" PN \",IF(RIGHT(A88,1)=\"R\",LEFT(A88,LEN(A88)-1),A88),\" Qty \",B88,\" Found \",VLOOKUP(A88,'Finding report'!$B:$F,5,0),\" due to normal wear and tear\"))","v":{"$error":"#N/A"}}]
[{"$nulls":4},{"$f":"IF(VLOOKUP(A89,'Finding report'!$B:$F,5,0)=\"Mandatory replacement\",CONCATENATE(VLOOKUP(A89,'Finding report'!$B:$C,2,0),\" PN \",IF(RIGHT(A89,1)=\"R\",LEFT(A89,LEN(A89)-1),A89),\" Qty \",B89,\" to be replaced due to mandatory replacement as per CMM\"),CONCATENATE(VLOOKUP(A89,'Finding report'!$B:$C,2,0),\" PN \",IF(RIGHT(A89,1)=\"R\",LEFT(A89,LEN(A89)-1),A89),\" Qty \",B89,\" Found \",VLOOKUP(A89,'Finding report'!$B:$F,5,0),\" due to normal wear and tear\"))","v":{"$error":"#N/A"}}]
[{"$nulls":4},{"$f":"IF(VLOOKUP(A90,'Finding report'!$B:$F,5,0)=\"Mandatory replacement\",CONCATENATE(VLOOKUP(A90,'Finding report'!$B:$C,2,0),\" PN \",IF(RIGHT(A90,1)=\"R\",LEFT(A90,LEN(A90)-1),A90),\" Qty \",B90,\" to be replaced due to mandatory replacement as per CMM\"),CONCATENATE(VLOOKUP(A90,'Finding report'!$B:$C,2,0),\" PN \",IF(RIGHT(A90,1)=\"R\",LEFT(A90,LEN(A90)-1),A90),\" Qty \",B90,\" Found \",VLOOKUP(A90,'Finding report'!$B:$F,5,0),\" due to normal wear and tear\"))","v":{"$error":"#N/A"}}]
[{"$nulls":4},{"$f":"IF(VLOOKUP(A91,'Finding report'!$B:$F,5,0)=\"Mandatory replacement\",CONCATENATE(VLOOKUP(A91,'Finding report'!$B:$C,2,0),\" PN \",IF(RIGHT(A91,1)=\"R\",LEFT(A91,LEN(A91)-1),A91),\" Qty \",B91,\" to be replaced due to mandatory replacement as per CMM\"),CONCATENATE(VLOOKUP(A91,'Finding report'!$B:$C,2,0),\" PN \",IF(RIGHT(A91,1)=\"R\",LEFT(A91,LEN(A91)-1),A91),\" Qty \",B91,\" Found \",VLOOKUP(A91,'Finding report'!$B:$F,5,0),\" due to normal wear and tear\"))","v":{"$error":"#N/A"}}]
[{"$nulls":4},{"$f":"IF(VLOOKUP(A92,'Finding report'!$B:$F,5,0)=\"Mandatory replacement\",CONCATENATE(VLOOKUP(A92,'Finding report'!$B:$C,2,0),\" PN \",IF(RIGHT(A92,1)=\"R\",LEFT(A92,LEN(A92)-1),A92),\" Qty \",B92,\" to be replaced due to mandatory replacement as per CMM\"),CONCATENATE(VLOOKUP(A92,'Finding report'!$B:$C,2,0),\" PN \",IF(RIGHT(A92,1)=\"R\",LEFT(A92,LEN(A92)-1),A92),\" Qty \",B92,\" Found \",VLOOKUP(A92,'Finding report'!$B:$F,5,0),\" due to normal wear and tear\"))","v":{"$error":"#N/A"}}]
[{"$nulls":4},{"$f":"IF(VLOOKUP(A93,'Finding report'!$B:$F,5,0)=\"Mandatory replacement\",CONCATENATE(VLOOKUP(A93,'Finding report'!$B:$C,2,0),\" PN \",IF(RIGHT(A93,1)=\"R\",LEFT(A93,LEN(A93)-1),A93),\" Qty \",B93,\" to be replaced due to mandatory replacement as per CMM\"),CONCATENATE(VLOOKUP(A93,'Finding report'!$B:$C,2,0),\" PN \",IF(RIGHT(A93,1)=\"R\",LEFT(A93,LEN(A93)-1),A93),\" Qty \",B93,\" Found \",VLOOKUP(A93,'Finding report'!$B:$F,5,0),\" due to normal wear and tear\"))","v":{"$error":"#N/A"}}]
[{"$nulls":4},{"$f":"IF(VLOOKUP(A94,'Finding report'!$B:$F,5,0)=\"Mandatory replacement\",CONCATENATE(VLOOKUP(A94,'Finding report'!$B:$C,2,0),\" PN \",IF(RIGHT(A94,1)=\"R\",LEFT(A94,LEN(A94)-1),A94),\" Qty \",B94,\" to be replaced due to mandatory replacement as per CMM\"),CONCATENATE(VLOOKUP(A94,'Finding report'!$B:$C,2,0),\" PN \",IF(RIGHT(A94,1)=\"R\",LEFT(A94,LEN(A94)-1),A94),\" Qty \",B94,\" Found \",VLOOKUP(A94,'Finding report'!$B:$F,5,0),\" due to normal wear and tear\"))","v":{"$error":"#N/A"}}]
[{"$nulls":4},{"$f":"IF(VLOOKUP(A95,'Finding report'!$B:$F,5,0)=\"Mandatory replacement\",CONCATENATE(VLOOKUP(A95,'Finding report'!$B:$C,2,0),\" PN \",IF(RIGHT(A95,1)=\"R\",LEFT(A95,LEN(A95)-1),A95),\" Qty \",B95,\" to be replaced due to mandatory replacement as per CMM\"),CONCATENATE(VLOOKUP(A95,'Finding report'!$B:$C,2,0),\" PN \",IF(RIGHT(A95,1)=\"R\",LEFT(A95,LEN(A95)-1),A95),\" Qty \",B95,\" Found \",VLOOKUP(A95,'Finding report'!$B:$F,5,0),\" due to normal wear and tear\"))","v":{"$error":"#N/A"}}]
[{"$nulls":4},{"$f":"IF(VLOOKUP(A96,'Finding report'!$B:$F,5,0)=\"Mandatory replacement\",CONCATENATE(VLOOKUP(A96,'Finding report'!$B:$C,2,0),\" PN \",IF(RIGHT(A96,1)=\"R\",LEFT(A96,LEN(A96)-1),A96),\" Qty \",B96,\" to be replaced due to mandatory replacement as per CMM\"),CONCATENATE(VLOOKUP(A96,'Finding report'!$B:$C,2,0),\" PN \",IF(RIGHT(A96,1)=\"R\",LEFT(A96,LEN(A96)-1),A96),\" Qty \",B96,\" Found \",VLOOKUP(A96,'Finding report'!$B:$F,5,0),\" due to normal wear and tear\"))","v":{"$error":"#N/A"}}]
[{"$nulls":4},{"$f":"IF(VLOOKUP(A97,'Finding report'!$B:$F,5,0)=\"Mandatory replacement\",CONCATENATE(VLOOKUP(A97,'Finding report'!$B:$C,2,0),\" PN \",IF(RIGHT(A97,1)=\"R\",LEFT(A97,LEN(A97)-1),A97),\" Qty \",B97,\" to be replaced due to mandatory replacement as per CMM\"),CONCATENATE(VLOOKUP(A97,'Finding report'!$B:$C,2,0),\" PN \",IF(RIGHT(A97,1)=\"R\",LEFT(A97,LEN(A97)-1),A97),\" Qty \",B97,\" Found \",VLOOKUP(A97,'Finding report'!$B:$F,5,0),\" due to normal wear and tear\"))","v":{"$error":"#N/A"}}]
[{"$nulls":4},{"$f":"IF(VLOOKUP(A98,'Finding report'!$B:$F,5,0)=\"Mandatory replacement\",CONCATENATE(VLOOKUP(A98,'Finding report'!$B:$C,2,0),\" PN \",IF(RIGHT(A98,1)=\"R\",LEFT(A98,LEN(A98)-1),A98),\" Qty \",B98,\" to be replaced due to mandatory replacement as per CMM\"),CONCATENATE(VLOOKUP(A98,'Finding report'!$B:$C,2,0),\" PN \",IF(RIGHT(A98,1)=\"R\",LEFT(A98,LEN(A98)-1),A98),\" Qty \",B98,\" Found \",VLOOKUP(A98,'Finding report'!$B:$F,5,0),\" due to normal wear and tear\"))","v":{"$error":"#N/A"}}]
[{"$nulls":4},{"$f":"IF(VLOOKUP(A99,'Finding report'!$B:$F,5,0)=\"Mandatory replacement\",CONCATENATE(VLOOKUP(A99,'Finding report'!$B:$C,2,0),\" PN \",IF(RIGHT(A99,1)=\"R\",LEFT(A99,LEN(A99)-1),A99),\" Qty \",B99,\" to be replaced due to mandatory replacement as per CMM\"),CONCATENATE(VLOOKUP(A99,'Finding report'!$B:$C,2,0),\" PN \",IF(RIGHT(A99,1)=\"R\",LEFT(A99,LEN(A99)-1),A99),\" Qty \",B99,\" Found \",VLOOKUP(A99,'Finding report'!$B:$F,5,0),\" due to normal wear and tear\"))","v":{"$error":"#N/A"}}]
[{"$nulls":4},{"$f":"IF(VLOOKUP(A100,'Finding report'!$B:$F,5,0)=\"Mandatory replacement\",CONCATENATE(VLOOKUP(A100,'Finding report'!$B:$C,2,0),\" PN \",IF(RIGHT(A100,1)=\"R\",LEFT(A100,LEN(A100)-1),A100),\" Qty \",B100,\" to be replaced due to mandatory replacement as per CMM\"),CONCATENATE(VLOOKUP(A100,'Finding report'!$B:$C,2,0),\" PN \",IF(RIGHT(A100,1)=\"R\",LEFT(A100,LEN(A100)-1),A100),\" Qty \",B100,\" Found \",VLOOKUP(A100,'Finding report'!$B:$F,5,0),\" due to normal wear and tear\"))","v":{"$error":"#N/A"}}]

{"sheet":"TCD MM","index":5,"n_rows":27,"n_cols":5,"rows_kept":27}
["Source of default","Misuse/mishandeling"]
["Nature of finding","(Plusieurs éléments)"]
[]
["Étiquettes de lignes","Somme de Qty"]
["(vide)",{"$nulls":3},{"$f":"CONCATENATE(VLOOKUP(A5,'Finding report'!$B:$C,2,0),\" PN \",IF(RIGHT(A5,1)=\"R\",LEFT(A5,LEN(A5)-1),A5),\" Qty \",B5,\" Found \",VLOOKUP(A5,'Finding report'!$B:$F,5,0),\" due to Misuse or mishandeling\")","v":{"$error":"#N/A"}}]
["SB3-070-002-01",1,null,null,{"$f":"CONCATENATE(VLOOKUP(A6,'Finding report'!$B:$C,2,0),\" PN \",IF(RIGHT(A6,1)=\"R\",LEFT(A6,LEN(A6)-1),A6),\" Found \",VLOOKUP(A6,'Finding report'!$B:$F,5,0),\" due to Misuse or mishandeling\")","v":"HEAD LAP BLOCK PN SB3-070-002-01 Found Broken due to Misuse or mishandeling"}]
["Total général",1,null,null,{"$f":"CONCATENATE(VLOOKUP(A7,'Finding report'!$B:$C,2,0),\" PN \",IF(RIGHT(A7,1)=\"R\",LEFT(A7,LEN(A7)-1),A7),\" Found \",VLOOKUP(A7,'Finding report'!$B:$F,5,0),\" due to Misuse or mishandeling\")","v":{"$error":"#N/A"}}]
[{"$nulls":4},{"$f":"CONCATENATE(VLOOKUP(A8,'Finding report'!$B:$C,2,0),\" PN \",IF(RIGHT(A8,1)=\"R\",LEFT(A8,LEN(A8)-1),A8),\" Found \",VLOOKUP(A8,'Finding report'!$B:$F,5,0),\" due to Misuse or mishandeling\")","v":{"$error":"#N/A"}}]
[{"$nulls":4},{"$f":"CONCATENATE(VLOOKUP(A9,'Finding report'!$B:$C,2,0),\" PN \",IF(RIGHT(A9,1)=\"R\",LEFT(A9,LEN(A9)-1),A9),\" Found \",VLOOKUP(A9,'Finding report'!$B:$F,5,0),\" due to Misuse or mishandeling\")","v":{"$error":"#N/A"}}]
[{"$nulls":4},{"$f":"CONCATENATE(VLOOKUP(A10,'Finding report'!$B:$C,2,0),\" PN \",IF(RIGHT(A10,1)=\"R\",LEFT(A10,LEN(A10)-1),A10),\" Found \",VLOOKUP(A10,'Finding report'!$B:$F,5,0),\" due to Misuse or mishandeling\")","v":{"$error":"#N/A"}}]
[{"$nulls":4},{"$f":"CONCATENATE(VLOOKUP(A11,'Finding report'!$B:$C,2,0),\" PN \",IF(RIGHT(A11,1)=\"R\",LEFT(A11,LEN(A11)-1),A11),\" Found \",VLOOKUP(A11,'Finding report'!$B:$F,5,0),\" due to Misuse or mishandeling\")","v":{"$error":"#N/A"}}]
[{"$nulls":4},{"$f":"CONCATENATE(VLOOKUP(A12,'Finding report'!$B:$C,2,0),\" PN \",IF(RIGHT(A12,1)=\"R\",LEFT(A12,LEN(A12)-1),A12),\" Found \",VLOOKUP(A12,'Finding report'!$B:$F,5,0),\" due to Misuse or mishandeling\")","v":{"$error":"#N/A"}}]
[{"$nulls":4},{"$f":"CONCATENATE(VLOOKUP(A13,'Finding report'!$B:$C,2,0),\" PN \",IF(RIGHT(A13,1)=\"R\",LEFT(A13,LEN(A13)-1),A13),\" Found \",VLOOKUP(A13,'Finding report'!$B:$F,5,0),\" due to Misuse or mishandeling\")","v":{"$error":"#N/A"}}]
[{"$nulls":4},{"$f":"CONCATENATE(VLOOKUP(A14,'Finding report'!$B:$C,2,0),\" PN \",IF(RIGHT(A14,1)=\"R\",LEFT(A14,LEN(A14)-1),A14),\" Found \",VLOOKUP(A14,'Finding report'!$B:$F,5,0),\" due to Misuse or mishandeling\")","v":{"$error":"#N/A"}}]
[{"$nulls":4},{"$f":"CONCATENATE(VLOOKUP(A15,'Finding report'!$B:$C,2,0),\" PN \",IF(RIGHT(A15,1)=\"R\",LEFT(A15,LEN(A15)-1),A15),\" Found \",VLOOKUP(A15,'Finding report'!$B:$F,5,0),\" due to Misuse or mishandeling\")","v":{"$error":"#N/A"}}]
[{"$nulls":4},{"$f":"CONCATENATE(VLOOKUP(A16,'Finding report'!$B:$C,2,0),\" PN \",IF(RIGHT(A16,1)=\"R\",LEFT(A16,LEN(A16)-1),A16),\" Found \",VLOOKUP(A16,'Finding report'!$B:$F,5,0),\" due to Misuse or mishandeling\")","v":{"$error":"#N/A"}}]
[{"$nulls":4},{"$f":"CONCATENATE(VLOOKUP(A17,'Finding report'!$B:$C,2,0),\" PN \",IF(RIGHT(A17,1)=\"R\",LEFT(A17,LEN(A17)-1),A17),\" Found \",VLOOKUP(A17,'Finding report'!$B:$F,5,0),\" due to Misuse or mishandeling\")","v":{"$error":"#N/A"}}]
[{"$nulls":4},{"$f":"CONCATENATE(VLOOKUP(A18,'Finding report'!$B:$C,2,0),\" PN \",IF(RIGHT(A18,1)=\"R\",LEFT(A18,LEN(A18)-1),A18),\" Found \",VLOOKUP(A18,'Finding report'!$B:$F,5,0),\" due to Misuse or mishandeling\")","v":{"$error":"#N/A"}}]
[{"$nulls":4},{"$f":"CONCATENATE(VLOOKUP(A19,'Finding report'!$B:$C,2,0),\" PN \",IF(RIGHT(A19,1)=\"R\",LEFT(A19,LEN(A19)-1),A19),\" Found \",VLOOKUP(A19,'Finding report'!$B:$F,5,0),\" due to Misuse or mishandeling\")","v":{"$error":"#N/A"}}]
[{"$nulls":4},{"$f":"CONCATENATE(VLOOKUP(A20,'Finding report'!$B:$C,2,0),\" PN \",IF(RIGHT(A20,1)=\"R\",LEFT(A20,LEN(A20)-1),A20),\" Found \",VLOOKUP(A20,'Finding report'!$B:$F,5,0),\" due to Misuse or mishandeling\")","v":{"$error":"#N/A"}}]
[{"$nulls":4},{"$f":"CONCATENATE(VLOOKUP(A21,'Finding report'!$B:$C,2,0),\" PN \",IF(RIGHT(A21,1)=\"R\",LEFT(A21,LEN(A21)-1),A21),\" Found \",VLOOKUP(A21,'Finding report'!$B:$F,5,0),\" due to Misuse or mishandeling\")","v":{"$error":"#N/A"}}]
[{"$nulls":4},{"$f":"CONCATENATE(VLOOKUP(A22,'Finding report'!$B:$C,2,0),\" PN \",IF(RIGHT(A22,1)=\"R\",LEFT(A22,LEN(A22)-1),A22),\" Found \",VLOOKUP(A22,'Finding report'!$B:$F,5,0),\" due to Misuse or mishandeling\")","v":{"$error":"#N/A"}}]
[{"$nulls":4},{"$f":"CONCATENATE(VLOOKUP(A23,'Finding report'!$B:$C,2,0),\" PN \",IF(RIGHT(A23,1)=\"R\",LEFT(A23,LEN(A23)-1),A23),\" Found \",VLOOKUP(A23,'Finding report'!$B:$F,5,0),\" due to Misuse or mishandeling\")","v":{"$error":"#N/A"}}]
[{"$nulls":4},{"$f":"CONCATENATE(VLOOKUP(A24,'Finding report'!$B:$C,2,0),\" PN \",IF(RIGHT(A24,1)=\"R\",LEFT(A24,LEN(A24)-1),A24),\" Found \",VLOOKUP(A24,'Finding report'!$B:$F,5,0),\" due to Misuse or mishandeling\")","v":{"$error":"#N/A"}}]
[{"$nulls":4},{"$f":"CONCATENATE(VLOOKUP(A25,'Finding report'!$B:$C,2,0),\" PN \",IF(RIGHT(A25,1)=\"R\",LEFT(A25,LEN(A25)-1),A25),\" Found \",VLOOKUP(A25,'Finding report'!$B:$F,5,0),\" due to Misuse or mishandeling\")","v":{"$error":"#N/A"}}]
[{"$nulls":4},{"$f":"CONCATENATE(VLOOKUP(A26,'Finding report'!$B:$C,2,0),\" PN \",IF(RIGHT(A26,1)=\"R\",LEFT(A26,LEN(A26)-1),A26),\" Found \",VLOOKUP(A26,'Finding report'!$B:$F,5,0),\" due to Misuse or mishandeling\")","v":{"$error":"#N/A"}}]
[{"$nulls":4},{"$f":"CONCATENATE(VLOOKUP(A27,'Finding report'!$B:$C,2,0),\" PN \",IF(RIGHT(A27,1)=\"R\",LEFT(A27,LEN(A27)-1),A27),\" Found \",VLOOKUP(A27,'Finding report'!$B:$F,5,0),\" due to Misuse or mishandeling\")","v":{"$error":"#N/A"}}]

{"sheet":"TCD Missing","index":6,"n_rows":123,"n_cols":5,"rows_kept":123}
["Nature of finding","Missing"]
[]
["Étiquettes de lignes","Somme de Qty"]
["(vide)",{"$nulls":3},{"$f":"CONCATENATE(VLOOKUP(A4,'Finding report'!$B:$C,2,0),\" PN \",IF(RIGHT(A4,1)=\"R\",LEFT(A4,LEN(A4)-1),A4),\" Qty \",SUMIF('Finding report'!$B:$B,A4,'Finding report'!D:D),\" Found missing\")","v":{"$error":"#N/A"}}]
["8526-1348",4,null,null,{"$f":"CONCATENATE(VLOOKUP(A5,'Finding report'!$B:$C,2,0),\" PN \",IF(RIGHT(A5,1)=\"R\",LEFT(A5,LEN(A5)-1),A5),\" Qty \",SUMIF('Finding report'!$B:$B,A5,'Finding report'!D:D),\" Found missing\")","v":"CONTACT PN 8526-1348 Qty 7 Found missing"}]
["NYC0S0L4",2,null,null,{"$f":"CONCATENATE(VLOOKUP(A6,'Finding report'!$B:$C,2,0),\" PN \",IF(RIGHT(A6,1)=\"R\",LEFT(A6,LEN(A6)-1),A6),\" Qty \",SUMIF('Finding report'!$B:$B,A6,'Finding report'!D:D),\" Found missing\")","v":"SOLVANT PN NYC0S0L4 Qty 2 Found missing"}]
["Total général",6,null,null,{"$f":"CONCATENATE(VLOOKUP(A7,'Finding report'!$B:$C,2,0),\" PN \",IF(RIGHT(A7,1)=\"R\",LEFT(A7,LEN(A7)-1),A7),\" Qty \",SUMIF('Finding report'!$B:$B,A7,'Finding report'!D:D),\" Found missing\")","v":{"$error":"#N/A"}}]
[{"$nulls":4},{"$f":"CONCATENATE(VLOOKUP(A8,'Finding report'!$B:$C,2,0),\" PN \",IF(RIGHT(A8,1)=\"R\",LEFT(A8,LEN(A8)-1),A8),\" Qty \",SUMIF('Finding report'!$B:$B,A8,'Finding report'!D:D),\" Found missing\")","v":{"$error":"#N/A"}}]
[{"$nulls":4},{"$f":"CONCATENATE(VLOOKUP(A9,'Finding report'!$B:$C,2,0),\" PN \",IF(RIGHT(A9,1)=\"R\",LEFT(A9,LEN(A9)-1),A9),\" Qty \",SUMIF('Finding report'!$B:$B,A9,'Finding report'!D:D),\" Found missing\")","v":{"$error":"#N/A"}}]
[{"$nulls":4},{"$f":"CONCATENATE(VLOOKUP(A10,'Finding report'!$B:$C,2,0),\" PN \",IF(RIGHT(A10,1)=\"R\",LEFT(A10,LEN(A10)-1),A10),\" Qty \",SUMIF('Finding report'!$B:$B,A10,'Finding report'!D:D),\" Found missing\")","v":{"$error":"#N/A"}}]
[{"$nulls":4},{"$f":"CONCATENATE(VLOOKUP(A11,'Finding report'!$B:$C,2,0),\" PN \",IF(RIGHT(A11,1)=\"R\",LEFT(A11,LEN(A11)-1),A11),\" Qty \",SUMIF('Finding report'!$B:$B,A11,'Finding report'!D:D),\" Found missing\")","v":{"$error":"#N/A"}}]
[{"$nulls":4},{"$f":"CONCATENATE(VLOOKUP(A12,'Finding report'!$B:$C,2,0),\" PN \",IF(RIGHT(A12,1)=\"R\",LEFT(A12,LEN(A12)-1),A12),\" Qty \",SUMIF('Finding report'!$B:$B,A12,'Finding report'!D:D),\" Found missing\")","v":{"$error":"#N/A"}}]
[{"$nulls":4},{"$f":"CONCATENATE(VLOOKUP(A13,'Finding report'!$B:$C,2,0),\" PN \",IF(RIGHT(A13,1)=\"R\",LEFT(A13,LEN(A13)-1),A13),\" Qty \",SUMIF('Finding report'!$B:$B,A13,'Finding report'!D:D),\" Found missing\")","v":{"$error":"#N/A"}}]
[{"$nulls":4},{"$f":"CONCATENATE(VLOOKUP(A14,'Finding report'!$B:$C,2,0),\" PN \",IF(RIGHT(A14,1)=\"R\",LEFT(A14,LEN(A14)-1),A14),\" Qty \",SUMIF('Finding report'!$B:$B,A14,'Finding report'!D:D),\" Found missing\")","v":{"$error":"#N/A"}}]
[{"$nulls":4},{"$f":"CONCATENATE(VLOOKUP(A15,'Finding report'!$B:$C,2,0),\" PN \",IF(RIGHT(A15,1)=\"R\",LEFT(A15,LEN(A15)-1),A15),\" Qty \",SUMIF('Finding report'!$B:$B,A15,'Finding report'!D:D),\" Found missing\")","v":{"$error":"#N/A"}}]
[{"$nulls":4},{"$f":"CONCATENATE(VLOOKUP(A16,'Finding report'!$B:$C,2,0),\" PN \",IF(RIGHT(A16,1)=\"R\",LEFT(A16,LEN(A16)-1),A16),\" Qty \",SUMIF('Finding report'!$B:$B,A16,'Finding report'!D:D),\" Found missing\")","v":{"$error":"#N/A"}}]
[{"$nulls":4},{"$f":"CONCATENATE(VLOOKUP(A17,'Finding report'!$B:$C,2,0),\" PN \",IF(RIGHT(A17,1)=\"R\",LEFT(A17,LEN(A17)-1),A17),\" Qty \",SUMIF('Finding report'!$B:$B,A17,'Finding report'!D:D),\" Found missing\")","v":{"$error":"#N/A"}}]
[{"$nulls":4},{"$f":"CONCATENATE(VLOOKUP(A18,'Finding report'!$B:$C,2,0),\" PN \",IF(RIGHT(A18,1)=\"R\",LEFT(A18,LEN(A18)-1),A18),\" Qty \",SUMIF('Finding report'!$B:$B,A18,'Finding report'!D:D),\" Found missing\")","v":{"$error":"#N/A"}}]
[{"$nulls":4},{"$f":"CONCATENATE(VLOOKUP(A19,'Finding report'!$B:$C,2,0),\" PN \",IF(RIGHT(A19,1)=\"R\",LEFT(A19,LEN(A19)-1),A19),\" Qty \",SUMIF('Finding report'!$B:$B,A19,'Finding report'!D:D),\" Found missing\")","v":{"$error":"#N/A"}}]
[{"$nulls":4},{"$f":"CONCATENATE(VLOOKUP(A20,'Finding report'!$B:$C,2,0),\" PN \",IF(RIGHT(A20,1)=\"R\",LEFT(A20,LEN(A20)-1),A20),\" Qty \",SUMIF('Finding report'!$B:$B,A20,'Finding report'!D:D),\" Found missing\")","v":{"$error":"#N/A"}}]
[{"$nulls":4},{"$f":"CONCATENATE(VLOOKUP(A21,'Finding report'!$B:$C,2,0),\" PN \",IF(RIGHT(A21,1)=\"R\",LEFT(A21,LEN(A21)-1),A21),\" Qty \",SUMIF('Finding report'!$B:$B,A21,'Finding report'!D:D),\" Found missing\")","v":{"$error":"#N/A"}}]
[{"$nulls":4},{"$f":"CONCATENATE(VLOOKUP(A22,'Finding report'!$B:$C,2,0),\" PN \",IF(RIGHT(A22,1)=\"R\",LEFT(A22,LEN(A22)-1),A22),\" Qty \",SUMIF('Finding report'!$B:$B,A22,'Finding report'!D:D),\" Found missing\")","v":{"$error":"#N/A"}}]
[{"$nulls":4},{"$f":"CONCATENATE(VLOOKUP(A23,'Finding report'!$B:$C,2,0),\" PN \",IF(RIGHT(A23,1)=\"R\",LEFT(A23,LEN(A23)-1),A23),\" Qty \",SUMIF('Finding report'!$B:$B,A23,'Finding report'!D:D),\" Found missing\")","v":{"$error":"#N/A"}}]
[{"$nulls":4},{"$f":"CONCATENATE(VLOOKUP(A24,'Finding report'!$B:$C,2,0),\" PN \",IF(RIGHT(A24,1)=\"R\",LEFT(A24,LEN(A24)-1),A24),\" Qty \",SUMIF('Finding report'!$B:$B,A24,'Finding report'!D:D),\" Found missing\")","v":{"$error":"#N/A"}}]
[{"$nulls":4},{"$f":"CONCATENATE(VLOOKUP(A25,'Finding report'!$B:$C,2,0),\" PN \",IF(RIGHT(A25,1)=\"R\",LEFT(A25,LEN(A25)-1),A25),\" Qty \",SUMIF('Finding report'!$B:$B,A25,'Finding report'!D:D),\" Found missing\")","v":{"$error":"#N/A"}}]
[{"$nulls":4},{"$f":"CONCATENATE(VLOOKUP(A26,'Finding report'!$B:$C,2,0),\" PN \",IF(RIGHT(A26,1)=\"R\",LEFT(A26,LEN(A26)-1),A26),\" Qty \",SUMIF('Finding report'!$B:$B,A26,'Finding report'!D:D),\" Found missing\")","v":{"$error":"#N/A"}}]
[{"$nulls":4},{"$f":"CONCATENATE(VLOOKUP(A27,'Finding report'!$B:$C,2,0),\" PN \",IF(RIGHT(A27,1)=\"R\",LEFT(A27,LEN(A27)-1),A27),\" Qty \",SUMIF('Finding report'!$B:$B,A27,'Finding report'!D:D),\" Found missing\")","v":{"$error":"#N/A"}}]
[{"$nulls":4},{"$f":"CONCATENATE(VLOOKUP(A28,'Finding report'!$B:$C,2,0),\" PN \",IF(RIGHT(A28,1)=\"R\",LEFT(A28,LEN(A28)-1),A28),\" Qty \",SUMIF('Finding report'!$B:$B,A28,'Finding report'!D:D),\" Found missing\")","v":{"$error":"#N/A"}}]
[{"$nulls":4},{"$f":"CONCATENATE(VLOOKUP(A29,'Finding report'!$B:$C,2,0),\" PN \",IF(RIGHT(A29,1)=\"R\",LEFT(A29,LEN(A29)-1),A29),\" Qty \",SUMIF('Finding report'!$B:$B,A29,'Finding report'!D:D),\" Found missing\")","v":{"$error":"#N/A"}}]
[{"$nulls":4},{"$f":"CONCATENATE(VLOOKUP(A30,'Finding report'!$B:$C,2,0),\" PN \",IF(RIGHT(A30,1)=\"R\",LEFT(A30,LEN(A30)-1),A30),\" Qty \",SUMIF('Finding report'!$B:$B,A30,'Finding report'!D:D),\" Found missing\")","v":{"$error":"#N/A"}}]
[{"$nulls":4},{"$f":"CONCATENATE(VLOOKUP(A31,'Finding report'!$B:$C,2,0),\" PN \",IF(RIGHT(A31,1)=\"R\",LEFT(A31,LEN(A31)-1),A31),\" Qty \",SUMIF('Finding report'!$B:$B,A31,'Finding report'!D:D),\" Found missing\")","v":{"$error":"#N/A"}}]
[{"$nulls":4},{"$f":"CONCATENATE(VLOOKUP(A32,'Finding report'!$B:$C,2,0),\" PN \",IF(RIGHT(A32,1)=\"R\",LEFT(A32,LEN(A32)-1),A32),\" Qty \",SUMIF('Finding report'!$B:$B,A32,'Finding report'!D:D),\" Found missing\")","v":{"$error":"#N/A"}}]
[{"$nulls":4},{"$f":"CONCATENATE(VLOOKUP(A33,'Finding report'!$B:$C,2,0),\" PN \",IF(RIGHT(A33,1)=\"R\",LEFT(A33,LEN(A33)-1),A33),\" Qty \",SUMIF('Finding report'!$B:$B,A33,'Finding report'!D:D),\" Found missing\")","v":{"$error":"#N/A"}}]
[{"$nulls":4},{"$f":"CONCATENATE(VLOOKUP(A34,'Finding report'!$B:$C,2,0),\" PN \",IF(RIGHT(A34,1)=\"R\",LEFT(A34,LEN(A34)-1),A34),\" Qty \",SUMIF('Finding report'!$B:$B,A34,'Finding report'!D:D),\" Found missing\")","v":{"$error":"#N/A"}}]
[{"$nulls":4},{"$f":"CONCATENATE(VLOOKUP(A35,'Finding report'!$B:$C,2,0),\" PN \",IF(RIGHT(A35,1)=\"R\",LEFT(A35,LEN(A35)-1),A35),\" Qty \",SUMIF('Finding report'!$B:$B,A35,'Finding report'!D:D),\" Found missing\")","v":{"$error":"#N/A"}}]
[{"$nulls":4},{"$f":"CONCATENATE(VLOOKUP(A36,'Finding report'!$B:$C,2,0),\" PN \",IF(RIGHT(A36,1)=\"R\",LEFT(A36,LEN(A36)-1),A36),\" Qty \",SUMIF('Finding report'!$B:$B,A36,'Finding report'!D:D),\" Found missing\")","v":{"$error":"#N/A"}}]
[{"$nulls":4},{"$f":"CONCATENATE(VLOOKUP(A37,'Finding report'!$B:$C,2,0),\" PN \",IF(RIGHT(A37,1)=\"R\",LEFT(A37,LEN(A37)-1),A37),\" Qty \",SUMIF('Finding report'!$B:$B,A37,'Finding report'!D:D),\" Found missing\")","v":{"$error":"#N/A"}}]
[{"$nulls":4},{"$f":"CONCATENATE(VLOOKUP(A38,'Finding report'!$B:$C,2,0),\" PN \",IF(RIGHT(A38,1)=\"R\",LEFT(A38,LEN(A38)-1),A38),\" Qty \",SUMIF('Finding report'!$B:$B,A38,'Finding report'!D:D),\" Found missing\")","v":{"$error":"#N/A"}}]
[{"$nulls":4},{"$f":"CONCATENATE(VLOOKUP(A39,'Finding report'!$B:$C,2,0),\" PN \",IF(RIGHT(A39,1)=\"R\",LEFT(A39,LEN(A39)-1),A39),\" Qty \",SUMIF('Finding report'!$B:$B,A39,'Finding report'!D:D),\" Found missing\")","v":{"$error":"#N/A"}}]
[{"$nulls":4},{"$f":"CONCATENATE(VLOOKUP(A40,'Finding report'!$B:$C,2,0),\" PN \",IF(RIGHT(A40,1)=\"R\",LEFT(A40,LEN(A40)-1),A40),\" Qty \",SUMIF('Finding report'!$B:$B,A40,'Finding report'!D:D),\" Found missing\")","v":{"$error":"#N/A"}}]
[{"$nulls":4},{"$f":"CONCATENATE(VLOOKUP(A41,'Finding report'!$B:$C,2,0),\" PN \",IF(RIGHT(A41,1)=\"R\",LEFT(A41,LEN(A41)-1),A41),\" Qty \",SUMIF('Finding report'!$B:$B,A41,'Finding report'!D:D),\" Found missing\")","v":{"$error":"#N/A"}}]
[{"$nulls":4},{"$f":"CONCATENATE(VLOOKUP(A42,'Finding report'!$B:$C,2,0),\" PN \",IF(RIGHT(A42,1)=\"R\",LEFT(A42,LEN(A42)-1),A42),\" Qty \",SUMIF('Finding report'!$B:$B,A42,'Finding report'!D:D),\" Found missing\")","v":{"$error":"#N/A"}}]
[{"$nulls":4},{"$f":"CONCATENATE(VLOOKUP(A43,'Finding report'!$B:$C,2,0),\" PN \",IF(RIGHT(A43,1)=\"R\",LEFT(A43,LEN(A43)-1),A43),\" Qty \",SUMIF('Finding report'!$B:$B,A43,'Finding report'!D:D),\" Found missing\")","v":{"$error":"#N/A"}}]
[{"$nulls":4},{"$f":"CONCATENATE(VLOOKUP(A44,'Finding report'!$B:$C,2,0),\" PN \",IF(RIGHT(A44,1)=\"R\",LEFT(A44,LEN(A44)-1),A44),\" Qty \",SUMIF('Finding report'!$B:$B,A44,'Finding report'!D:D),\" Found missing\")","v":{"$error":"#N/A"}}]
[{"$nulls":4},{"$f":"CONCATENATE(VLOOKUP(A45,'Finding report'!$B:$C,2,0),\" PN \",IF(RIGHT(A45,1)=\"R\",LEFT(A45,LEN(A45)-1),A45),\" Qty \",SUMIF('Finding report'!$B:$B,A45,'Finding report'!D:D),\" Found missing\")","v":{"$error":"#N/A"}}]
[{"$nulls":4},{"$f":"CONCATENATE(VLOOKUP(A46,'Finding report'!$B:$C,2,0),\" PN \",IF(RIGHT(A46,1)=\"R\",LEFT(A46,LEN(A46)-1),A46),\" Qty \",SUMIF('Finding report'!$B:$B,A46,'Finding report'!D:D),\" Found missing\")","v":{"$error":"#N/A"}}]
[{"$nulls":4},{"$f":"CONCATENATE(VLOOKUP(A47,'Finding report'!$B:$C,2,0),\" PN \",IF(RIGHT(A47,1)=\"R\",LEFT(A47,LEN(A47)-1),A47),\" Qty \",SUMIF('Finding report'!$B:$B,A47,'Finding report'!D:D),\" Found missing\")","v":{"$error":"#N/A"}}]
[{"$nulls":4},{"$f":"CONCATENATE(VLOOKUP(A48,'Finding report'!$B:$C,2,0),\" PN \",IF(RIGHT(A48,1)=\"R\",LEFT(A48,LEN(A48)-1),A48),\" Qty \",SUMIF('Finding report'!$B:$B,A48,'Finding report'!D:D),\" Found missing\")","v":{"$error":"#N/A"}}]
[{"$nulls":4},{"$f":"CONCATENATE(VLOOKUP(A49,'Finding report'!$B:$C,2,0),\" PN \",IF(RIGHT(A49,1)=\"R\",LEFT(A49,LEN(A49)-1),A49),\" Qty \",SUMIF('Finding report'!$B:$B,A49,'Finding report'!D:D),\" Found missing\")","v":{"$error":"#N/A"}}]
[{"$nulls":4},{"$f":"CONCATENATE(VLOOKUP(A50,'Finding report'!$B:$C,2,0),\" PN \",IF(RIGHT(A50,1)=\"R\",LEFT(A50,LEN(A50)-1),A50),\" Qty \",SUMIF('Finding report'!$B:$B,A50,'Finding report'!D:D),\" Found missing\")","v":{"$error":"#N/A"}}]
[{"$nulls":4},{"$f":"CONCATENATE(VLOOKUP(A51,'Finding report'!$B:$C,2,0),\" PN \",IF(RIGHT(A51,1)=\"R\",LEFT(A51,LEN(A51)-1),A51),\" Qty \",SUMIF('Finding report'!$B:$B,A51,'Finding report'!D:D),\" Found missing\")","v":{"$error":"#N/A"}}]
[{"$nulls":4},{"$f":"CONCATENATE(VLOOKUP(A52,'Finding report'!$B:$C,2,0),\" PN \",IF(RIGHT(A52,1)=\"R\",LEFT(A52,LEN(A52)-1),A52),\" Qty \",SUMIF('Finding report'!$B:$B,A52,'Finding report'!D:D),\" Found missing\")","v":{"$error":"#N/A"}}]
[{"$nulls":4},{"$f":"CONCATENATE(VLOOKUP(A53,'Finding report'!$B:$C,2,0),\" PN \",IF(RIGHT(A53,1)=\"R\",LEFT(A53,LEN(A53)-1),A53),\" Qty \",SUMIF('Finding report'!$B:$B,A53,'Finding report'!D:D),\" Found missing\")","v":{"$error":"#N/A"}}]
[{"$nulls":4},{"$f":"CONCATENATE(VLOOKUP(A54,'Finding report'!$B:$C,2,0),\" PN \",IF(RIGHT(A54,1)=\"R\",LEFT(A54,LEN(A54)-1),A54),\" Qty \",SUMIF('Finding report'!$B:$B,A54,'Finding report'!D:D),\" Found missing\")","v":{"$error":"#N/A"}}]
[{"$nulls":4},{"$f":"CONCATENATE(VLOOKUP(A55,'Finding report'!$B:$C,2,0),\" PN \",IF(RIGHT(A55,1)=\"R\",LEFT(A55,LEN(A55)-1),A55),\" Qty \",SUMIF('Finding report'!$B:$B,A55,'Finding report'!D:D),\" Found missing\")","v":{"$error":"#N/A"}}]
[{"$nulls":4},{"$f":"CONCATENATE(VLOOKUP(A56,'Finding report'!$B:$C,2,0),\" PN \",IF(RIGHT(A56,1)=\"R\",LEFT(A56,LEN(A56)-1),A56),\" Qty \",SUMIF('Finding report'!$B:$B,A56,'Finding report'!D:D),\" Found missing\")","v":{"$error":"#N/A"}}]
[{"$nulls":4},{"$f":"CONCATENATE(VLOOKUP(A57,'Finding report'!$B:$C,2,0),\" PN \",IF(RIGHT(A57,1)=\"R\",LEFT(A57,LEN(A57)-1),A57),\" Qty \",SUMIF('Finding report'!$B:$B,A57,'Finding report'!D:D),\" Found missing\")","v":{"$error":"#N/A"}}]
[{"$nulls":4},{"$f":"CONCATENATE(VLOOKUP(A58,'Finding report'!$B:$C,2,0),\" PN \",IF(RIGHT(A58,1)=\"R\",LEFT(A58,LEN(A58)-1),A58),\" Qty \",SUMIF('Finding report'!$B:$B,A58,'Finding report'!D:D),\" Found missing\")","v":{"$error":"#N/A"}}]
[{"$nulls":4},{"$f":"CONCATENATE(VLOOKUP(A59,'Finding report'!$B:$C,2,0),\" PN \",IF(RIGHT(A59,1)=\"R\",LEFT(A59,LEN(A59)-1),A59),\" Qty \",SUMIF('Finding report'!$B:$B,A59,'Finding report'!D:D),\" Found missing\")","v":{"$error":"#N/A"}}]
[{"$nulls":4},{"$f":"CONCATENATE(VLOOKUP(A60,'Finding report'!$B:$C,2,0),\" PN \",IF(RIGHT(A60,1)=\"R\",LEFT(A60,LEN(A60)-1),A60),\" Qty \",SUMIF('Finding report'!$B:$B,A60,'Finding report'!D:D),\" Found missing\")","v":{"$error":"#N/A"}}]
[{"$nulls":4},{"$f":"CONCATENATE(VLOOKUP(A61,'Finding report'!$B:$C,2,0),\" PN \",IF(RIGHT(A61,1)=\"R\",LEFT(A61,LEN(A61)-1),A61),\" Qty \",SUMIF('Finding report'!$B:$B,A61,'Finding report'!D:D),\" Found missing\")","v":{"$error":"#N/A"}}]
[{"$nulls":4},{"$f":"CONCATENATE(VLOOKUP(A62,'Finding report'!$B:$C,2,0),\" PN \",IF(RIGHT(A62,1)=\"R\",LEFT(A62,LEN(A62)-1),A62),\" Qty \",SUMIF('Finding report'!$B:$B,A62,'Finding report'!D:D),\" Found missing\")","v":{"$error":"#N/A"}}]
[{"$nulls":4},{"$f":"CONCATENATE(VLOOKUP(A63,'Finding report'!$B:$C,2,0),\" PN \",IF(RIGHT(A63,1)=\"R\",LEFT(A63,LEN(A63)-1),A63),\" Qty \",SUMIF('Finding report'!$B:$B,A63,'Finding report'!D:D),\" Found missing\")","v":{"$error":"#N/A"}}]
[{"$nulls":4},{"$f":"CONCATENATE(VLOOKUP(A64,'Finding report'!$B:$C,2,0),\" PN \",IF(RIGHT(A64,1)=\"R\",LEFT(A64,LEN(A64)-1),A64),\" Qty \",SUMIF('Finding report'!$B:$B,A64,'Finding report'!D:D),\" Found missing\")","v":{"$error":"#N/A"}}]
[{"$nulls":4},{"$f":"CONCATENATE(VLOOKUP(A65,'Finding report'!$B:$C,2,0),\" PN \",IF(RIGHT(A65,1)=\"R\",LEFT(A65,LEN(A65)-1),A65),\" Qty \",SUMIF('Finding report'!$B:$B,A65,'Finding report'!D:D),\" Found missing\")","v":{"$error":"#N/A"}}]
[{"$nulls":4},{"$f":"CONCATENATE(VLOOKUP(A66,'Finding report'!$B:$C,2,0),\" PN \",IF(RIGHT(A66,1)=\"R\",LEFT(A66,LEN(A66)-1),A66),\" Qty \",SUMIF('Finding report'!$B:$B,A66,'Finding report'!D:D),\" Found missing\")","v":{"$error":"#N/A"}}]
[{"$nulls":4},{"$f":"CONCATENATE(VLOOKUP(A67,'Finding report'!$B:$C,2,0),\" PN \",IF(RIGHT(A67,1)=\"R\",LEFT(A67,LEN(A67)-1),A67),\" Qty \",SUMIF('Finding report'!$B:$B,A67,'Finding report'!D:D),\" Found missing\")","v":{"$error":"#N/A"}}]
[{"$nulls":4},{"$f":"CONCATENATE(VLOOKUP(A68,'Finding report'!$B:$C,2,0),\" PN \",IF(RIGHT(A68,1)=\"R\",LEFT(A68,LEN(A68)-1),A68),\" Qty \",SUMIF('Finding report'!$B:$B,A68,'Finding report'!D:D),\" Found missing\")","v":{"$error":"#N/A"}}]
[{"$nulls":4},{"$f":"CONCATENATE(VLOOKUP(A69,'Finding report'!$B:$C,2,0),\" PN \",IF(RIGHT(A69,1)=\"R\",LEFT(A69,LEN(A69)-1),A69),\" Qty \",SUMIF('Finding report'!$B:$B,A69,'Finding report'!D:D),\" Found missing\")","v":{"$error":"#N/A"}}]
[{"$nulls":4},{"$f":"CONCATENATE(VLOOKUP(A70,'Finding report'!$B:$C,2,0),\" PN \",IF(RIGHT(A70,1)=\"R\",LEFT(A70,LEN(A70)-1),A70),\" Qty \",SUMIF('Finding report'!$B:$B,A70,'Finding report'!D:D),\" Found missing\")","v":{"$error":"#N/A"}}]
[{"$nulls":4},{"$f":"CONCATENATE(VLOOKUP(A71,'Finding report'!$B:$C,2,0),\" PN \",IF(RIGHT(A71,1)=\"R\",LEFT(A71,LEN(A71)-1),A71),\" Qty \",SUMIF('Finding report'!$B:$B,A71,'Finding report'!D:D),\" Found missing\")","v":{"$error":"#N/A"}}]
[{"$nulls":4},{"$f":"CONCATENATE(VLOOKUP(A72,'Finding report'!$B:$C,2,0),\" PN \",IF(RIGHT(A72,1)=\"R\",LEFT(A72,LEN(A72)-1),A72),\" Qty \",SUMIF('Finding report'!$B:$B,A72,'Finding report'!D:D),\" Found missing\")","v":{"$error":"#N/A"}}]
[{"$nulls":4},{"$f":"CONCATENATE(VLOOKUP(A73,'Finding report'!$B:$C,2,0),\" PN \",IF(RIGHT(A73,1)=\"R\",LEFT(A73,LEN(A73)-1),A73),\" Qty \",SUMIF('Finding report'!$B:$B,A73,'Finding report'!D:D),\" Found missing\")","v":{"$error":"#N/A"}}]
[{"$nulls":4},{"$f":"CONCATENATE(VLOOKUP(A74,'Finding report'!$B:$C,2,0),\" PN \",IF(RIGHT(A74,1)=\"R\",LEFT(A74,LEN(A74)-1),A74),\" Qty \",SUMIF('Finding report'!$B:$B,A74,'Finding report'!D:D),\" Found missing\")","v":{"$error":"#N/A"}}]
[{"$nulls":4},{"$f":"CONCATENATE(VLOOKUP(A75,'Finding report'!$B:$C,2,0),\" PN \",IF(RIGHT(A75,1)=\"R\",LEFT(A75,LEN(A75)-1),A75),\" Qty \",SUMIF('Finding report'!$B:$B,A75,'Finding report'!D:D),\" Found missing\")","v":{"$error":"#N/A"}}]
[{"$nulls":4},{"$f":"CONCATENATE(VLOOKUP(A76,'Finding report'!$B:$C,2,0),\" PN \",IF(RIGHT(A76,1)=\"R\",LEFT(A76,LEN(A76)-1),A76),\" Qty \",SUMIF('Finding report'!$B:$B,A76,'Finding report'!D:D),\" Found missing\")","v":{"$error":"#N/A"}}]
[{"$nulls":4},{"$f":"CONCATENATE(VLOOKUP(A77,'Finding report'!$B:$C,2,0),\" PN \",IF(RIGHT(A77,1)=\"R\",LEFT(A77,LEN(A77)-1),A77),\" Qty \",SUMIF('Finding report'!$B:$B,A77,'Finding report'!D:D),\" Found missing\")","v":{"$error":"#N/A"}}]
[{"$nulls":4},{"$f":"CONCATENATE(VLOOKUP(A78,'Finding report'!$B:$C,2,0),\" PN \",IF(RIGHT(A78,1)=\"R\",LEFT(A78,LEN(A78)-1),A78),\" Qty \",SUMIF('Finding report'!$B:$B,A78,'Finding report'!D:D),\" Found missing\")","v":{"$error":"#N/A"}}]
[{"$nulls":4},{"$f":"CONCATENATE(VLOOKUP(A79,'Finding report'!$B:$C,2,0),\" PN \",IF(RIGHT(A79,1)=\"R\",LEFT(A79,LEN(A79)-1),A79),\" Qty \",SUMIF('Finding report'!$B:$B,A79,'Finding report'!D:D),\" Found missing\")","v":{"$error":"#N/A"}}]
[{"$nulls":4},{"$f":"CONCATENATE(VLOOKUP(A80,'Finding report'!$B:$C,2,0),\" PN \",IF(RIGHT(A80,1)=\"R\",LEFT(A80,LEN(A80)-1),A80),\" Qty \",SUMIF('Finding report'!$B:$B,A80,'Finding report'!D:D),\" Found missing\")","v":{"$error":"#N/A"}}]
[{"$nulls":4},{"$f":"CONCATENATE(VLOOKUP(A81,'Finding report'!$B:$C,2,0),\" PN \",IF(RIGHT(A81,1)=\"R\",LEFT(A81,LEN(A81)-1),A81),\" Qty \",SUMIF('Finding report'!$B:$B,A81,'Finding report'!D:D),\" Found missing\")","v":{"$error":"#N/A"}}]
[{"$nulls":4},{"$f":"CONCATENATE(VLOOKUP(A82,'Finding report'!$B:$C,2,0),\" PN \",IF(RIGHT(A82,1)=\"R\",LEFT(A82,LEN(A82)-1),A82),\" Qty \",SUMIF('Finding report'!$B:$B,A82,'Finding report'!D:D),\" Found missing\")","v":{"$error":"#N/A"}}]
[{"$nulls":4},{"$f":"CONCATENATE(VLOOKUP(A83,'Finding report'!$B:$C,2,0),\" PN \",IF(RIGHT(A83,1)=\"R\",LEFT(A83,LEN(A83)-1),A83),\" Qty \",SUMIF('Finding report'!$B:$B,A83,'Finding report'!D:D),\" Found missing\")","v":{"$error":"#N/A"}}]
[{"$nulls":4},{"$f":"CONCATENATE(VLOOKUP(A84,'Finding report'!$B:$C,2,0),\" PN \",IF(RIGHT(A84,1)=\"R\",LEFT(A84,LEN(A84)-1),A84),\" Qty \",SUMIF('Finding report'!$B:$B,A84,'Finding report'!D:D),\" Found missing\")","v":{"$error":"#N/A"}}]
[{"$nulls":4},{"$f":"CONCATENATE(VLOOKUP(A85,'Finding report'!$B:$C,2,0),\" PN \",IF(RIGHT(A85,1)=\"R\",LEFT(A85,LEN(A85)-1),A85),\" Qty \",SUMIF('Finding report'!$B:$B,A85,'Finding report'!D:D),\" Found missing\")","v":{"$error":"#N/A"}}]
[{"$nulls":4},{"$f":"CONCATENATE(VLOOKUP(A86,'Finding report'!$B:$C,2,0),\" PN \",IF(RIGHT(A86,1)=\"R\",LEFT(A86,LEN(A86)-1),A86),\" Qty \",SUMIF('Finding report'!$B:$B,A86,'Finding report'!D:D),\" Found missing\")","v":{"$error":"#N/A"}}]
[{"$nulls":4},{"$f":"CONCATENATE(VLOOKUP(A87,'Finding report'!$B:$C,2,0),\" PN \",IF(RIGHT(A87,1)=\"R\",LEFT(A87,LEN(A87)-1),A87),\" Qty \",SUMIF('Finding report'!$B:$B,A87,'Finding report'!D:D),\" Found missing\")","v":{"$error":"#N/A"}}]
[{"$nulls":4},{"$f":"CONCATENATE(VLOOKUP(A88,'Finding report'!$B:$C,2,0),\" PN \",IF(RIGHT(A88,1)=\"R\",LEFT(A88,LEN(A88)-1),A88),\" Qty \",SUMIF('Finding report'!$B:$B,A88,'Finding report'!D:D),\" Found missing\")","v":{"$error":"#N/A"}}]
[{"$nulls":4},{"$f":"CONCATENATE(VLOOKUP(A89,'Finding report'!$B:$C,2,0),\" PN \",IF(RIGHT(A89,1)=\"R\",LEFT(A89,LEN(A89)-1),A89),\" Qty \",SUMIF('Finding report'!$B:$B,A89,'Finding report'!D:D),\" Found missing\")","v":{"$error":"#N/A"}}]
[{"$nulls":4},{"$f":"CONCATENATE(VLOOKUP(A90,'Finding report'!$B:$C,2,0),\" PN \",IF(RIGHT(A90,1)=\"R\",LEFT(A90,LEN(A90)-1),A90),\" Qty \",SUMIF('Finding report'!$B:$B,A90,'Finding report'!D:D),\" Found missing\")","v":{"$error":"#N/A"}}]
[{"$nulls":4},{"$f":"CONCATENATE(VLOOKUP(A91,'Finding report'!$B:$C,2,0),\" PN \",IF(RIGHT(A91,1)=\"R\",LEFT(A91,LEN(A91)-1),A91),\" Qty \",SUMIF('Finding report'!$B:$B,A91,'Finding report'!D:D),\" Found missing\")","v":{"$error":"#N/A"}}]
[{"$nulls":4},{"$f":"CONCATENATE(VLOOKUP(A92,'Finding report'!$B:$C,2,0),\" PN \",IF(RIGHT(A92,1)=\"R\",LEFT(A92,LEN(A92)-1),A92),\" Qty \",SUMIF('Finding report'!$B:$B,A92,'Finding report'!D:D),\" Found missing\")","v":{"$error":"#N/A"}}]
[{"$nulls":4},{"$f":"CONCATENATE(VLOOKUP(A93,'Finding report'!$B:$C,2,0),\" PN \",IF(RIGHT(A93,1)=\"R\",LEFT(A93,LEN(A93)-1),A93),\" Qty \",SUMIF('Finding report'!$B:$B,A93,'Finding report'!D:D),\" Found missing\")","v":{"$error":"#N/A"}}]
[{"$nulls":4},{"$f":"CONCATENATE(VLOOKUP(A94,'Finding report'!$B:$C,2,0),\" PN \",IF(RIGHT(A94,1)=\"R\",LEFT(A94,LEN(A94)-1),A94),\" Qty \",SUMIF('Finding report'!$B:$B,A94,'Finding report'!D:D),\" Found missing\")","v":{"$error":"#N/A"}}]
[{"$nulls":4},{"$f":"CONCATENATE(VLOOKUP(A95,'Finding report'!$B:$C,2,0),\" PN \",IF(RIGHT(A95,1)=\"R\",LEFT(A95,LEN(A95)-1),A95),\" Qty \",SUMIF('Finding report'!$B:$B,A95,'Finding report'!D:D),\" Found missing\")","v":{"$error":"#N/A"}}]
[{"$nulls":4},{"$f":"CONCATENATE(VLOOKUP(A96,'Finding report'!$B:$C,2,0),\" PN \",IF(RIGHT(A96,1)=\"R\",LEFT(A96,LEN(A96)-1),A96),\" Qty \",SUMIF('Finding report'!$B:$B,A96,'Finding report'!D:D),\" Found missing\")","v":{"$error":"#N/A"}}]
[{"$nulls":4},{"$f":"CONCATENATE(VLOOKUP(A97,'Finding report'!$B:$C,2,0),\" PN \",IF(RIGHT(A97,1)=\"R\",LEFT(A97,LEN(A97)-1),A97),\" Qty \",SUMIF('Finding report'!$B:$B,A97,'Finding report'!D:D),\" Found missing\")","v":{"$error":"#N/A"}}]
[{"$nulls":4},{"$f":"CONCATENATE(VLOOKUP(A98,'Finding report'!$B:$C,2,0),\" PN \",IF(RIGHT(A98,1)=\"R\",LEFT(A98,LEN(A98)-1),A98),\" Qty \",SUMIF('Finding report'!$B:$B,A98,'Finding report'!D:D),\" Found missing\")","v":{"$error":"#N/A"}}]
[{"$nulls":4},{"$f":"CONCATENATE(VLOOKUP(A99,'Finding report'!$B:$C,2,0),\" PN \",IF(RIGHT(A99,1)=\"R\",LEFT(A99,LEN(A99)-1),A99),\" Qty \",SUMIF('Finding report'!$B:$B,A99,'Finding report'!D:D),\" Found missing\")","v":{"$error":"#N/A"}}]
[{"$nulls":4},{"$f":"CONCATENATE(VLOOKUP(A100,'Finding report'!$B:$C,2,0),\" PN \",IF(RIGHT(A100,1)=\"R\",LEFT(A100,LEN(A100)-1),A100),\" Qty \",SUMIF('Finding report'!$B:$B,A100,'Finding report'!D:D),\" Found missing\")","v":{"$error":"#N/A"}}]
[{"$nulls":4},{"$f":"CONCATENATE(VLOOKUP(A101,'Finding report'!$B:$C,2,0),\" PN \",IF(RIGHT(A101,1)=\"R\",LEFT(A101,LEN(A101)-1),A101),\" Qty \",SUMIF('Finding report'!$B:$B,A101,'Finding report'!D:D),\" Found missing\")","v":{"$error":"#N/A"}}]
[{"$nulls":4},{"$f":"CONCATENATE(VLOOKUP(A102,'Finding report'!$B:$C,2,0),\" PN \",IF(RIGHT(A102,1)=\"R\",LEFT(A102,LEN(A102)-1),A102),\" Qty \",SUMIF('Finding report'!$B:$B,A102,'Finding report'!D:D),\" Found missing\")","v":{"$error":"#N/A"}}]
[{"$nulls":4},{"$f":"CONCATENATE(VLOOKUP(A103,'Finding report'!$B:$C,2,0),\" PN \",IF(RIGHT(A103,1)=\"R\",LEFT(A103,LEN(A103)-1),A103),\" Qty \",SUMIF('Finding report'!$B:$B,A103,'Finding report'!D:D),\" Found missing\")","v":{"$error":"#N/A"}}]
[{"$nulls":4},{"$f":"CONCATENATE(VLOOKUP(A104,'Finding report'!$B:$C,2,0),\" PN \",IF(RIGHT(A104,1)=\"R\",LEFT(A104,LEN(A104)-1),A104),\" Qty \",SUMIF('Finding report'!$B:$B,A104,'Finding report'!D:D),\" Found missing\")","v":{"$error":"#N/A"}}]
[{"$nulls":4},{"$f":"CONCATENATE(VLOOKUP(A105,'Finding report'!$B:$C,2,0),\" PN \",IF(RIGHT(A105,1)=\"R\",LEFT(A105,LEN(A105)-1),A105),\" Qty \",SUMIF('Finding report'!$B:$B,A105,'Finding report'!D:D),\" Found missing\")","v":{"$error":"#N/A"}}]
[{"$nulls":4},{"$f":"CONCATENATE(VLOOKUP(A106,'Finding report'!$B:$C,2,0),\" PN \",IF(RIGHT(A106,1)=\"R\",LEFT(A106,LEN(A106)-1),A106),\" Qty \",SUMIF('Finding report'!$B:$B,A106,'Finding report'!D:D),\" Found missing\")","v":{"$error":"#N/A"}}]
[{"$nulls":4},{"$f":"CONCATENATE(VLOOKUP(A107,'Finding report'!$B:$C,2,0),\" PN \",IF(RIGHT(A107,1)=\"R\",LEFT(A107,LEN(A107)-1),A107),\" Qty \",SUMIF('Finding report'!$B:$B,A107,'Finding report'!D:D),\" Found missing\")","v":{"$error":"#N/A"}}]
[{"$nulls":4},{"$f":"CONCATENATE(VLOOKUP(A108,'Finding report'!$B:$C,2,0),\" PN \",IF(RIGHT(A108,1)=\"R\",LEFT(A108,LEN(A108)-1),A108),\" Qty \",SUMIF('Finding report'!$B:$B,A108,'Finding report'!D:D),\" Found missing\")","v":{"$error":"#N/A"}}]
[{"$nulls":4},{"$f":"CONCATENATE(VLOOKUP(A109,'Finding report'!$B:$C,2,0),\" PN \",IF(RIGHT(A109,1)=\"R\",LEFT(A109,LEN(A109)-1),A109),\" Qty \",SUMIF('Finding report'!$B:$B,A109,'Finding report'!D:D),\" Found missing\")","v":{"$error":"#N/A"}}]
[{"$nulls":4},{"$f":"CONCATENATE(VLOOKUP(A110,'Finding report'!$B:$C,2,0),\" PN \",IF(RIGHT(A110,1)=\"R\",LEFT(A110,LEN(A110)-1),A110),\" Qty \",SUMIF('Finding report'!$B:$B,A110,'Finding report'!D:D),\" Found missing\")","v":{"$error":"#N/A"}}]
[{"$nulls":4},{"$f":"CONCATENATE(VLOOKUP(A111,'Finding report'!$B:$C,2,0),\" PN \",IF(RIGHT(A111,1)=\"R\",LEFT(A111,LEN(A111)-1),A111),\" Qty \",SUMIF('Finding report'!$B:$B,A111,'Finding report'!D:D),\" Found missing\")","v":{"$error":"#N/A"}}]
[{"$nulls":4},{"$f":"CONCATENATE(VLOOKUP(A112,'Finding report'!$B:$C,2,0),\" PN \",IF(RIGHT(A112,1)=\"R\",LEFT(A112,LEN(A112)-1),A112),\" Qty \",SUMIF('Finding report'!$B:$B,A112,'Finding report'!D:D),\" Found missing\")","v":{"$error":"#N/A"}}]
[{"$nulls":4},{"$f":"CONCATENATE(VLOOKUP(A113,'Finding report'!$B:$C,2,0),\" PN \",IF(RIGHT(A113,1)=\"R\",LEFT(A113,LEN(A113)-1),A113),\" Qty \",SUMIF('Finding report'!$B:$B,A113,'Finding report'!D:D),\" Found missing\")","v":{"$error":"#N/A"}}]
[{"$nulls":4},{"$f":"CONCATENATE(VLOOKUP(A114,'Finding report'!$B:$C,2,0),\" PN \",IF(RIGHT(A114,1)=\"R\",LEFT(A114,LEN(A114)-1),A114),\" Qty \",SUMIF('Finding report'!$B:$B,A114,'Finding report'!D:D),\" Found missing\")","v":{"$error":"#N/A"}}]
[{"$nulls":4},{"$f":"CONCATENATE(VLOOKUP(A115,'Finding report'!$B:$C,2,0),\" PN \",IF(RIGHT(A115,1)=\"R\",LEFT(A115,LEN(A115)-1),A115),\" Qty \",SUMIF('Finding report'!$B:$B,A115,'Finding report'!D:D),\" Found missing\")","v":{"$error":"#N/A"}}]
[{"$nulls":4},{"$f":"CONCATENATE(VLOOKUP(A116,'Finding report'!$B:$C,2,0),\" PN \",IF(RIGHT(A116,1)=\"R\",LEFT(A116,LEN(A116)-1),A116),\" Qty \",SUMIF('Finding report'!$B:$B,A116,'Finding report'!D:D),\" Found missing\")","v":{"$error":"#N/A"}}]
[{"$nulls":4},{"$f":"CONCATENATE(VLOOKUP(A117,'Finding report'!$B:$C,2,0),\" PN \",IF(RIGHT(A117,1)=\"R\",LEFT(A117,LEN(A117)-1),A117),\" Qty \",SUMIF('Finding report'!$B:$B,A117,'Finding report'!D:D),\" Found missing\")","v":{"$error":"#N/A"}}]
[{"$nulls":4},{"$f":"CONCATENATE(VLOOKUP(A118,'Finding report'!$B:$C,2,0),\" PN \",IF(RIGHT(A118,1)=\"R\",LEFT(A118,LEN(A118)-1),A118),\" Qty \",SUMIF('Finding report'!$B:$B,A118,'Finding report'!D:D),\" Found missing\")","v":{"$error":"#N/A"}}]
[{"$nulls":4},{"$f":"CONCATENATE(VLOOKUP(A119,'Finding report'!$B:$C,2,0),\" PN \",IF(RIGHT(A119,1)=\"R\",LEFT(A119,LEN(A119)-1),A119),\" Qty \",SUMIF('Finding report'!$B:$B,A119,'Finding report'!D:D),\" Found missing\")","v":{"$error":"#N/A"}}]
[{"$nulls":4},{"$f":"CONCATENATE(VLOOKUP(A120,'Finding report'!$B:$C,2,0),\" PN \",IF(RIGHT(A120,1)=\"R\",LEFT(A120,LEN(A120)-1),A120),\" Qty \",SUMIF('Finding report'!$B:$B,A120,'Finding report'!D:D),\" Found missing\")","v":{"$error":"#N/A"}}]
[{"$nulls":4},{"$f":"CONCATENATE(VLOOKUP(A121,'Finding report'!$B:$C,2,0),\" PN \",IF(RIGHT(A121,1)=\"R\",LEFT(A121,LEN(A121)-1),A121),\" Qty \",SUMIF('Finding report'!$B:$B,A121,'Finding report'!D:D),\" Found missing\")","v":{"$error":"#N/A"}}]
[{"$nulls":4},{"$f":"CONCATENATE(VLOOKUP(A122,'Finding report'!$B:$C,2,0),\" PN \",IF(RIGHT(A122,1)=\"R\",LEFT(A122,LEN(A122)-1),A122),\" Qty \",SUMIF('Finding report'!$B:$B,A122,'Finding report'!D:D),\" Found missing\")","v":{"$error":"#N/A"}}]
[{"$nulls":4},{"$f":"CONCATENATE(VLOOKUP(A123,'Finding report'!$B:$C,2,0),\" PN \",IF(RIGHT(A123,1)=\"R\",LEFT(A123,LEN(A123)-1),A123),\" Qty \",SUMIF('Finding report'!$B:$B,A123,'Finding report'!D:D),\" Found missing\")","v":{"$error":"#N/A"}}]

{"sheet":"TCD FOD","index":7,"n_rows":39,"n_cols":5,"rows_kept":39}
["Source of default","FOD"]
["Nature of finding","(Plusieurs éléments)"]
[]
["Étiquettes de lignes","Somme de Qty",null,null,{"$f":"CONCATENATE(VLOOKUP(A4,'Finding report'!$B:$C,2,0),\" PN \",IF(RIGHT(A4,1)=\"R\",LEFT(A4,LEN(A4)-1),A4),\" Found \",VLOOKUP(A4,'Finding report'!$B:$F,5,0),\" due to FOD\")","v":{"$error":"#N/A"}}]
["(vide)",{"$nulls":3},{"$f":"CONCATENATE(VLOOKUP(A5,'Finding report'!$B:$C,2,0),\" PN \",IF(RIGHT(A5,1)=\"R\",LEFT(A5,LEN(A5)-1),A5),\" Found \",VLOOKUP(A5,'Finding report'!$B:$F,5,0),\" due to FOD\")","v":{"$error":"#N/A"}}]
["Total général",{"$nulls":3},{"$f":"CONCATENATE(VLOOKUP(A6,'Finding report'!$B:$C,2,0),\" PN \",IF(RIGHT(A6,1)=\"R\",LEFT(A6,LEN(A6)-1),A6),\" Found \",VLOOKUP(A6,'Finding report'!$B:$F,5,0),\" due to FOD\")","v":{"$error":"#N/A"}}]
[{"$nulls":4},{"$f":"CONCATENATE(VLOOKUP(A7,'Finding report'!$B:$C,2,0),\" PN \",IF(RIGHT(A7,1)=\"R\",LEFT(A7,LEN(A7)-1),A7),\" Found \",VLOOKUP(A7,'Finding report'!$B:$F,5,0),\" due to FOD\")","v":{"$error":"#N/A"}}]
[{"$nulls":4},{"$f":"CONCATENATE(VLOOKUP(A8,'Finding report'!$B:$C,2,0),\" PN \",IF(RIGHT(A8,1)=\"R\",LEFT(A8,LEN(A8)-1),A8),\" Found \",VLOOKUP(A8,'Finding report'!$B:$F,5,0),\" due to FOD\")","v":{"$error":"#N/A"}}]
[{"$nulls":4},{"$f":"CONCATENATE(VLOOKUP(A9,'Finding report'!$B:$C,2,0),\" PN \",IF(RIGHT(A9,1)=\"R\",LEFT(A9,LEN(A9)-1),A9),\" Found \",VLOOKUP(A9,'Finding report'!$B:$F,5,0),\" due to FOD\")","v":{"$error":"#N/A"}}]
[{"$nulls":4},{"$f":"CONCATENATE(VLOOKUP(A10,'Finding report'!$B:$C,2,0),\" PN \",IF(RIGHT(A10,1)=\"R\",LEFT(A10,LEN(A10)-1),A10),\" Found \",VLOOKUP(A10,'Finding report'!$B:$F,5,0),\" due to FOD\")","v":{"$error":"#N/A"}}]
[{"$nulls":4},{"$f":"CONCATENATE(VLOOKUP(A11,'Finding report'!$B:$C,2,0),\" PN \",IF(RIGHT(A11,1)=\"R\",LEFT(A11,LEN(A11)-1),A11),\" Found \",VLOOKUP(A11,'Finding report'!$B:$F,5,0),\" due to FOD\")","v":{"$error":"#N/A"}}]
[{"$nulls":4},{"$f":"CONCATENATE(VLOOKUP(A12,'Finding report'!$B:$C,2,0),\" PN \",IF(RIGHT(A12,1)=\"R\",LEFT(A12,LEN(A12)-1),A12),\" Found \",VLOOKUP(A12,'Finding report'!$B:$F,5,0),\" due to FOD\")","v":{"$error":"#N/A"}}]
[{"$nulls":4},{"$f":"CONCATENATE(VLOOKUP(A13,'Finding report'!$B:$C,2,0),\" PN \",IF(RIGHT(A13,1)=\"R\",LEFT(A13,LEN(A13)-1),A13),\" Found \",VLOOKUP(A13,'Finding report'!$B:$F,5,0),\" due to FOD\")","v":{"$error":"#N/A"}}]
[{"$nulls":4},{"$f":"CONCATENATE(VLOOKUP(A14,'Finding report'!$B:$C,2,0),\" PN \",IF(RIGHT(A14,1)=\"R\",LEFT(A14,LEN(A14)-1),A14),\" Found \",VLOOKUP(A14,'Finding report'!$B:$F,5,0),\" due to FOD\")","v":{"$error":"#N/A"}}]
[{"$nulls":4},{"$f":"CONCATENATE(VLOOKUP(A15,'Finding report'!$B:$C,2,0),\" PN \",IF(RIGHT(A15,1)=\"R\",LEFT(A15,LEN(A15)-1),A15),\" Found \",VLOOKUP(A15,'Finding report'!$B:$F,5,0),\" due to FOD\")","v":{"$error":"#N/A"}}]
[{"$nulls":4},{"$f":"CONCATENATE(VLOOKUP(A16,'Finding report'!$B:$C,2,0),\" PN \",IF(RIGHT(A16,1)=\"R\",LEFT(A16,LEN(A16)-1),A16),\" Found \",VLOOKUP(A16,'Finding report'!$B:$F,5,0),\" due to FOD\")","v":{"$error":"#N/A"}}]
[{"$nulls":4},{"$f":"CONCATENATE(VLOOKUP(A17,'Finding report'!$B:$C,2,0),\" PN \",IF(RIGHT(A17,1)=\"R\",LEFT(A17,LEN(A17)-1),A17),\" Found \",VLOOKUP(A17,'Finding report'!$B:$F,5,0),\" due to FOD\")","v":{"$error":"#N/A"}}]
[{"$nulls":4},{"$f":"CONCATENATE(VLOOKUP(A18,'Finding report'!$B:$C,2,0),\" PN \",IF(RIGHT(A18,1)=\"R\",LEFT(A18,LEN(A18)-1),A18),\" Found \",VLOOKUP(A18,'Finding report'!$B:$F,5,0),\" due to FOD\")","v":{"$error":"#N/A"}}]
[{"$nulls":4},{"$f":"CONCATENATE(VLOOKUP(A19,'Finding report'!$B:$C,2,0),\" PN \",IF(RIGHT(A19,1)=\"R\",LEFT(A19,LEN(A19)-1),A19),\" Found \",VLOOKUP(A19,'Finding report'!$B:$F,5,0),\" due to FOD\")","v":{"$error":"#N/A"}}]
[{"$nulls":4},{"$f":"CONCATENATE(VLOOKUP(A20,'Finding report'!$B:$C,2,0),\" PN \",IF(RIGHT(A20,1)=\"R\",LEFT(A20,LEN(A20)-1),A20),\" Found \",VLOOKUP(A20,'Finding report'!$B:$F,5,0),\" due to FOD\")","v":{"$error":"#N/A"}}]
[{"$nulls":4},{"$f":"CONCATENATE(VLOOKUP(A21,'Finding report'!$B:$C,2,0),\" PN \",IF(RIGHT(A21,1)=\"R\",LEFT(A21,LEN(A21)-1),A21),\" Found \",VLOOKUP(A21,'Finding report'!$B:$F,5,0),\" due to FOD\")","v":{"$error":"#N/A"}}]
[{"$nulls":4},{"$f":"CONCATENATE(VLOOKUP(A22,'Finding report'!$B:$C,2,0),\" PN \",IF(RIGHT(A22,1)=\"R\",LEFT(A22,LEN(A22)-1),A22),\" Found \",VLOOKUP(A22,'Finding report'!$B:$F,5,0),\" due to FOD\")","v":{"$error":"#N/A"}}]
[{"$nulls":4},{"$f":"CONCATENATE(VLOOKUP(A23,'Finding report'!$B:$C,2,0),\" PN \",IF(RIGHT(A23,1)=\"R\",LEFT(A23,LEN(A23)-1),A23),\" Found \",VLOOKUP(A23,'Finding report'!$B:$F,5,0),\" due to FOD\")","v":{"$error":"#N/A"}}]
[{"$nulls":4},{"$f":"CONCATENATE(VLOOKUP(A24,'Finding report'!$B:$C,2,0),\" PN \",IF(RIGHT(A24,1)=\"R\",LEFT(A24,LEN(A24)-1),A24),\" Found \",VLOOKUP(A24,'Finding report'!$B:$F,5,0),\" due to FOD\")","v":{"$error":"#N/A"}}]
[{"$nulls":4},{"$f":"CONCATENATE(VLOOKUP(A25,'Finding report'!$B:$C,2,0),\" PN \",IF(RIGHT(A25,1)=\"R\",LEFT(A25,LEN(A25)-1),A25),\" Found \",VLOOKUP(A25,'Finding report'!$B:$F,5,0),\" due to FOD\")","v":{"$error":"#N/A"}}]
[{"$nulls":4},{"$f":"CONCATENATE(VLOOKUP(A26,'Finding report'!$B:$C,2,0),\" PN \",IF(RIGHT(A26,1)=\"R\",LEFT(A26,LEN(A26)-1),A26),\" Found \",VLOOKUP(A26,'Finding report'!$B:$F,5,0),\" due to FOD\")","v":{"$error":"#N/A"}}]
[{"$nulls":4},{"$f":"CONCATENATE(VLOOKUP(A27,'Finding report'!$B:$C,2,0),\" PN \",IF(RIGHT(A27,1)=\"R\",LEFT(A27,LEN(A27)-1),A27),\" Found \",VLOOKUP(A27,'Finding report'!$B:$F,5,0),\" due to FOD\")","v":{"$error":"#N/A"}}]
[{"$nulls":4},{"$f":"CONCATENATE(VLOOKUP(A28,'Finding report'!$B:$C,2,0),\" PN \",IF(RIGHT(A28,1)=\"R\",LEFT(A28,LEN(A28)-1),A28),\" Found \",VLOOKUP(A28,'Finding report'!$B:$F,5,0),\" due to FOD\")","v":{"$error":"#N/A"}}]
[{"$nulls":4},{"$f":"CONCATENATE(VLOOKUP(A29,'Finding report'!$B:$C,2,0),\" PN \",IF(RIGHT(A29,1)=\"R\",LEFT(A29,LEN(A29)-1),A29),\" Found \",VLOOKUP(A29,'Finding report'!$B:$F,5,0),\" due to FOD\")","v":{"$error":"#N/A"}}]
[{"$nulls":4},{"$f":"CONCATENATE(VLOOKUP(A30,'Finding report'!$B:$C,2,0),\" PN \",IF(RIGHT(A30,1)=\"R\",LEFT(A30,LEN(A30)-1),A30),\" Found \",VLOOKUP(A30,'Finding report'!$B:$F,5,0),\" due to FOD\")","v":{"$error":"#N/A"}}]
[{"$nulls":4},{"$f":"CONCATENATE(VLOOKUP(A31,'Finding report'!$B:$C,2,0),\" PN \",IF(RIGHT(A31,1)=\"R\",LEFT(A31,LEN(A31)-1),A31),\" Found \",VLOOKUP(A31,'Finding report'!$B:$F,5,0),\" due to FOD\")","v":{"$error":"#N/A"}}]
[{"$nulls":4},{"$f":"CONCATENATE(VLOOKUP(A32,'Finding report'!$B:$C,2,0),\" PN \",IF(RIGHT(A32,1)=\"R\",LEFT(A32,LEN(A32)-1),A32),\" Found \",VLOOKUP(A32,'Finding report'!$B:$F,5,0),\" due to FOD\")","v":{"$error":"#N/A"}}]
[{"$nulls":4},{"$f":"CONCATENATE(VLOOKUP(A33,'Finding report'!$B:$C,2,0),\" PN \",IF(RIGHT(A33,1)=\"R\",LEFT(A33,LEN(A33)-1),A33),\" Found \",VLOOKUP(A33,'Finding report'!$B:$F,5,0),\" due to FOD\")","v":{"$error":"#N/A"}}]
[{"$nulls":4},{"$f":"CONCATENATE(VLOOKUP(A34,'Finding report'!$B:$C,2,0),\" PN \",IF(RIGHT(A34,1)=\"R\",LEFT(A34,LEN(A34)-1),A34),\" Found \",VLOOKUP(A34,'Finding report'!$B:$F,5,0),\" due to FOD\")","v":{"$error":"#N/A"}}]
[{"$nulls":4},{"$f":"CONCATENATE(VLOOKUP(A35,'Finding report'!$B:$C,2,0),\" PN \",IF(RIGHT(A35,1)=\"R\",LEFT(A35,LEN(A35)-1),A35),\" Found \",VLOOKUP(A35,'Finding report'!$B:$F,5,0),\" due to FOD\")","v":{"$error":"#N/A"}}]
[{"$nulls":4},{"$f":"CONCATENATE(VLOOKUP(A36,'Finding report'!$B:$C,2,0),\" PN \",IF(RIGHT(A36,1)=\"R\",LEFT(A36,LEN(A36)-1),A36),\" Found \",VLOOKUP(A36,'Finding report'!$B:$F,5,0),\" due to FOD\")","v":{"$error":"#N/A"}}]
[{"$nulls":4},{"$f":"CONCATENATE(VLOOKUP(A37,'Finding report'!$B:$C,2,0),\" PN \",IF(RIGHT(A37,1)=\"R\",LEFT(A37,LEN(A37)-1),A37),\" Found \",VLOOKUP(A37,'Finding report'!$B:$F,5,0),\" due to FOD\")","v":{"$error":"#N/A"}}]
[{"$nulls":4},{"$f":"CONCATENATE(VLOOKUP(A38,'Finding report'!$B:$C,2,0),\" PN \",IF(RIGHT(A38,1)=\"R\",LEFT(A38,LEN(A38)-1),A38),\" Found \",VLOOKUP(A38,'Finding report'!$B:$F,5,0),\" due to FOD\")","v":{"$error":"#N/A"}}]
[{"$nulls":4},{"$f":"CONCATENATE(VLOOKUP(A39,'Finding report'!$B:$C,2,0),\" PN \",IF(RIGHT(A39,1)=\"R\",LEFT(A39,LEN(A39)-1),A39),\" Found \",VLOOKUP(A39,'Finding report'!$B:$F,5,0),\" due to FOD\")","v":{"$error":"#N/A"}}]

{"sheet":"TCD SUP","index":8,"n_rows":26,"n_cols":5,"rows_kept":26}
["Source of default","SUP"]
[]
["Étiquettes de lignes","Nombre de Qty"]
["E0043-1B0",1,null,null,{"$f":"CONCATENATE(VLOOKUP(A4,'Finding report'!$B:$C,2,0),\" PN \",IF(RIGHT(A4,1)=\"R\",LEFT(A4,LEN(A4)-1),A4),\" Qty \",SUMIF('Finding report'!$B:$B,A4,'Finding report'!D:D),\" Found suspected to be unapproved part\")","v":"E0043-1B0\\COLLIER DE FRETTAGE PN E0043-1B0 Qty 2 Found suspected to be unapproved part"}]
["(vide)",{"$nulls":3},{"$f":"CONCATENATE(VLOOKUP(A5,'Finding report'!$B:$C,2,0),\" PN \",IF(RIGHT(A5,1)=\"R\",LEFT(A5,LEN(A5)-1),A5),\" Qty \",SUMIF('Finding report'!$B:$B,A5,'Finding report'!D:D),\" Found suspected to be unapproved part\")","v":{"$error":"#N/A"}}]
["SB3-070-000-02",1,null,null,{"$f":"CONCATENATE(VLOOKUP(A6,'Finding report'!$B:$C,2,0),\" PN \",IF(RIGHT(A6,1)=\"R\",LEFT(A6,LEN(A6)-1),A6),\" Qty \",SUMIF('Finding report'!$B:$B,A6,'Finding report'!D:D),\" Found suspected to be unapproved part\")","v":"ASSEMBLY PN SB3-070-000-02 Qty 1 Found suspected to be unapproved part"}]
["Total général",2,null,null,{"$f":"CONCATENATE(VLOOKUP(A7,'Finding report'!$B:$C,2,0),\" PN \",IF(RIGHT(A7,1)=\"R\",LEFT(A7,LEN(A7)-1),A7),\" Qty \",SUMIF('Finding report'!$B:$B,A7,'Finding report'!D:D),\" Found suspected to be unapproved part\")","v":{"$error":"#N/A"}}]
[{"$nulls":4},{"$f":"CONCATENATE(VLOOKUP(A8,'Finding report'!$B:$C,2,0),\" PN \",IF(RIGHT(A8,1)=\"R\",LEFT(A8,LEN(A8)-1),A8),\" Qty \",SUMIF('Finding report'!$B:$B,A8,'Finding report'!D:D),\" Found suspected to be unapproved part\")","v":{"$error":"#N/A"}}]
[{"$nulls":4},{"$f":"CONCATENATE(VLOOKUP(A9,'Finding report'!$B:$C,2,0),\" PN \",IF(RIGHT(A9,1)=\"R\",LEFT(A9,LEN(A9)-1),A9),\" Qty \",SUMIF('Finding report'!$B:$B,A9,'Finding report'!D:D),\" Found suspected to be unapproved part\")","v":{"$error":"#N/A"}}]
[{"$nulls":4},{"$f":"CONCATENATE(VLOOKUP(A10,'Finding report'!$B:$C,2,0),\" PN \",IF(RIGHT(A10,1)=\"R\",LEFT(A10,LEN(A10)-1),A10),\" Qty \",SUMIF('Finding report'!$B:$B,A10,'Finding report'!D:D),\" Found suspected to be unapproved part\")","v":{"$error":"#N/A"}}]
[{"$nulls":4},{"$f":"CONCATENATE(VLOOKUP(A11,'Finding report'!$B:$C,2,0),\" PN \",IF(RIGHT(A11,1)=\"R\",LEFT(A11,LEN(A11)-1),A11),\" Qty \",SUMIF('Finding report'!$B:$B,A11,'Finding report'!D:D),\" Found suspected to be unapproved part\")","v":{"$error":"#N/A"}}]
[{"$nulls":4},{"$f":"CONCATENATE(VLOOKUP(A12,'Finding report'!$B:$C,2,0),\" PN \",IF(RIGHT(A12,1)=\"R\",LEFT(A12,LEN(A12)-1),A12),\" Qty \",SUMIF('Finding report'!$B:$B,A12,'Finding report'!D:D),\" Found suspected to be unapproved part\")","v":{"$error":"#N/A"}}]
[{"$nulls":4},{"$f":"CONCATENATE(VLOOKUP(A13,'Finding report'!$B:$C,2,0),\" PN \",IF(RIGHT(A13,1)=\"R\",LEFT(A13,LEN(A13)-1),A13),\" Qty \",SUMIF('Finding report'!$B:$B,A13,'Finding report'!D:D),\" Found suspected to be unapproved part\")","v":{"$error":"#N/A"}}]
[{"$nulls":4},{"$f":"CONCATENATE(VLOOKUP(A14,'Finding report'!$B:$C,2,0),\" PN \",IF(RIGHT(A14,1)=\"R\",LEFT(A14,LEN(A14)-1),A14),\" Qty \",SUMIF('Finding report'!$B:$B,A14,'Finding report'!D:D),\" Found suspected to be unapproved part\")","v":{"$error":"#N/A"}}]
[{"$nulls":4},{"$f":"CONCATENATE(VLOOKUP(A15,'Finding report'!$B:$C,2,0),\" PN \",IF(RIGHT(A15,1)=\"R\",LEFT(A15,LEN(A15)-1),A15),\" Qty \",SUMIF('Finding report'!$B:$B,A15,'Finding report'!D:D),\" Found suspected to be unapproved part\")","v":{"$error":"#N/A"}}]
[{"$nulls":4},{"$f":"CONCATENATE(VLOOKUP(A16,'Finding report'!$B:$C,2,0),\" PN \",IF(RIGHT(A16,1)=\"R\",LEFT(A16,LEN(A16)-1),A16),\" Qty \",SUMIF('Finding report'!$B:$B,A16,'Finding report'!D:D),\" Found suspected to be unapproved part\")","v":{"$error":"#N/A"}}]
[{"$nulls":4},{"$f":"CONCATENATE(VLOOKUP(A17,'Finding report'!$B:$C,2,0),\" PN \",IF(RIGHT(A17,1)=\"R\",LEFT(A17,LEN(A17)-1),A17),\" Qty \",SUMIF('Finding report'!$B:$B,A17,'Finding report'!D:D),\" Found suspected to be unapproved part\")","v":{"$error":"#N/A"}}]
[{"$nulls":4},{"$f":"CONCATENATE(VLOOKUP(A18,'Finding report'!$B:$C,2,0),\" PN \",IF(RIGHT(A18,1)=\"R\",LEFT(A18,LEN(A18)-1),A18),\" Qty \",SUMIF('Finding report'!$B:$B,A18,'Finding report'!D:D),\" Found suspected to be unapproved part\")","v":{"$error":"#N/A"}}]
[{"$nulls":4},{"$f":"CONCATENATE(VLOOKUP(A19,'Finding report'!$B:$C,2,0),\" PN \",IF(RIGHT(A19,1)=\"R\",LEFT(A19,LEN(A19)-1),A19),\" Qty \",SUMIF('Finding report'!$B:$B,A19,'Finding report'!D:D),\" Found suspected to be unapproved part\")","v":{"$error":"#N/A"}}]
[{"$nulls":4},{"$f":"CONCATENATE(VLOOKUP(A20,'Finding report'!$B:$C,2,0),\" PN \",IF(RIGHT(A20,1)=\"R\",LEFT(A20,LEN(A20)-1),A20),\" Qty \",SUMIF('Finding report'!$B:$B,A20,'Finding report'!D:D),\" Found suspected to be unapproved part\")","v":{"$error":"#N/A"}}]
[{"$nulls":4},{"$f":"CONCATENATE(VLOOKUP(A21,'Finding report'!$B:$C,2,0),\" PN \",IF(RIGHT(A21,1)=\"R\",LEFT(A21,LEN(A21)-1),A21),\" Qty \",SUMIF('Finding report'!$B:$B,A21,'Finding report'!D:D),\" Found suspected to be unapproved part\")","v":{"$error":"#N/A"}}]
[{"$nulls":4},{"$f":"CONCATENATE(VLOOKUP(A22,'Finding report'!$B:$C,2,0),\" PN \",IF(RIGHT(A22,1)=\"R\",LEFT(A22,LEN(A22)-1),A22),\" Qty \",SUMIF('Finding report'!$B:$B,A22,'Finding report'!D:D),\" Found suspected to be unapproved part\")","v":{"$error":"#N/A"}}]
[{"$nulls":4},{"$f":"CONCATENATE(VLOOKUP(A23,'Finding report'!$B:$C,2,0),\" PN \",IF(RIGHT(A23,1)=\"R\",LEFT(A23,LEN(A23)-1),A23),\" Qty \",SUMIF('Finding report'!$B:$B,A23,'Finding report'!D:D),\" Found suspected to be unapproved part\")","v":{"$error":"#N/A"}}]
[{"$nulls":4},{"$f":"CONCATENATE(VLOOKUP(A24,'Finding report'!$B:$C,2,0),\" PN \",IF(RIGHT(A24,1)=\"R\",LEFT(A24,LEN(A24)-1),A24),\" Qty \",SUMIF('Finding report'!$B:$B,A24,'Finding report'!D:D),\" Found suspected to be unapproved part\")","v":{"$error":"#N/A"}}]
[{"$nulls":4},{"$f":"CONCATENATE(VLOOKUP(A25,'Finding report'!$B:$C,2,0),\" PN \",IF(RIGHT(A25,1)=\"R\",LEFT(A25,LEN(A25)-1),A25),\" Qty \",SUMIF('Finding report'!$B:$B,A25,'Finding report'!D:D),\" Found suspected to be unapproved part\")","v":{"$error":"#N/A"}}]
[{"$nulls":4},{"$f":"CONCATENATE(VLOOKUP(A26,'Finding report'!$B:$C,2,0),\" PN \",IF(RIGHT(A26,1)=\"R\",LEFT(A26,LEN(A26)-1),A26),\" Qty \",SUMIF('Finding report'!$B:$B,A26,'Finding report'!D:D),\" Found suspected to be unapproved part\")","v":{"$error":"#N/A"}}]