{"text_format":"3","workbook":"xlsx","n_sheets":9,"sheets":["Feuil1","Finding report","General Findings","parts finding","TCD NW&T","TCD MM","TCD Missing","TCD FOD","TCD SUP"],"not_rendered":{"macros":1,"defined_names":1,"pivot_tables":5},"read":"whole","date_system":"1900"}

{"sheet":"Feuil1","index":0,"n_rows":1031,"n_cols":29,"rows_kept":1031}
["Sno","Op","Comp no/Wrk ctr","Qty/Run tm","Activ","U/M","Quantity","Date","Sts","Estimated cost","Itp","Whs","Itc","Report qty","Op description","Service","Description","Ret","Sup","Description","Main attr 1","Element","Ref ol","Pl dt","PO no","Non-mtrl","Psts","Order line","-"]
[null,10,"LOGIST",{"$nulls":3},1,50719,90,{"$nulls":5},"LOGISTICS","REPAIR","25-11-46, 25-11-58",{"$nulls":5},10]
[1,330,"SCN900-005-01",1,null,"EA",1,260719,90,10.26,110,"LW1",null,1,"SCN900-005-01",null,"LABEL, HIGH VOLTAGE",{"$nulls":8},0]
[2,330,"SB3-070-002-01",1,null,"EA",1,260719,90,242.1,110,"LW1",null,1,"SB3-070-002-01",null,"HEAD LAP BLOCK",{"$nulls":8},0]
[3,330,"EN3646A61210MN",1,null,"EA",1,260719,60,null,110,"LW1",null,null,"EN3646A61210MN",null,"PLUG",{"$nulls":8},0]
[4,330,"NSA938150-03-12",1,null,"EA",1,260719,90,48,110,"LW1",null,1,"NSA938150-03-12",null,"ADAPTER, CABLE CLAMP",{"$nulls":8},0]
[5,330,"NSA935805-12",1,null,"EA",1,260719,60,null,110,"LW1",null,null,"NSA935805-12",null,"GAINE FLEXIBLE ELECTRIQUE",{"$nulls":8},0]
[6,330,"8526-1348",4,null,"EA",4,260719,90,6.72,110,"LW1",null,4,"8526-1348",null,"CONTACT",{"$nulls":8},0]
[7,330,"ABS0073-313",4,null,"EA",4,50719,94,null,110,"LW1",null,null,"ABS0073-313",null,"LAMP",{"$nulls":8},0]
[8,330,"NYC0S0L4",2,null,"BX",2,260719,90,28.04,110,"LW1",null,2,"TT-I-735",null,"SOLVANT",{"$nulls":8},0]
[9,330,"8525-860A",1,null,"EA",1,260719,60,33.74,110,"LW1",null,null,"8525-860A",null,"SLEEVE",{"$nulls":8},0]
[10,330,"SB3-070-000-02",1,null,"EA",1,260719,90,243.38,110,"LW1",null,1,"SB3-070-000-02",null,"ASSEMBLY",{"$nulls":8},0]
[11,330,"E0043-1B0",2,null,"EA",2,260719,90,0.15,110,"LW1",null,2,"E0043-1B0",null,"E0043-1B0\\COLLIER DE FRETTAGE",{"$nulls":8},0]
[12,330,"4136290006R",1,null,"EA",1,260719,90,899.34,130,"LW1",8,1,"4136290006R",null,"ACTUATOR",{"$nulls":8},0]
[13,330,"ET3-200-014-09",1,null,"EA",1,260719,90,3.85,110,"LW1",null,1,"ET3-200-014-09",null,"LABEL",{"$nulls":8},0]
{"$rows_left_out":561}
{"sheet":"Finding report","index":1,"n_rows":664,"n_cols":11,"rows_kept":664}
[]
[]
[]
[null,1,"ACTUATOR FAILED TORQUE TEST"]
[null,2,"PARTS DAMAGED TO BE REPLACED"]
[null,3,"PART MISSING"]
[null,4,"SUSPECTED UNAPPROVED PARTS"]
[null,5]
[null,6]
[null,7]
[null,8]
[null,9]
[null,10]
[]
[]
{"$rows_left_out":632}
{"sheet":"General Findings","index":2,"n_rows":6,"n_cols":1,"rows_kept":6}
["ACTUATOR FAILED TORQUE TEST"]
["ACTUATOR FAILED ELECTRICAL TEST"]
["CIRCUIT BREAKER FAILED"]
["PARTS DAMAGED TO BE REPLACED"]
["PART MISSING"]
["SUSPECTED UNAPPROVED PARTS"]

{"sheet":"parts finding","index":3,"n_rows":24,"n_cols":1,"rows_kept":24}
["Bended"]
["Broken"]
["Burnt"]
["Chafing"]
["Corroded"]
["Cracked"]
["Defective"]
["Deformed"]
["Dimension Failed"]
["Dirty"]
["Failed test"]
["Faulty"]
["Frayed"]
["Incorrect / Suspected unapproved"]
["Mandatory replacement"]
{"$rows_left_out":10}
{"sheet":"TCD NW&T","index":4,"n_rows":100,"n_cols":5,"rows_kept":100}
[]
[]
["Source of default","(Plusieurs éléments)"]
["Nature of finding","(Plusieurs éléments)"]
[]
["Étiquettes de lignes","Somme de Qty"]
["23351AC080LE",1,null,null,{"$f":"IF(VLOOKUP(A7,'Finding report'!$B:$F,5,0)=\"Mandatory replacement\",CONCATENATE(VLOOKUP(A7,'Finding report'!$B:$C,2,0),\" PN \",IF(RIGHT(A7,1)=\"R\",LEFT(A7,LEN(A7)-1),A7),\" Qty \",B7,\" to be replaced due to mandatory replacement as per CMM\"),CONCATENATE(VLOOKUP(A7,'Finding report'!$B:$C,2,0),\" PN \",IF(RIGHT(A7,1)=\"R\",LEFT(A7,LEN(A7)-1),A7),\" Qty \",B7,\" Found \",VLOOKUP(A7,'Finding report'!$B:$F,5,0),\" due to normal wear and tear\"))","v":"LOCK PLATE PN 23351AC080LE Qty 1 Found Broken due to normal wear and tear"}]
["4136290006R",1,null,null,{"$f":"IF(VLOOKUP(A8,'Finding report'!$B:$F,5,0)=\"Mandatory replacement\",CONCATENATE(VLOOKUP(A8,'Finding report'!$B:$C,2,0),\" PN \",IF(RIGHT(A8,1)=\"R\",LEFT(A8,LEN(A8)-1),A8),\" Qty \",B8,\" to be replaced due to mandatory replacement as per CMM\"),CONCATENATE(VLOOKUP(A8,'Finding report'!$B:$C,2,0),\" PN \",IF(RIGHT(A8,1)=\"R\",LEFT(A8,LEN(A8)-1),A8),\" Qty \",B8,\" Found \",VLOOKUP(A8,'Finding report'!$B:$F,5,0),\" due to normal wear and tear\"))","v":"ACTUATOR PN 4136290006 Qty 1 Found Failed test due to normal wear and tear"}]
["ET3-200-014-09",1,null,null,{"$f":"IF(VLOOKUP(A9,'Finding report'!$B:$F,5,0)=\"Mandatory replacement\",CONCATENATE(VLOOKUP(A9,'Finding report'!$B:$C,2,0),\" PN \",IF(RIGHT(A9,1)=\"R\",LEFT(A9,LEN(A9)-1),A9),\" Qty \",B9,\" to be replaced due to mandatory replacement as per CMM\"),CONCATENATE(VLOOKUP(A9,'Finding report'!$B:$C,2,0),\" PN \",IF(RIGHT(A9,1)=\"R\",LEFT(A9,LEN(A9)-1),A9),\" Qty \",B9,\" Found \",VLOOKUP(A9,'Finding report'!$B:$F,5,0),\" due to normal wear and tear\"))","v":"LABEL PN ET3-200-014-09 Qty 1 Found Chafing due to normal wear and tear"}]
["MS21083N5",1,null,null,{"$f":"IF(VLOOKUP(A10,'Finding report'!$B:$F,5,0)=\"Mandatory replacement\",CONCATENATE(VLOOKUP(A10,'Finding report'!$B:$C,2,0),\" PN \",IF(RIGHT(A10,1)=\"R\",LEFT(A10,LEN(A10)-1),A10),\" Qty \",B10,\" to be replaced due to mandatory replacement as per CMM\"),CONCATENATE(VLOOKUP(A10,'Finding report'!$B:$C,2,0),\" PN \",IF(RIGHT(A10,1)=\"R\",LEFT(A10,LEN(A10)-1),A10),\" Qty \",B10,\" Found \",VLOOKUP(A10,'Finding report'!$B:$F,5,0),\" due to normal wear and tear\"))","v":"NUT . 52NTE054 PN MS21083N5 Qty 1 Found Broken due to normal wear and tear"}]
["NAS679A3",1,null,null,{"$f":"IF(VLOOKUP(A11,'Finding report'!$B:$F,5,0)=\"Mandatory replacement\",CONCATENATE(VLOOKUP(A11,'Finding report'!$B:$C,2,0),\" PN \",IF(RIGHT(A11,1)=\"R\",LEFT(A11,LEN(A11)-1),A11),\" Qty \",B11,\" to be replaced due to mandatory replacement as per CMM\"),CONCATENATE(VLOOKUP(A11,'Finding report'!$B:$C,2,0),\" PN \",IF(RIGHT(A11,1)=\"R\",LEFT(A11,LEN(A11)-1),A11),\" Qty \",B11,\" Found \",VLOOKUP(A11,'Finding report'!$B:$F,5,0),\" due to normal wear and tear\"))","v":"NUT PN NAS679A3 Qty 1 Found Broken due to normal wear and tear"}]
["SCN900-005-01",1,null,null,{"$f":"IF(VLOOKUP(A12,'Finding report'!$B:$F,5,0)=\"Mandatory replacement\",CONCATENATE(VLOOKUP(A12,'Finding report'!$B:$C,2,0),\" PN \",IF(RIGHT(A12,1)=\"R\",LEFT(A12,LEN(A12)-1),A12),\" Qty \",B12,\" to be replaced due to mandatory replacement as per CMM\"),CONCATENATE(VLOOKUP(A12,'Finding report'!$B:$C,2,0),\" PN \",IF(RIGHT(A12,1)=\"R\",LEFT(A12,LEN(A12)-1),A12),\" Qty \",B12,\" Found \",VLOOKUP(A12,'Finding report'!$B:$F,5,0),\" due to normal wear and tear\"))","v":"LABEL, HIGH VOLTAGE PN SCN900-005-01 Qty 1 Found Cracked due to normal wear and tear"}]
["TAAI3-427030-01",1,null,null,{"$f":"IF(VLOOKUP(A13,'Finding report'!$B:$F,5,0)=\"Mandatory replacement\",CONCATENATE(VLOOKUP(A13,'Finding report'!$B:$C,2,0),\" PN \",IF(RIGHT(A13,1)=\"R\",LEFT(A13,LEN(A13)-1),A13),\" Qty \",B13,\" to be replaced due to mandatory replacement as per CMM\"),CONCATENATE(VLOOKUP(A13,'Finding report'!$B:$C,2,0),\" PN \",IF(RIGHT(A13,1)=\"R\",LEFT(A13,LEN(A13)-1),A13),\" Qty \",B13,\" Found \",VLOOKUP(A13,'Finding report'!$B:$F,5,0),\" due to normal wear and tear\"))","v":"BONDING BRAID PN TAAI3-427030-01 Qty 1 Found Broken due to normal wear and tear"}]
["(vide)",{"$nulls":3},{"$f":"IF(VLOOKUP(A14,'Finding report'!$B:$F,5,0)=\"Mandatory replacement\",CONCATENATE(VLOOKUP(A14,'Finding report'!$B:$C,2,0),\" PN \",IF(RIGHT(A14,1)=\"R\",LEFT(A14,LEN(A14)-1),A14),\" Qty \",B14,\" to be replaced due to mandatory replacement as per CMM\"),CONCATENATE(VLOOKUP(A14,'Finding report'!$B:$C,2,0),\" PN \",IF(RIGHT(A14,1)=\"R\",LEFT(A14,LEN(A14)-1),A14),\" Qty \",B14,\" Found \",VLOOKUP(A14,'Finding report'!$B:$F,5,0),\" due to normal wear and tear\"))","v":{"$error":"#N/A"}}]
["E0043-4B0",1,null,null,{"$f":"IF(VLOOKUP(A15,'Finding report'!$B:$F,5,0)=\"Mandatory replacement\",CONCATENATE(VLOOKUP(A15,'Finding report'!$B:$C,2,0),\" PN \",IF(RIGHT(A15,1)=\"R\",LEFT(A15,LEN(A15)-1),A15),\" Qty \",B15,\" to be replaced due to mandatory replacement as per CMM\"),CONCATENATE(VLOOKUP(A15,'Finding report'!$B:$C,2,0),\" PN \",IF(RIGHT(A15,1)=\"R\",LEFT(A15,LEN(A15)-1),A15),\" Qty \",B15,\" Found \",VLOOKUP(A15,'Finding report'!$B:$F,5,0),\" due to normal wear and tear\"))","v":"CLAMP PN E0043-4B0 Qty 1 Found Broken due to normal wear and tear"}]
{"$rows_left_out":86}
{"sheet":"TCD MM","index":5,"n_rows":27,"n_cols":5,"rows_kept":27}
["Source of default","Misuse/mishandeling"]
["Nature of finding","(Plusieurs éléments)"]
[]
["Étiquettes de lignes","Somme de Qty"]
["(vide)",{"$nulls":3},{"$f":"CONCATENATE(VLOOKUP(A5,'Finding report'!$B:$C,2,0),\" PN \",IF(RIGHT(A5,1)=\"R\",LEFT(A5,LEN(A5)-1),A5),\" Qty \",B5,\" Found \",VLOOKUP(A5,'Finding report'!$B:$F,5,0),\" due to Misuse or mishandeling\")","v":{"$error":"#N/A"}}]
["SB3-070-002-01",1,null,null,{"$f":"CONCATENATE(VLOOKUP(A6,'Finding report'!$B:$C,2,0),\" PN \",IF(RIGHT(A6,1)=\"R\",LEFT(A6,LEN(A6)-1),A6),\" Found \",VLOOKUP(A6,'Finding report'!$B:$F,5,0),\" due to Misuse or mishandeling\")","v":"HEAD LAP BLOCK PN SB3-070-002-01 Found Broken due to Misuse or mishandeling"}]
["Total général",1,null,null,{"$f":"CONCATENATE(VLOOKUP(A7,'Finding report'!$B:$C,2,0),\" PN \",IF(RIGHT(A7,1)=\"R\",LEFT(A7,LEN(A7)-1),A7),\" Found \",VLOOKUP(A7,'Finding report'!$B:$F,5,0),\" due to Misuse or mishandeling\")","v":{"$error":"#N/A"}}]
[{"$nulls":4},{"$f":"CONCATENATE(VLOOKUP(A8,'Finding report'!$B:$C,2,0),\" PN \",IF(RIGHT(A8,1)=\"R\",LEFT(A8,LEN(A8)-1),A8),\" Found \",VLOOKUP(A8,'Finding report'!$B:$F,5,0),\" due to Misuse or mishandeling\")","v":{"$error":"#N/A"}}]
[{"$nulls":4},{"$f":"CONCATENATE(VLOOKUP(A9,'Finding report'!$B:$C,2,0),\" PN \",IF(RIGHT(A9,1)=\"R\",LEFT(A9,LEN(A9)-1),A9),\" Found \",VLOOKUP(A9,'Finding report'!$B:$F,5,0),\" due to Misuse or mishandeling\")","v":{"$error":"#N/A"}}]
[{"$nulls":4},{"$f":"CONCATENATE(VLOOKUP(A10,'Finding report'!$B:$C,2,0),\" PN \",IF(RIGHT(A10,1)=\"R\",LEFT(A10,LEN(A10)-1),A10),\" Found \",VLOOKUP(A10,'Finding report'!$B:$F,5,0),\" due to Misuse or mishandeling\")","v":{"$error":"#N/A"}}]
[{"$nulls":4},{"$f":"CONCATENATE(VLOOKUP(A11,'Finding report'!$B:$C,2,0),\" PN \",IF(RIGHT(A11,1)=\"R\",LEFT(A11,LEN(A11)-1),A11),\" Found \",VLOOKUP(A11,'Finding report'!$B:$F,5,0),\" due to Misuse or mishandeling\")","v":{"$error":"#N/A"}}]
[{"$nulls":4},{"$f":"CONCATENATE(VLOOKUP(A12,'Finding report'!$B:$C,2,0),\" PN \",IF(RIGHT(A12,1)=\"R\",LEFT(A12,LEN(A12)-1),A12),\" Found \",VLOOKUP(A12,'Finding report'!$B:$F,5,0),\" due to Misuse or mishandeling\")","v":{"$error":"#N/A"}}]
[{"$nulls":4},{"$f":"CONCATENATE(VLOOKUP(A13,'Finding report'!$B:$C,2,0),\" PN \",IF(RIGHT(A13,1)=\"R\",LEFT(A13,LEN(A13)-1),A13),\" Found \",VLOOKUP(A13,'Finding report'!$B:$F,5,0),\" due to Misuse or mishandeling\")","v":{"$error":"#N/A"}}]
[{"$nulls":4},{"$f":"CONCATENATE(VLOOKUP(A14,'Finding report'!$B:$C,2,0),\" PN \",IF(RIGHT(A14,1)=\"R\",LEFT(A14,LEN(A14)-1),A14),\" Found \",VLOOKUP(A14,'Finding report'!$B:$F,5,0),\" due to Misuse or mishandeling\")","v":{"$error":"#N/A"}}]
[{"$nulls":4},{"$f":"CONCATENATE(VLOOKUP(A15,'Finding report'!$B:$C,2,0),\" PN \",IF(RIGHT(A15,1)=\"R\",LEFT(A15,LEN(A15)-1),A15),\" Found \",VLOOKUP(A15,'Finding report'!$B:$F,5,0),\" due to Misuse or mishandeling\")","v":{"$error":"#N/A"}}]
{"$rows_left_out":13}
{"sheet":"TCD Missing","index":6,"n_rows":123,"n_cols":5,"rows_kept":123}
["Nature of finding","Missing"]
[]
["Étiquettes de lignes","Somme de Qty"]
["(vide)",{"$nulls":3},{"$f":"CONCATENATE(VLOOKUP(A4,'Finding report'!$B:$C,2,0),\" PN \",IF(RIGHT(A4,1)=\"R\",LEFT(A4,LEN(A4)-1),A4),\" Qty \",SUMIF('Finding report'!$B:$B,A4,'Finding report'!D:D),\" Found missing\")","v":{"$error":"#N/A"}}]
["8526-1348",4,null,null,{"$f":"CONCATENATE(VLOOKUP(A5,'Finding report'!$B:$C,2,0),\" PN \",IF(RIGHT(A5,1)=\"R\",LEFT(A5,LEN(A5)-1),A5),\" Qty \",SUMIF('Finding report'!$B:$B,A5,'Finding report'!D:D),\" Found missing\")","v":"CONTACT PN 8526-1348 Qty 7 Found missing"}]
["NYC0S0L4",2,null,null,{"$f":"CONCATENATE(VLOOKUP(A6,'Finding report'!$B:$C,2,0),\" PN \",IF(RIGHT(A6,1)=\"R\",LEFT(A6,LEN(A6)-1),A6),\" Qty \",SUMIF('Finding report'!$B:$B,A6,'Finding report'!D:D),\" Found missing\")","v":"SOLVANT PN NYC0S0L4 Qty 2 Found missing"}]
["Total général",6,null,null,{"$f":"CONCATENATE(VLOOKUP(A7,'Finding report'!$B:$C,2,0),\" PN \",IF(RIGHT(A7,1)=\"R\",LEFT(A7,LEN(A7)-1),A7),\" Qty \",SUMIF('Finding report'!$B:$B,A7,'Finding report'!D:D),\" Found missing\")","v":{"$error":"#N/A"}}]
[{"$nulls":4},{"$f":"CONCATENATE(VLOOKUP(A8,'Finding report'!$B:$C,2,0),\" PN \",IF(RIGHT(A8,1)=\"R\",LEFT(A8,LEN(A8)-1),A8),\" Qty \",SUMIF('Finding report'!$B:$B,A8,'Finding report'!D:D),\" Found missing\")","v":{"$error":"#N/A"}}]
[{"$nulls":4},{"$f":"CONCATENATE(VLOOKUP(A9,'Finding report'!$B:$C,2,0),\" PN \",IF(RIGHT(A9,1)=\"R\",LEFT(A9,LEN(A9)-1),A9),\" Qty \",SUMIF('Finding report'!$B:$B,A9,'Finding report'!D:D),\" Found missing\")","v":{"$error":"#N/A"}}]
[{"$nulls":4},{"$f":"CONCATENATE(VLOOKUP(A10,'Finding report'!$B:$C,2,0),\" PN \",IF(RIGHT(A10,1)=\"R\",LEFT(A10,LEN(A10)-1),A10),\" Qty \",SUMIF('Finding report'!$B:$B,A10,'Finding report'!D:D),\" Found missing\")","v":{"$error":"#N/A"}}]
[{"$nulls":4},{"$f":"CONCATENATE(VLOOKUP(A11,'Finding report'!$B:$C,2,0),\" PN \",IF(RIGHT(A11,1)=\"R\",LEFT(A11,LEN(A11)-1),A11),\" Qty \",SUMIF('Finding report'!$B:$B,A11,'Finding report'!D:D),\" Found missing\")","v":{"$error":"#N/A"}}]
[{"$nulls":4},{"$f":"CONCATENATE(VLOOKUP(A12,'Finding report'!$B:$C,2,0),\" PN \",IF(RIGHT(A12,1)=\"R\",LEFT(A12,LEN(A12)-1),A12),\" Qty \",SUMIF('Finding report'!$B:$B,A12,'Finding report'!D:D),\" Found missing\")","v":{"$error":"#N/A"}}]
[{"$nulls":4},{"$f":"CONCATENATE(VLOOKUP(A13,'Finding report'!$B:$C,2,0),\" PN \",IF(RIGHT(A13,1)=\"R\",LEFT(A13,LEN(A13)-1),A13),\" Qty \",SUMIF('Finding report'!$B:$B,A13,'Finding report'!D:D),\" Found missing\")","v":{"$error":"#N/A"}}]
[{"$nulls":4},{"$f":"CONCATENATE(VLOOKUP(A14,'Finding report'!$B:$C,2,0),\" PN \",IF(RIGHT(A14,1)=\"R\",LEFT(A14,LEN(A14)-1),A14),\" Qty \",SUMIF('Finding report'!$B:$B,A14,'Finding report'!D:D),\" Found missing\")","v":{"$error":"#N/A"}}]
[{"$nulls":4},{"$f":"CONCATENATE(VLOOKUP(A15,'Finding report'!$B:$C,2,0),\" PN \",IF(RIGHT(A15,1)=\"R\",LEFT(A15,LEN(A15)-1),A15),\" Qty \",SUMIF('Finding report'!$B:$B,A15,'Finding report'!D:D),\" Found missing\")","v":{"$error":"#N/A"}}]
{"$rows_left_out":109}
{"sheet":"TCD FOD","index":7,"n_rows":39,"n_cols":5,"rows_kept":39}
["Source of default","FOD"]
["Nature of finding","(Plusieurs éléments)"]
[]
["Étiquettes de lignes","Somme de Qty",null,null,{"$f":"CONCATENATE(VLOOKUP(A4,'Finding report'!$B:$C,2,0),\" PN \",IF(RIGHT(A4,1)=\"R\",LEFT(A4,LEN(A4)-1),A4),\" Found \",VLOOKUP(A4,'Finding report'!$B:$F,5,0),\" due to FOD\")","v":{"$error":"#N/A"}}]
["(vide)",{"$nulls":3},{"$f":"CONCATENATE(VLOOKUP(A5,'Finding report'!$B:$C,2,0),\" PN \",IF(RIGHT(A5,1)=\"R\",LEFT(A5,LEN(A5)-1),A5),\" Found \",VLOOKUP(A5,'Finding report'!$B:$F,5,0),\" due to FOD\")","v":{"$error":"#N/A"}}]
["Total général",{"$nulls":3},{"$f":"CONCATENATE(VLOOKUP(A6,'Finding report'!$B:$C,2,0),\" PN \",IF(RIGHT(A6,1)=\"R\",LEFT(A6,LEN(A6)-1),A6),\" Found \",VLOOKUP(A6,'Finding report'!$B:$F,5,0),\" due to FOD\")","v":{"$error":"#N/A"}}]
[{"$nulls":4},{"$f":"CONCATENATE(VLOOKUP(A7,'Finding report'!$B:$C,2,0),\" PN \",IF(RIGHT(A7,1)=\"R\",LEFT(A7,LEN(A7)-1),A7),\" Found \",VLOOKUP(A7,'Finding report'!$B:$F,5,0),\" due to FOD\")","v":{"$error":"#N/A"}}]
[{"$nulls":4},{"$f":"CONCATENATE(VLOOKUP(A8,'Finding report'!$B:$C,2,0),\" PN \",IF(RIGHT(A8,1)=\"R\",LEFT(A8,LEN(A8)-1),A8),\" Found \",VLOOKUP(A8,'Finding report'!$B:$F,5,0),\" due to FOD\")","v":{"$error":"#N/A"}}]
[{"$nulls":4},{"$f":"CONCATENATE(VLOOKUP(A9,'Finding report'!$B:$C,2,0),\" PN \",IF(RIGHT(A9,1)=\"R\",LEFT(A9,LEN(A9)-1),A9),\" Found \",VLOOKUP(A9,'Finding report'!$B:$F,5,0),\" due to FOD\")","v":{"$error":"#N/A"}}]
[{"$nulls":4},{"$f":"CONCATENATE(VLOOKUP(A10,'Finding report'!$B:$C,2,0),\" PN \",IF(RIGHT(A10,1)=\"R\",LEFT(A10,LEN(A10)-1),A10),\" Found \",VLOOKUP(A10,'Finding report'!$B:$F,5,0),\" due to FOD\")","v":{"$error":"#N/A"}}]
[{"$nulls":4},{"$f":"CONCATENATE(VLOOKUP(A11,'Finding report'!$B:$C,2,0),\" PN \",IF(RIGHT(A11,1)=\"R\",LEFT(A11,LEN(A11)-1),A11),\" Found \",VLOOKUP(A11,'Finding report'!$B:$F,5,0),\" due to FOD\")","v":{"$error":"#N/A"}}]
[{"$nulls":4},{"$f":"CONCATENATE(VLOOKUP(A12,'Finding report'!$B:$C,2,0),\" PN \",IF(RIGHT(A12,1)=\"R\",LEFT(A12,LEN(A12)-1),A12),\" Found \",VLOOKUP(A12,'Finding report'!$B:$F,5,0),\" due to FOD\")","v":{"$error":"#N/A"}}]
[{"$nulls":4},{"$f":"CONCATENATE(VLOOKUP(A13,'Finding report'!$B:$C,2,0),\" PN \",IF(RIGHT(A13,1)=\"R\",LEFT(A13,LEN(A13)-1),A13),\" Found \",VLOOKUP(A13,'Finding report'!$B:$F,5,0),\" due to FOD\")","v":{"$error":"#N/A"}}]
[{"$nulls":4},{"$f":"CONCATENATE(VLOOKUP(A14,'Finding report'!$B:$C,2,0),\" PN \",IF(RIGHT(A14,1)=\"R\",LEFT(A14,LEN(A14)-1),A14),\" Found \",VLOOKUP(A14,'Finding report'!$B:$F,5,0),\" due to FOD\")","v":{"$error":"#N/A"}}]
[{"$nulls":4},{"$f":"CONCATENATE(VLOOKUP(A15,'Finding report'!$B:$C,2,0),\" PN \",IF(RIGHT(A15,1)=\"R\",LEFT(A15,LEN(A15)-1),A15),\" Found \",VLOOKUP(A15,'Finding report'!$B:$F,5,0),\" due to FOD\")","v":{"$error":"#N/A"}}]
{"$rows_left_out":25}
{"sheet":"TCD SUP","index":8,"n_rows":26,"n_cols":5,"rows_kept":26}
["Source of default","SUP"]
[]
["Étiquettes de lignes","Nombre de Qty"]
["E0043-1B0",1,null,null,{"$f":"CONCATENATE(VLOOKUP(A4,'Finding report'!$B:$C,2,0),\" PN \",IF(RIGHT(A4,1)=\"R\",LEFT(A4,LEN(A4)-1),A4),\" Qty \",SUMIF('Finding report'!$B:$B,A4,'Finding report'!D:D),\" Found suspected to be unapproved part\")","v":"E0043-1B0\\COLLIER DE FRETTAGE PN E0043-1B0 Qty 2 Found suspected to be unapproved part"}]
["(vide)",{"$nulls":3},{"$f":"CONCATENATE(VLOOKUP(A5,'Finding report'!$B:$C,2,0),\" PN \",IF(RIGHT(A5,1)=\"R\",LEFT(A5,LEN(A5)-1),A5),\" Qty \",SUMIF('Finding report'!$B:$B,A5,'Finding report'!D:D),\" Found suspected to be unapproved part\")","v":{"$error":"#N/A"}}]
["SB3-070-000-02",1,null,null,{"$f":"CONCATENATE(VLOOKUP(A6,'Finding report'!$B:$C,2,0),\" PN \",IF(RIGHT(A6,1)=\"R\",LEFT(A6,LEN(A6)-1),A6),\" Qty \",SUMIF('Finding report'!$B:$B,A6,'Finding report'!D:D),\" Found suspected to be unapproved part\")","v":"ASSEMBLY PN SB3-070-000-02 Qty 1 Found suspected to be unapproved part"}]
["Total général",2,null,null,{"$f":"CONCATENATE(VLOOKUP(A7,'Finding report'!$B:$C,2,0),\" PN \",IF(RIGHT(A7,1)=\"R\",LEFT(A7,LEN(A7)-1),A7),\" Qty \",SUMIF('Finding report'!$B:$B,A7,'Finding report'!D:D),\" Found suspected to be unapproved part\")","v":{"$error":"#N/A"}}]
[{"$nulls":4},{"$f":"CONCATENATE(VLOOKUP(A8,'Finding report'!$B:$C,2,0),\" PN \",IF(RIGHT(A8,1)=\"R\",LEFT(A8,LEN(A8)-1),A8),\" Qty \",SUMIF('Finding report'!$B:$B,A8,'Finding report'!D:D),\" Found suspected to be unapproved part\")","v":{"$error":"#N/A"}}]
[{"$nulls":4},{"$f":"CONCATENATE(VLOOKUP(A9,'Finding report'!$B:$C,2,0),\" PN \",IF(RIGHT(A9,1)=\"R\",LEFT(A9,LEN(A9)-1),A9),\" Qty \",SUMIF('Finding report'!$B:$B,A9,'Finding report'!D:D),\" Found suspected to be unapproved part\")","v":{"$error":"#N/A"}}]
[{"$nulls":4},{"$f":"CONCATENATE(VLOOKUP(A10,'Finding report'!$B:$C,2,0),\" PN \",IF(RIGHT(A10,1)=\"R\",LEFT(A10,LEN(A10)-1),A10),\" Qty \",SUMIF('Finding report'!$B:$B,A10,'Finding report'!D:D),\" Found suspected to be unapproved part\")","v":{"$error":"#N/A"}}]
[{"$nulls":4},{"$f":"CONCATENATE(VLOOKUP(A11,'Finding report'!$B:$C,2,0),\" PN \",IF(RIGHT(A11,1)=\"R\",LEFT(A11,LEN(A11)-1),A11),\" Qty \",SUMIF('Finding report'!$B:$B,A11,'Finding report'!D:D),\" Found suspected to be unapproved part\")","v":{"$error":"#N/A"}}]
[{"$nulls":4},{"$f":"CONCATENATE(VLOOKUP(A12,'Finding report'!$B:$C,2,0),\" PN \",IF(RIGHT(A12,1)=\"R\",LEFT(A12,LEN(A12)-1),A12),\" Qty \",SUMIF('Finding report'!$B:$B,A12,'Finding report'!D:D),\" Found suspected to be unapproved part\")","v":{"$error":"#N/A"}}]
[{"$nulls":4},{"$f":"CONCATENATE(VLOOKUP(A13,'Finding report'!$B:$C,2,0),\" PN \",IF(RIGHT(A13,1)=\"R\",LEFT(A13,LEN(A13)-1),A13),\" Qty \",SUMIF('Finding report'!$B:$B,A13,'Finding report'!D:D),\" Found suspected to be unapproved part\")","v":{"$error":"#N/A"}}]
[{"$nulls":4},{"$f":"CONCATENATE(VLOOKUP(A14,'Finding report'!$B:$C,2,0),\" PN \",IF(RIGHT(A14,1)=\"R\",LEFT(A14,LEN(A14)-1),A14),\" Qty \",SUMIF('Finding report'!$B:$B,A14,'Finding report'!D:D),\" Found suspected to be unapproved part\")","v":{"$error":"#N/A"}}]
[{"$nulls":4},{"$f":"CONCATENATE(VLOOKUP(A15,'Finding report'!$B:$C,2,0),\" PN \",IF(RIGHT(A15,1)=\"R\",LEFT(A15,LEN(A15)-1),A15),\" Qty \",SUMIF('Finding report'!$B:$B,A15,'Finding report'!D:D),\" Found suspected to be unapproved part\")","v":{"$error":"#N/A"}}]
{"$rows_left_out":11}