{"text_format":"3","workbook":"xlsx","n_sheets":5,"sheets":["Données","Fiche de travail","Rapport","Inspection","Récap"],"not_rendered":{"images":5,"macros":1,"external_links":1,"defined_names":19},"read":"whole","date_system":"1900"}

{"sheet":"Données","index":0,"n_rows":49,"n_cols":18,"rows_kept":49,"hidden":true}
[]
[]
[null,"LD1","LD2","LD3","LD4","LD5","LD6","LD7","LD8","LD9"]
["NF EN ISO 9227",{"$f":"IF(LEN(VLOOKUP(A4,[1]NORMES!$A$2:$Q$2500,6,FALSE))>0,A4&\" -\"&VLOOKUP(A4,[1]NORMES!$A$2:$M$2500,6,FALSE),A4&\" -\"&MID(YEAR(VLOOKUP(A4,[1]NORMES!$A$2:$M$2500,11,FALSE)),1,4))","v":"NF EN ISO 9227 -2017"},60,"Plate rectangulaire ","Nettoyage à l'eau ","Protection des bords au ruban adhésif","Posées sur supports entaillés","Eau déminéralisée\n","Air pulsé","Acier UNS G10080 selon SAE 1008",{"$nulls":5},"Colonne1","Colonne2","Colonne3"]
["ASTM B117",{"$f":"IF(LEN(VLOOKUP(A5,[1]NORMES!$A$2:$Q$2500,6,FALSE))>0,A5&\" -\"&VLOOKUP(A5,[1]NORMES!$A$2:$M$2500,6,FALSE),A5&\" -\"&MID(YEAR(VLOOKUP(A5,[1]NORMES!$A$2:$M$2500,11,FALSE)),1,4))","v":"ASTM B117 -18"},61,"Plate carrée ","Nettoyage à l'éthanol ","Protection des bords à la cire ","Suspendues ",null,"Etuve","Acier CR4 selon l'ISO 3574 ",{"$nulls":5},"Quotidien",24,"Daily"]
[null,null,66,"Plate circulaire","Aucun nettoyage ","Aucune protection des bords",{"$nulls":9},"Hebdomadaire",168]
[null,null,67,{"$nulls":12},"Bi-hebdomadaire",336]
[{"$nulls":15},"Mensuelle",730]
[{"$nulls":15},"Aucune",0]
[{"$nulls":15},"Toutes les 250h",250]
[{"$nulls":15},"Tous les 2jours ",48]
[]
[]
[]
[]
[{"$nulls":3},"Flat & rectangular","Water cleaning","Edges protection with tape",null,"Demineralized water","Pulsed air","UNS G10080 steel acc. to SAE 1008"]
[{"$nulls":3},"Flat & Square","Ethanol cleaning","Edges protection with wax",null,null,"Oven","CR4 steel acc to. ISO 3574"]
[{"$nulls":3},"Flat & round","No cleaning","No edges protection"]
{"$rows_empty":11}
[{"$nulls":11},"Colonne1","Colonne2"]
[{"$nulls":11},"AD","Adrien DULUC"]
[{"$nulls":11},"AE","Aurélien ENCINAS"]
[{"$nulls":11},"CDC","Charlotte DE CAUDRON"]
[{"$nulls":11},"CH","Caroline HOREAU"]
[{"$nulls":11},"GL","Gilles LAINEZ"]
[{"$nulls":11},"GT","Grégory TORRES"]
[{"$nulls":11},"HBE","Henri BIYOGO EDO"]
[{"$nulls":11},"JPS","Jean Pierre SERRES"]
[{"$nulls":11},"JT","Jérôme TRIGAULT"]
[{"$nulls":11},"LP","Laure PEREZ"]
[{"$nulls":11},"MC","Magalie COSTES"]
[{"$nulls":11},"NI","Nathan IGLISIAS"]
[{"$nulls":11},"PB","Pierre BARBAZA"]
[{"$nulls":11},"RSM","Rémy SAINT MAXENT"]
[{"$nulls":11},"SP","Sully PAYET"]
[{"$nulls":11},"TG","Tony GUIDO"]
[{"$nulls":11},"VB","Vincent BERARD"]
[{"$nulls":11},"WD","William DEPENNE"]
[{"$nulls":11},"YD","Yves EDMOND"]

{"sheet":"Fiche de travail","index":1,"n_rows":41,"n_cols":45,"rows_kept":41,"merged":[[0,0,4,5],[0,6,0,26],[0,27,2,30],[0,44,46,44],[1,6,4,21],[1,22,1,26],[2,22,4,26],[3,27,4,30],[5,0,5,29],[6,0,7,2],[6,3,7,10],[6,11,7,18],[6,19,7,25],[6,26,7,31],[8,0,8,30],[9,0,10,4],[9,5,9,11],[9,12,10,19],[9,20,10,21],[9,22,10,26],[9,27,10,31],[10,5,10,11],[11,0,11,1],[11,2,11,4],[11,5,11,11],[11,12,11,20],[11,21,11,27],[11,28,11,31],[12,0,13,9],[12,10,12,18],[12,19,12,25],[12,26,12,31],[13,10,13,18],[13,19,13,25],[13,26,13,30],[14,0,14,10],[14,11,14,17],[14,18,14,27],[14,28,14,31],[15,0,15,5],[15,6,15,11],[15,12,15,18],[15,19,15,31],[16,0,17,5],[16,6,17,11],[16,12,17,18],[16,19,16,31],[17,19,17,30],[18,0,19,4],[18,5,18,11],[18,12,19,14],[18,15,18,20],[18,21,19,23],[18,24,19,31],[19,5,19,11],[19,15,19,19],[20,0,20,30],[21,0,26,1],[21,2,21,17],[21,18,24,21],[21,22,21,31],[22,2,24,5],[22,6,24,9],[22,10,24,13],[22,14,24,17],[22,22,24,24],[22,25,24,27],[22,28,24,31],[25,2,26,5],[25,6,26,9],[25,10,26,13],[25,14,26,17],[25,18,26,21],[25,22,26,24],[25,25,26,27],[25,28,26,31],[27,0,28,5],[27,6,28,9],[27,10,28,15],[27,16,27,23],[27,24,28,27],[27,28,28,31],[28,16,28,23],[29,0,29,31],[30,0,30,1],[30,2,30,6],[30,7,30,30],[31,0,31,1],[31,2,31,6],[31,7,31,30],[32,0,32,1],[32,2,32,6],[32,7,32,30],[33,0,33,30],[40,0,40,31],[41,0,44,30]]}
[{"$nulls":6},"FICHE DE TRAVAIL",{"$nulls":37},{"$f":"(#REF!=\"þ\")*1+(#REF!=\"þ\")*2+(#REF!=\"þ\")*4","v":{"$error":"#REF!"}}]
[{"$nulls":6},"ESSAI DE CORROSION AU BROUILLARD SALIN NEUTRE ",{"$nulls":15},"FICHE N°"]
[]
[{"$nulls":27},"Page 1/1"]
[]
[]
["Norme d'essai :\nTesting standard",{"$nulls":18},"N° de machine :\nTesting machine No"]
[]
[]
["Type d'éprouvettes : \nType of specimens ",{"$nulls":11},"Nombres d'éprouvettes :\nSpecimens number ",{"$nulls":9},"Dimensions (mm) :\nspecimens dimensions"]
[{"$nulls":5},{"$f":"IF(F10=Données!D4,Données!D16,IF('Fiche de travail'!F10=Données!D5,Données!D17,IF('Fiche de travail'!F10=Données!D6,Données!D18,\"\")))","v":""}]
["Substrat :\nSubstrate",{"$nulls":4},"Traitement de surface :\nSurface treatment ",{"$nulls":15},"Aire de surface essayée :\nSurface of the tested area"]
["Préparation des éprouvettes avant essai \nSpecimens preparation before test "]
[{"$nulls":10},{"$f":"IF(K13=Données!E4,Données!E16,IF(K13=Données!E5,Données!E17,IF('Fiche de travail'!K13=Données!E6,Données!E18,\"\")))","v":""},{"$nulls":8},{"$f":"IF(T13=Données!F4,Données!F16,IF('Fiche de travail'!T13=Données!F5,Données!F17,IF('Fiche de travail'!T13=Données!F6,Données!F18,\"\")))","v":""}]
["Disposition des éprouvettes dans  l'enceinte \nSpecimens layout in the cabinet ",{"$nulls":17},"Inclinaison (par rapport à la verticale) :\nTilting angle (from the vertical)"]
["Durée totale de l'essai (h) \nTotal test duration ",{"$nulls":5},"Date de début d'essai \nBeginning of test",{"$nulls":5},"Date de fin d'essai \nEnd of test",{"$nulls":6},"Fréquence d'inspections intermédiaires\nFrequency of intermediate inspections"]
[]
[{"$nulls":19},{"$f":"IFERROR(VLOOKUP(T17,Données!P5:R11,3,FALSE),\"\")","v":""}]
["Nettoyage après essai :\nCleaning after test",{"$nulls":11},"Séchage :\nDrying",{"$nulls":8},"Opérateur :\nOperator"]
[{"$nulls":5},{"$f":"IF('Fiche de travail'!F19=Données!H4,Données!H16,\"\")","v":""},{"$nulls":9},{"$f":"IF(P19=Données!I4,Données!I16,IF('Fiche de travail'!P19=Données!I5,Données!I17,\"\"))","v":""}]
[]
["Conditions d'essais \nConditiond in the chamber",null,"Solution saline\nSalt solution",{"$nulls":15},"Température \nTest temperature \n(°C)",{"$nulls":3},"Solution recueillie \nSalt solution collected"]
[null,null,"Type d'eau\nType of water",{"$nulls":3},"Conductivité eau \nWaters conductivity \n(µS/cm)",{"$nulls":3},"Type de sel / N° de lot \nType of salt/ Batch",{"$nulls":3},"pH de la solution \npH of the salt solution",{"$nulls":7},"Volume recueilli\nCollected volume \n(ml/h)",null,null,"Salinité\nSalt concentration \n(g/l)",null,null,"pH"]
[]
[]
[]
[]
["Contrôle de la corrosivité \nControl of corrosive conditions",{"$nulls":9},"Type d'éprouvettes :\nType of Test panel",{"$nulls":13},"Perte de masse:\nMass loss (g/m²)"]
[{"$nulls":16},{"$f":"IF(Q28=Données!J4,Données!J16,IF('Fiche de travail'!Q28=Données!J5,Données!J17,\"\"))","v":""}]
["Anomalies et interruptions survenues durant l'essais :  Anomalies and interruptions occured during the test "]
["Date \n Date",null,"Durée \n Duration",{"$nulls":4},"Description \n Description"]
[]
[{"$nulls":41}," "]
{"$rows_empty":7}
["Commentaires / Comments :"]

{"sheet":"Rapport","index":2,"n_rows":56,"n_cols":30,"rows_kept":56,"merged":[[0,0,4,5],[0,6,1,20],[0,21,1,23],[0,24,1,25],[0,26,1,26],[0,27,1,30],[2,6,4,24],[2,25,4,30],[6,0,7,2],[6,3,7,10],[6,11,7,18],[6,19,7,25],[6,26,7,30],[9,0,10,4],[9,5,9,11],[9,12,10,19],[9,20,10,21],[9,22,10,27],[9,28,10,30],[10,5,10,11],[11,0,11,1],[11,2,11,4],[11,5,11,11],[11,12,11,20],[11,21,11,27],[11,28,11,30],[12,0,13,9],[12,10,12,18],[12,19,12,25],[12,26,12,30],[13,10,13,18],[13,19,13,25],[13,26,13,30],[14,0,14,10],[14,11,14,17],[14,18,14,27],[14,28,14,30],[15,0,15,5],[15,6,15,11],[15,12,15,18],[15,19,15,30],[16,0,17,5],[16,6,17,11],[16,12,17,18],[16,19,16,30],[17,19,17,30],[18,0,19,4],[18,5,18,11],[18,12,19,14],[18,15,18,20],[18,21,19,23],[18,24,19,30],[19,5,19,11],[19,15,19,20],[21,0,25,1],[21,2,21,17],[21,18,24,21],[21,22,21,30],[22,2,24,5],[22,6,24,9],[22,10,24,13],[22,14,24,17],[22,22,24,24],[22,25,24,27],[22,28,24,30],[25,2,25,5],[25,6,25,9],[25,10,25,13],[25,14,25,17],[25,18,25,21],[25,22,25,24],[25,25,25,27],[25,28,25,30],[26,0,27,5],[26,6,27,9],[26,10,27,15],[26,16,26,23],[26,24,27,28],[26,29,27,30],[27,16,27,23],[28,0,28,30],[29,0,29,1],[29,2,29,4],[29,5,29,30],[30,0,30,1],[30,2,30,4],[30,5,30,30],[31,0,31,1],[31,2,31,4],[31,5,31,30],[45,0,46,3],[45,4,45,20],[45,21,46,24],[45,25,46,30],[46,4,46,12],[46,13,46,20],[47,0,47,3],[47,4,47,12],[47,13,47,20],[47,21,47,24],[47,25,47,30],[48,0,48,3],[48,4,48,12],[48,13,48,20],[48,21,48,24],[48,25,48,30],[49,0,49,3],[49,4,49,12],[49,13,49,20],[49,21,49,24],[49,25,49,30],[50,0,50,3],[50,4,50,12],[50,13,50,20],[50,21,50,24],[50,25,50,30],[51,0,51,3],[51,4,51,12],[51,13,51,20],[51,21,51,24],[51,25,51,30],[52,0,52,3],[52,4,52,12],[52,13,52,20],[52,21,52,24],[52,25,52,30],[54,0,54,30],[55,0,57,30]]}
[{"$nulls":6},"RAPPORT D'ESSAIS N° \nTESTING REPORT ",{"$nulls":14},{"$f":"'Fiche de travail'!W3","v":0},null,null,"Rév\nIssu",null,"θ","Page 1/1"]
[]
[{"$nulls":6},"ESSAI DE CORROSION AU BROUILLARD SALIN NEUTRE \nNEUTRAL SALT SPRAY CORROSION TEST "]
[]
[]
[]
["Norme d'essai :\nTesting standard",null,null,{"$f":"'Fiche de travail'!D7","v":0},{"$nulls":7},{"$f":"'Fiche de travail'!L7","v":0},{"$nulls":7},"N° de machine :\nTesting machine No",{"$nulls":6},{"$f":"'Fiche de travail'!AA7","v":0}]
[]
[]
["Type d'éprouvettes : \nType of speciemens ",{"$nulls":4},{"$f":"'Fiche de travail'!F10","v":0},{"$nulls":6},"Nombres d'éprouvettes :\nSpecimens number ",{"$nulls":7},{"$f":"'Fiche de travail'!U10","v":0},null,"Dimensions (mm) :\nspecimens dimensions",{"$nulls":5},{"$f":"'Fiche de travail'!AC10","v":0}]
[{"$nulls":5},{"$f":"'Fiche de travail'!F11","v":""}]
["Substrat :\nSubstrate",null,{"$f":"'Fiche de travail'!C12","v":0},null,null,"Traitement de surface :\nSurface treatment ",{"$nulls":6},{"$f":"'Fiche de travail'!M12","v":0},{"$nulls":8},"Aire de surface essayée :\nSurface of the tested area",{"$nulls":6},{"$f":"'Fiche de travail'!AC12","v":0}]
["Préparation des éprouvettes avant essai :\nSpecimens preparation before test ",{"$nulls":9},{"$f":"'Fiche de travail'!K13","v":0},{"$nulls":8},{"$f":"'Fiche de travail'!T13","v":0},{"$nulls":6},{"$f":"'Fiche de travail'!AA13","v":0}]
[{"$nulls":10},{"$f":"'Fiche de travail'!K14","v":""},{"$nulls":8},{"$f":"'Fiche de travail'!T14","v":""}]
["Disposition des éprouvettes dans  l'enceinte :\nSpecimens layout in the cabinet ",{"$nulls":10},{"$f":"'Fiche de travail'!L15","v":0},{"$nulls":6},"Inclinaison (par rapport à la verticale) :\nTilting angle (from the vertical)",{"$nulls":9},{"$f":"'Fiche de travail'!AC15","v":0}]
["Durée totale de l'essai (h) :\nTotal test duration ",{"$nulls":5},"Date de début d'essai \nBeginning of test",{"$nulls":5},"Date de fin d'essai \nEnd of test",{"$nulls":6},"Fréquence d'inspections intermédiaires\nFrequency of intermediate inspections"]
[{"$f":"'Fiche de travail'!A17","v":0},{"$nulls":5},{"$f":"'Fiche de travail'!G17","v":"00:00:00"},{"$nulls":5},{"$f":"'Fiche de travail'!M17","v":"00:00:00"},{"$nulls":6},{"$f":"'Fiche de travail'!T17","v":0}]
[{"$nulls":19},{"$f":"'Fiche de travail'!T18","v":""}]
["Nettoyage après essai :\nCleaning after test",{"$nulls":4},{"$f":"'Fiche de travail'!F19","v":0},{"$nulls":6},"Séchage :\nDrying",null,null,{"$f":"'Fiche de travail'!P19","v":0},{"$nulls":5},"Opérateur :\nOperator",null,null,{"$f":"'Fiche de travail'!Y19","v":0}]
[{"$nulls":5},{"$f":"'Fiche de travail'!F20","v":""},{"$nulls":9},{"$f":"'Fiche de travail'!P20","v":""}]
[]
["Conditions d'essais \nConditiond in the chamber",null,"Solution saline    \nSalt solution",{"$nulls":15},"Température \nTest temperature \n(°C)",{"$nulls":3},"Solution recueillie \nSalt solution collected"]
[null,null,"Type d'eau\nType of water",{"$nulls":3},"Conductivité eau \nWaters conductivity \n(µS/cm)",{"$nulls":3},"Type de sel / N° de lot \nType of salt/ Batch",{"$nulls":3},"pH de la solution \npH of the salt solution",{"$nulls":7},"Volume recueilli\nCollected volume \n(ml/h)",null,null,"Salinité\nSalt concentration \n(g/l)",null,null,"pH"]
[]
[]
[null,null,{"$f":"'Fiche de travail'!C26","v":0},{"$nulls":3},{"$f":"'Fiche de travail'!G26","v":0},{"$nulls":3},{"$f":"'Fiche de travail'!K26","v":0},{"$nulls":3},{"$f":"'Fiche de travail'!O26","v":0},{"$nulls":3},{"$f":"'Fiche de travail'!S26","v":0},{"$nulls":3},{"$f":"'Fiche de travail'!W26","v":0},null,null,{"$f":"'Fiche de travail'!Z26","v":0},null,null,{"$f":"'Fiche de travail'!AC26","v":0}]
["Contrôle de la corrosivité :\nControl of corrosive conditions",{"$nulls":5},{"$f":"'Fiche de travail'!G28","v":0},{"$nulls":3},"Type d'éprouvettes :\nType of Test panel",{"$nulls":5},{"$f":"'Fiche de travail'!Q28","v":0},{"$nulls":7},"Perte de masse:\nMass loss (g/m²)",{"$nulls":4},{"$f":"'Fiche de travail'!AC28","v":0}]
[{"$nulls":16},{"$f":"'Fiche de travail'!Q29","v":""}]
["Anomalies et interruptions survenues durant l'essais :  Anomalies and interruptions occured during the test "]
["Date \nDate",null,"Durée\nDuration",null,null,"Description\nDescription"]
[{"$f":"'Fiche de travail'!A32","v":"00:00:00"},null,{"$f":"'Fiche de travail'!C32","v":0},null,null,{"$f":"'Fiche de travail'!F32","v":0}]
[{"$f":"'Fiche de travail'!A33","v":"00:00:00"},null,{"$f":"'Fiche de travail'!C33","v":0},null,null,{"$f":"'Fiche de travail'!F33","v":0}]
{"$rows_empty":13}
["Repère éprouvette\nSpecimens reference",{"$nulls":3},"Résultat des inspections - Results of inspections",{"$nulls":16},"Critère\nCriteria",{"$nulls":3},"Sanction \nCompliancy"]
[{"$nulls":4},"Intermédiaires  Intermediate",{"$nulls":8},"Finale  Final"]
{"$rows_empty":7}
["Commentaires / Comments :"]
[{"$f":"'Fiche de travail'!A42","v":0}]

{"sheet":"Inspection","index":3,"n_rows":1047,"n_cols":10,"rows_kept":1047,"merged":[[0,0,4,1],[0,2,0,5],[0,6,2,7],[1,2,4,4],[2,5,4,5],[3,6,4,7],[5,0,5,1]]}
[null,null,"FICHE DE TRAVAIL",{"$nulls":3},"FOM 042\nIndice 0\n(num)",null,null,{"$f":"VLOOKUP('Fiche de travail'!T17,Tableau4[],2,FALSE)","v":{"$error":"#N/A"}}]
[null,null,"Essai de corrosion au brouillard salin neutre",null,null,"FICHE N°",{"$nulls":3},{"$f":"J1+$J$1","v":{"$error":"#N/A"}}]
[{"$nulls":5},{"$f":"'Fiche de travail'!W3","v":0},{"$nulls":3},{"$f":"J2+$J$1","v":{"$error":"#N/A"}}]
[{"$nulls":6},"Page 1/1",null,null,{"$error":"#N/A"}]
[{"$nulls":9},{"$error":"#N/A"}]
["Opérateur : ",null,null,{"$f":"'Fiche de travail'!Y19","v":0},"Visa : ",{"$nulls":4},{"$f":"J5+$J$1","v":{"$error":"#N/A"}}]
[{"$nulls":9},{"$f":"J6+$J$1","v":{"$error":"#N/A"}}]
["N°","Repère éprouvette","Contrôle","Intermédiaires  ","Finale ","Critère","Sanction ","Rapport",null,{"$error":"#N/A"}]
[1,null,{"$f":"IFERROR(IF(J1<='Fiche de travail'!$A$17,J1,IF(OR(C8=\"\",C8='Fiche de travail'!$A$17),\"\",'Fiche de travail'!$A$17)),\"\")","v":""},{"$nulls":6},{"$error":"#N/A"}]
[2,null,{"$f":"IFERROR(IF(J2<='Fiche de travail'!$A$17,J2,IF(OR(C9=\"\",C9='Fiche de travail'!$A$17),\"\",'Fiche de travail'!$A$17)),\"\")","v":""},{"$nulls":6},{"$error":"#N/A"}]
[3,null,{"$f":"IFERROR(IF(J3<='Fiche de travail'!$A$17,J3,IF(OR(C10=\"\",C10='Fiche de travail'!$A$17),\"\",'Fiche de travail'!$A$17)),\"\")","v":""},{"$nulls":6},{"$error":"#N/A"}]
[4,null,{"$f":"IFERROR(IF(J4<='Fiche de travail'!$A$17,J4,IF(OR(C11=\"\",C11='Fiche de travail'!$A$17),\"\",'Fiche de travail'!$A$17)),\"\")","v":""},{"$nulls":6},{"$error":"#N/A"}]
[5,null,{"$f":"IFERROR(IF(J5<='Fiche de travail'!$A$17,J5,IF(OR(C12=\"\",C12='Fiche de travail'!$A$17),\"\",'Fiche de travail'!$A$17)),\"\")","v":""},{"$nulls":6},{"$error":"#N/A"}]
[6,null,{"$f":"IFERROR(IF(J6<='Fiche de travail'!$A$17,J6,IF(OR(C13=\"\",C13='Fiche de travail'!$A$17),\"\",'Fiche de travail'!$A$17)),\"\")","v":""},{"$nulls":6},{"$error":"#N/A"}]
[7,null,{"$f":"IFERROR(IF(J7<='Fiche de travail'!$A$17,J7,IF(OR(C14=\"\",C14='Fiche de travail'!$A$17),\"\",'Fiche de travail'!$A$17)),\"\")","v":""},{"$nulls":6},{"$error":"#N/A"}]
[8,null,{"$f":"IFERROR(IF(J8<='Fiche de travail'!$A$17,J8,IF(OR(C15=\"\",C15='Fiche de travail'!$A$17),\"\",'Fiche de travail'!$A$17)),\"\")","v":""},{"$nulls":6},{"$error":"#N/A"}]
[9,null,{"$f":"IFERROR(IF(J9<='Fiche de travail'!$A$17,J9,IF(OR(C16=\"\",C16='Fiche de travail'!$A$17),\"\",'Fiche de travail'!$A$17)),\"\")","v":""},{"$nulls":6},{"$error":"#N/A"}]
[10,null,{"$f":"IFERROR(IF(J10<='Fiche de travail'!$A$17,J10,IF(OR(C17=\"\",C17='Fiche de travail'!$A$17),\"\",'Fiche de travail'!$A$17)),\"\")","v":""},{"$nulls":6},{"$error":"#N/A"}]
[11,null,{"$f":"IFERROR(IF(J11<='Fiche de travail'!$A$17,J11,IF(OR(C18=\"\",C18='Fiche de travail'!$A$17),\"\",'Fiche de travail'!$A$17)),\"\")","v":""},{"$nulls":6},{"$error":"#N/A"}]
[12,null,{"$f":"IFERROR(IF(J12<='Fiche de travail'!$A$17,J12,IF(OR(C19=\"\",C19='Fiche de travail'!$A$17),\"\",'Fiche de travail'!$A$17)),\"\")","v":""},{"$nulls":6},{"$error":"#N/A"}]
[13,null,{"$f":"IFERROR(IF(J13<='Fiche de travail'!$A$17,J13,IF(OR(C20=\"\",C20='Fiche de travail'!$A$17),\"\",'Fiche de travail'!$A$17)),\"\")","v":""},{"$nulls":6},{"$error":"#N/A"}]
[14,null,{"$f":"IFERROR(IF(J14<='Fiche de travail'!$A$17,J14,IF(OR(C21=\"\",C21='Fiche de travail'!$A$17),\"\",'Fiche de travail'!$A$17)),\"\")","v":""},{"$nulls":6},{"$error":"#N/A"}]
[15,null,{"$f":"IFERROR(IF(J15<='Fiche de travail'!$A$17,J15,IF(OR(C22=\"\",C22='Fiche de travail'!$A$17),\"\",'Fiche de travail'!$A$17)),\"\")","v":""},{"$nulls":6},{"$error":"#N/A"}]
[16,null,{"$f":"IFERROR(IF(J16<='Fiche de travail'!$A$17,J16,IF(OR(C23=\"\",C23='Fiche de travail'!$A$17),\"\",'Fiche de travail'!$A$17)),\"\")","v":""},{"$nulls":6},{"$error":"#N/A"}]
[17,null,{"$f":"IFERROR(IF(J17<='Fiche de travail'!$A$17,J17,IF(OR(C24=\"\",C24='Fiche de travail'!$A$17),\"\",'Fiche de travail'!$A$17)),\"\")","v":""},{"$nulls":6},{"$error":"#N/A"}]
[18,null,{"$f":"IFERROR(IF(J18<='Fiche de travail'!$A$17,J18,IF(OR(C25=\"\",C25='Fiche de travail'!$A$17),\"\",'Fiche de travail'!$A$17)),\"\")","v":""},{"$nulls":6},{"$error":"#N/A"}]
[19,null,{"$f":"IFERROR(IF(J19<='Fiche de travail'!$A$17,J19,IF(OR(C26=\"\",C26='Fiche de travail'!$A$17),\"\",'Fiche de travail'!$A$17)),\"\")","v":""},{"$nulls":6},{"$error":"#N/A"}]
[20,null,{"$f":"IFERROR(IF(J20<='Fiche de travail'!$A$17,J20,IF(OR(C27=\"\",C27='Fiche de travail'!$A$17),\"\",'Fiche de travail'!$A$17)),\"\")","v":""},{"$nulls":6},{"$error":"#N/A"}]
[21,null,{"$f":"IFERROR(IF(J21<='Fiche de travail'!$A$17,J21,IF(OR(C28=\"\",C28='Fiche de travail'!$A$17),\"\",'Fiche de travail'!$A$17)),\"\")","v":""},{"$nulls":6},{"$error":"#N/A"}]
[22,null,{"$f":"IFERROR(IF(J22<='Fiche de travail'!$A$17,J22,IF(OR(C29=\"\",C29='Fiche de travail'!$A$17),\"\",'Fiche de travail'!$A$17)),\"\")","v":""},{"$nulls":6},{"$error":"#N/A"}]
[23,null,{"$f":"IFERROR(IF(J23<='Fiche de travail'!$A$17,J23,IF(OR(C30=\"\",C30='Fiche de travail'!$A$17),\"\",'Fiche de travail'!$A$17)),\"\")","v":""},{"$nulls":6},{"$error":"#N/A"}]
[24,null,{"$f":"IFERROR(IF(J24<='Fiche de travail'!$A$17,J24,IF(OR(C31=\"\",C31='Fiche de travail'!$A$17),\"\",'Fiche de travail'!$A$17)),\"\")","v":""},{"$nulls":6},{"$error":"#N/A"}]
[25,null,{"$f":"IFERROR(IF(J25<='Fiche de travail'!$A$17,J25,IF(OR(C32=\"\",C32='Fiche de travail'!$A$17),\"\",'Fiche de travail'!$A$17)),\"\")","v":""},{"$nulls":6},{"$error":"#N/A"}]
[26,null,{"$f":"IFERROR(IF(J26<='Fiche de travail'!$A$17,J26,IF(OR(C33=\"\",C33='Fiche de travail'!$A$17),\"\",'Fiche de travail'!$A$17)),\"\")","v":""},{"$nulls":6},{"$error":"#N/A"}]
[27,null,{"$f":"IFERROR(IF(J27<='Fiche de travail'!$A$17,J27,IF(OR(C34=\"\",C34='Fiche de travail'!$A$17),\"\",'Fiche de travail'!$A$17)),\"\")","v":""},{"$nulls":6},{"$error":"#N/A"}]
[28,null,{"$f":"IFERROR(IF(J28<='Fiche de travail'!$A$17,J28,IF(OR(C35=\"\",C35='Fiche de travail'!$A$17),\"\",'Fiche de travail'!$A$17)),\"\")","v":""},{"$nulls":6},{"$error":"#N/A"}]
[29,null,{"$f":"IFERROR(IF(J29<='Fiche de travail'!$A$17,J29,IF(OR(C36=\"\",C36='Fiche de travail'!$A$17),\"\",'Fiche de travail'!$A$17)),\"\")","v":""},{"$nulls":6},{"$error":"#N/A"}]
[30,null,{"$f":"IFERROR(IF(J30<='Fiche de travail'!$A$17,J30,IF(OR(C37=\"\",C37='Fiche de travail'!$A$17),\"\",'Fiche de travail'!$A$17)),\"\")","v":""},{"$nulls":6},{"$error":"#N/A"}]
[31,null,{"$f":"IFERROR(IF(J31<='Fiche de travail'!$A$17,J31,IF(OR(C38=\"\",C38='Fiche de travail'!$A$17),\"\",'Fiche de travail'!$A$17)),\"\")","v":""},{"$nulls":6},{"$error":"#N/A"}]
[32,null,{"$f":"IFERROR(IF(J32<='Fiche de travail'!$A$17,J32,IF(OR(C39=\"\",C39='Fiche de travail'!$A$17),\"\",'Fiche de travail'!$A$17)),\"\")","v":""},{"$nulls":6},{"$error":"#N/A"}]
[33,null,{"$f":"IFERROR(IF(J33<='Fiche de travail'!$A$17,J33,IF(OR(C40=\"\",C40='Fiche de travail'!$A$17),\"\",'Fiche de travail'!$A$17)),\"\")","v":""},{"$nulls":6},{"$error":"#N/A"}]
[34,null,{"$f":"IFERROR(IF(J34<='Fiche de travail'!$A$17,J34,IF(OR(C41=\"\",C41='Fiche de travail'!$A$17),\"\",'Fiche de travail'!$A$17)),\"\")","v":""},{"$nulls":6},{"$error":"#N/A"}]
[35,null,{"$f":"IFERROR(IF(J35<='Fiche de travail'!$A$17,J35,IF(OR(C42=\"\",C42='Fiche de travail'!$A$17),\"\",'Fiche de travail'!$A$17)),\"\")","v":""},{"$nulls":6},{"$error":"#N/A"}]
[36,null,{"$f":"IFERROR(IF(J36<='Fiche de travail'!$A$17,J36,IF(OR(C43=\"\",C43='Fiche de travail'!$A$17),\"\",'Fiche de travail'!$A$17)),\"\")","v":""},{"$nulls":6},{"$error":"#N/A"}]
[37,null,{"$f":"IFERROR(IF(J37<='Fiche de travail'!$A$17,J37,IF(OR(C44=\"\",C44='Fiche de travail'!$A$17),\"\",'Fiche de travail'!$A$17)),\"\")","v":""},{"$nulls":6},{"$error":"#N/A"}]
[38,null,{"$f":"IFERROR(IF(J38<='Fiche de travail'!$A$17,J38,IF(OR(C45=\"\",C45='Fiche de travail'!$A$17),\"\",'Fiche de travail'!$A$17)),\"\")","v":""},{"$nulls":6},{"$error":"#N/A"}]
[39,null,{"$f":"IFERROR(IF(J39<='Fiche de travail'!$A$17,J39,IF(OR(C46=\"\",C46='Fiche de travail'!$A$17),\"\",'Fiche de travail'!$A$17)),\"\")","v":""},{"$nulls":6},{"$error":"#N/A"}]
[40,null,{"$f":"IFERROR(IF(J40<='Fiche de travail'!$A$17,J40,IF(OR(C47=\"\",C47='Fiche de travail'!$A$17),\"\",'Fiche de travail'!$A$17)),\"\")","v":""},{"$nulls":6},{"$error":"#N/A"}]
[41,null,{"$f":"IFERROR(IF(J41<='Fiche de travail'!$A$17,J41,IF(OR(C48=\"\",C48='Fiche de travail'!$A$17),\"\",'Fiche de travail'!$A$17)),\"\")","v":""},{"$nulls":6},{"$error":"#N/A"}]
[42,null,{"$f":"IFERROR(IF(J42<='Fiche de travail'!$A$17,J42,IF(OR(C49=\"\",C49='Fiche de travail'!$A$17),\"\",'Fiche de travail'!$A$17)),\"\")","v":""},{"$nulls":6},{"$error":"#N/A"}]
[43,null,{"$f":"IFERROR(IF(J43<='Fiche de travail'!$A$17,J43,IF(OR(C50=\"\",C50='Fiche de travail'!$A$17),\"\",'Fiche de travail'!$A$17)),\"\")","v":""},{"$nulls":6},{"$error":"#N/A"}]
[44,null,{"$f":"IFERROR(IF(J44<='Fiche de travail'!$A$17,J44,IF(OR(C51=\"\",C51='Fiche de travail'!$A$17),\"\",'Fiche de travail'!$A$17)),\"\")","v":""},{"$nulls":6},{"$error":"#N/A"}]
[45,null,{"$f":"IFERROR(IF(J45<='Fiche de travail'!$A$17,J45,IF(OR(C52=\"\",C52='Fiche de travail'!$A$17),\"\",'Fiche de travail'!$A$17)),\"\")","v":""},{"$nulls":6},{"$error":"#N/A"}]
[46,null,{"$f":"IFERROR(IF(J46<='Fiche de travail'!$A$17,J46,IF(OR(C53=\"\",C53='Fiche de travail'!$A$17),\"\",'Fiche de travail'!$A$17)),\"\")","v":""},{"$nulls":6},{"$error":"#N/A"}]
[47,null,{"$f":"IFERROR(IF(J47<='Fiche de travail'!$A$17,J47,IF(OR(C54=\"\",C54='Fiche de travail'!$A$17),\"\",'Fiche de travail'!$A$17)),\"\")","v":""},{"$nulls":6},{"$error":"#N/A"}]
[48,null,{"$f":"IFERROR(IF(J48<='Fiche de travail'!$A$17,J48,IF(OR(C55=\"\",C55='Fiche de travail'!$A$17),\"\",'Fiche de travail'!$A$17)),\"\")","v":""},{"$nulls":6},{"$error":"#N/A"}]
[49,null,{"$f":"IFERROR(IF(J49<='Fiche de travail'!$A$17,J49,IF(OR(C56=\"\",C56='Fiche de travail'!$A$17),\"\",'Fiche de travail'!$A$17)),\"\")","v":""},{"$nulls":6},{"$error":"#N/A"}]
[50,null,{"$f":"IFERROR(IF(J50<='Fiche de travail'!$A$17,J50,IF(OR(C57=\"\",C57='Fiche de travail'!$A$17),\"\",'Fiche de travail'!$A$17)),\"\")","v":""},{"$nulls":6},{"$error":"#N/A"}]
[51,null,{"$f":"IFERROR(IF(J51<='Fiche de travail'!$A$17,J51,IF(OR(C58=\"\",C58='Fiche de travail'!$A$17),\"\",'Fiche de travail'!$A$17)),\"\")","v":""},{"$nulls":6},{"$error":"#N/A"}]
[52,null,{"$f":"IFERROR(IF(J52<='Fiche de travail'!$A$17,J52,IF(OR(C59=\"\",C59='Fiche de travail'!$A$17),\"\",'Fiche de travail'!$A$17)),\"\")","v":""},{"$nulls":6},{"$error":"#N/A"}]
{"$rows_left_out":988}
{"sheet":"Récap","index":4,"n_rows":2,"n_cols":10,"rows_kept":2}
[{"$nulls":9},{"$f":"#REF!+$J$1","v":{"$error":"#N/A"}}]
[{"$nulls":9},{"$f":"J1+$J$1","v":{"$error":"#N/A"}}]